{
    "email": "keith.wooldridge+rubiqon.uw.qa@qomplx.com",
    "password": "kang3ti4solt@LUSK",
    "priviliges": [
        {
            "Ratings Tool": {
                "buttons": [
                    "NEW Submission"
                ],
                "tabs": [
                    "Extraction",
                    "Quotes"
                ]
            }
        },
        {
            "Modeling Review": {
                "tabs": [
                    "Overview",
                    "Cyber Risk Analysis",
                    "Threat Asset Summary",
                    "Simulation Output",
                    "Pricing Summary",
                    "Portfolio Impact",
                    "Decision Log"
                ]
            }
        }
    ],
    "non_priviliges": [
        "My Submissions"
    ]
}