{
  "counties": [
    {
      "name": "Russia",
      "cities": [
        "Spb",
        "Moscow",
        "Novgorod"
      ]
    },
    {
      "name": "China",
      "cities": [
        "Pekin",
        "Honghong",
        "Urumchi"
      ]
    }
  ],
  "cities": [
    {
      "name": "Spb",
      "country": "Russia",
      "Hotels": [
        "Astorya",
        "Angliter"
      ]
    },
    {
      "name": "Moscow",
      "country": "Russia",
      "Hotels": [
        "President",
        "Liningrad"
      ]
    },
    {
      "name": "Novgorod",
      "country": "Russia",
      "Hotels": [
        "Imperial"
      ]
    },
    {
      "name": "Pekin",
      "country": "China",
      "Hotels": [
        "Chao 1"
      ]
    },
    {
      "name": "Honghong",
      "country": "China",
      "Hotels": [
        "Ochi 2",
        "Yoshi 3"
      ]
    },
    {
      "name": "Urumchi",
      "country": "China",
      "Hotels": [
        "Huro 4"
      ]
    }
  ],
  "hotels": [
    {
      "name": "Astorya",
      "city": "Spb"
    },
    {
      "name": "Angliter",
      "city": "Spb"
    },
    {
      "name": "President",
      "city": "Moscow"
    },
    {
      "name": "Liningrad",
      "city": "Moscow"
    },
    {
      "name": "Imperial",
      "city": "Novgorod"
    },
    {
      "name": "Chao 1",
      "city": "Pekin"
    },
    {
      "name": "Ochi 2",
      "city": "Honghong"
    },
    {
      "name": "Yoshi 3",
      "city": "Honghong"
    },
    {
      "name": "Huro 4",
      "city": "Urumchi"
    }
  ],
  "Users": [
    {
      "name": "Vasiliy Petrov",
      "city": "Spb"
    },
    {
      "name": "Anton Chehov",
      "city": "Novgorod"
    },
    {
      "name": "Chao Bao",
      "city": "Pekin"
    }
  ],
  "tourProviders": [
    {
      "name": "Grang Russia",
      "cities": [
        "Spb",
        "Moscow",
        "Novgorod"
      ]
    },
    {
      "name": "Grang China",
      "cities": [
        "Pekin",
        "Honghong",
        "Urumchi"
      ]
    }
  ]
}
