{
  "countyes": [
    {
      "name": "Russia",
      "cities": [
        {
          "name": "Spb"
        },
        {
          "name": "Moscow"
        },
        {
          "name": "Novgorod"
        }
      ]
    },
    {
      "name": "China",
      "cities": [
        {
          "name": "Pekin"
        },
        {
          "name": "Honghong"
        },
        {
          "name": "Urumchi"
        }
      ]
    }
  ]
}