<mxfile host="65bd71144e">
    <diagram id="3nisWPVyl1rWg_nH2f-O" name="Page-1">
        <mxGraphModel dx="1142" dy="1751" grid="1" gridSize="10" guides="0" tooltips="1" connect="1" arrows="1" fold="1" page="1" pageScale="1" pageWidth="850" pageHeight="1100" background="#FFFFFF" math="0" shadow="0">
            <root>
                <mxCell id="0"/>
                <mxCell id="1" parent="0"/>
                <mxCell id="2" value="Vitaance&lt;br&gt;&lt;font style=&quot;font-size: 8px&quot;&gt;[Software System]&lt;/font&gt;&lt;br&gt;&lt;br&gt;&lt;span style=&quot;background-color: transparent ; vertical-align: baseline&quot; id=&quot;docs-internal-guid-104eb1ab-7fff-89bb-4754-0cc54d9a5078&quot;&gt;&lt;font style=&quot;font-size: 10px&quot;&gt;Provides professional advice on how to find the best personalized life insurance&lt;/font&gt;&lt;/span&gt;" style="rounded=0;whiteSpace=wrap;html=1;fillColor=#0050ef;fontColor=#ffffff;strokeColor=#001DBC;spacing=10;" parent="1" vertex="1">
                    <mxGeometry x="360" y="120" width="160" height="120" as="geometry"/>
                </mxCell>
                <mxCell id="3" value="&lt;font&gt;&lt;br&gt;&lt;br&gt;&lt;br&gt;&lt;br&gt;&lt;span style=&quot;font-size: 12px&quot;&gt;&lt;br&gt;User&lt;/span&gt;&lt;br&gt;&lt;font style=&quot;font-size: 8px&quot;&gt;[Person]&lt;/font&gt;&lt;br&gt;&lt;br&gt;A customer who uses the system&lt;br&gt;&lt;br&gt;&lt;/font&gt;" style="shape=actor;whiteSpace=wrap;html=1;fontFamily=Helvetica;fontSize=10;fontColor=#ffffff;fillColor=#000099;strokeColor=#3700CC;spacing=10;" parent="1" vertex="1">
                    <mxGeometry x="387.5" y="-130" width="105" height="130" as="geometry"/>
                </mxCell>
                <mxCell id="7" value="" style="endArrow=classic;html=1;fontFamily=Helvetica;fontSize=8;fontColor=#FFFFFF;dashed=1;exitX=0.5;exitY=1;exitDx=0;exitDy=0;entryX=0.5;entryY=0;entryDx=0;entryDy=0;strokeWidth=2;strokeColor=#000000;jumpSize=23;endSize=6;spacing=10;" parent="1" source="3" target="2" edge="1">
                    <mxGeometry relative="1" as="geometry">
                        <mxPoint x="280" y="100" as="sourcePoint"/>
                        <mxPoint x="380" y="100" as="targetPoint"/>
                    </mxGeometry>
                </mxCell>
                <mxCell id="8" value="&lt;span style=&quot;font-size: 10px&quot;&gt;&lt;font color=&quot;#000000&quot; style=&quot;font-size: 10px&quot;&gt;Views account, completes challenges&lt;br&gt;and gets rewards using&lt;/font&gt;&lt;/span&gt;" style="edgeLabel;resizable=0;html=1;align=center;verticalAlign=middle;fontFamily=Helvetica;fontSize=8;fontColor=#FFFFFF;labelBackgroundColor=#FFFFFF;spacing=10;" parent="7" connectable="0" vertex="1">
                    <mxGeometry relative="1" as="geometry"/>
                </mxCell>
                <mxCell id="9" value="Health and Fitness System&lt;br&gt;&lt;font style=&quot;font-size: 8px&quot;&gt;[Software System]&lt;/font&gt;&lt;br&gt;&lt;br&gt;&lt;font style=&quot;font-size: 10px&quot;&gt;WeFitter&lt;/font&gt;&lt;span style=&quot;font-size: 10px&quot;&gt;&amp;nbsp;service&lt;/span&gt;" style="rounded=0;whiteSpace=wrap;html=1;fillColor=#808080;fontColor=#ffffff;strokeColor=#001DBC;spacing=10;" parent="1" vertex="1">
                    <mxGeometry x="80" y="200" width="160" height="120" as="geometry"/>
                </mxCell>
                <mxCell id="10" value="E-mail System&lt;br&gt;&lt;font style=&quot;font-size: 8px&quot;&gt;[Software System]&lt;/font&gt;&lt;br&gt;&lt;br&gt;&lt;span style=&quot;background-color: transparent ; vertical-align: baseline&quot; id=&quot;docs-internal-guid-104eb1ab-7fff-89bb-4754-0cc54d9a5078&quot;&gt;&lt;font style=&quot;font-size: 10px&quot;&gt;External Amazon Simple Email Service&amp;nbsp;&lt;/font&gt;&lt;/span&gt;" style="rounded=0;whiteSpace=wrap;html=1;fillColor=#808080;fontColor=#ffffff;strokeColor=#001DBC;spacing=10;" parent="1" vertex="1">
                    <mxGeometry x="640" y="40" width="160" height="120" as="geometry"/>
                </mxCell>
                <mxCell id="11" value="&lt;font&gt;&lt;br&gt;&lt;br&gt;&lt;br&gt;&lt;br&gt;&lt;span style=&quot;font-size: 12px&quot;&gt;&lt;br&gt;Admin&lt;/span&gt;&lt;br&gt;&lt;font style=&quot;font-size: 8px&quot;&gt;[Person]&lt;/font&gt;&lt;br&gt;&lt;br&gt;Manges system with the admin panel&lt;br&gt;&lt;br&gt;&lt;/font&gt;" style="shape=actor;whiteSpace=wrap;html=1;fontFamily=Helvetica;fontSize=10;fontColor=#ffffff;fillColor=#000099;strokeColor=#3700CC;spacing=10;" parent="1" vertex="1">
                    <mxGeometry x="387.5" y="360" width="105" height="130" as="geometry"/>
                </mxCell>
                <mxCell id="12" value="" style="endArrow=classic;html=1;fontFamily=Helvetica;fontSize=8;fontColor=#FFFFFF;dashed=1;exitX=0.5;exitY=0;exitDx=0;exitDy=0;strokeWidth=2;strokeColor=#000000;entryX=0.5;entryY=1;entryDx=0;entryDy=0;spacing=10;" parent="1" source="11" target="2" edge="1">
                    <mxGeometry relative="1" as="geometry">
                        <mxPoint x="439.41" y="240" as="sourcePoint"/>
                        <mxPoint x="460" y="270" as="targetPoint"/>
                    </mxGeometry>
                </mxCell>
                <mxCell id="13" value="&lt;span style=&quot;font-size: 10px&quot;&gt;Manages user's accounts, challenges&lt;br&gt;and rewards using&lt;/span&gt;" style="edgeLabel;resizable=0;html=1;align=center;verticalAlign=middle;fontFamily=Helvetica;fontSize=8;fontColor=#000000;labelBackgroundColor=#FFFFFF;spacing=10;" parent="12" connectable="0" vertex="1">
                    <mxGeometry relative="1" as="geometry"/>
                </mxCell>
                <mxCell id="14" value="" style="endArrow=classic;html=1;fontFamily=Helvetica;fontSize=8;fontColor=#FFFFFF;dashed=1;entryX=0;entryY=0.5;entryDx=0;entryDy=0;strokeWidth=2;strokeColor=#000000;exitX=1.011;exitY=0.339;exitDx=0;exitDy=0;exitPerimeter=0;spacing=10;" parent="1" source="2" target="10" edge="1">
                    <mxGeometry relative="1" as="geometry">
                        <mxPoint x="530" y="180" as="sourcePoint"/>
                        <mxPoint x="560" y="230" as="targetPoint"/>
                    </mxGeometry>
                </mxCell>
                <mxCell id="15" value="&lt;font color=&quot;#000000&quot;&gt;&lt;span style=&quot;font-size: 10px&quot;&gt;Sends e-mails&lt;br&gt;using&lt;/span&gt;&lt;/font&gt;" style="edgeLabel;resizable=0;html=1;align=center;verticalAlign=middle;fontFamily=Helvetica;fontSize=8;fontColor=#FFFFFF;labelBackgroundColor=#FFFFFF;spacing=10;" parent="14" connectable="0" vertex="1">
                    <mxGeometry relative="1" as="geometry"/>
                </mxCell>
                <mxCell id="16" value="" style="endArrow=classic;html=1;fontFamily=Helvetica;fontSize=8;fontColor=#FFFFFF;dashed=1;entryX=1;entryY=0.75;entryDx=0;entryDy=0;strokeWidth=2;strokeColor=#000000;exitX=0.5;exitY=0;exitDx=0;exitDy=0;spacing=10;" parent="1" source="10" target="3" edge="1">
                    <mxGeometry relative="1" as="geometry">
                        <mxPoint x="610" y="80" as="sourcePoint"/>
                        <mxPoint x="730" y="80" as="targetPoint"/>
                    </mxGeometry>
                </mxCell>
                <mxCell id="17" value="&lt;font color=&quot;#000000&quot;&gt;&lt;span style=&quot;font-size: 10px&quot;&gt;Sends e-mails to&lt;br&gt;&lt;/span&gt;&lt;/font&gt;" style="edgeLabel;resizable=0;html=1;align=center;verticalAlign=middle;fontFamily=Helvetica;fontSize=8;fontColor=#FFFFFF;labelBackgroundColor=#FFFFFF;spacing=10;" parent="16" connectable="0" vertex="1">
                    <mxGeometry relative="1" as="geometry"/>
                </mxCell>
                <mxCell id="18" value="" style="endArrow=classic;html=1;fontFamily=Helvetica;fontSize=8;fontColor=#FFFFFF;dashed=1;entryX=1;entryY=0.5;entryDx=0;entryDy=0;strokeWidth=2;strokeColor=#000000;exitX=0;exitY=0.75;exitDx=0;exitDy=0;spacing=10;" parent="1" source="2" target="9" edge="1">
                    <mxGeometry relative="1" as="geometry">
                        <mxPoint x="300" y="130" as="sourcePoint"/>
                        <mxPoint x="360" y="179.41" as="targetPoint"/>
                    </mxGeometry>
                </mxCell>
                <mxCell id="19" value="&lt;font color=&quot;#000000&quot;&gt;&lt;span style=&quot;font-size: 10px&quot;&gt;Gets fitness&lt;br&gt;data using&lt;br&gt;&lt;/span&gt;&lt;/font&gt;" style="edgeLabel;resizable=0;html=1;align=center;verticalAlign=middle;fontFamily=Helvetica;fontSize=8;fontColor=#FFFFFF;labelBackgroundColor=#FFFFFF;spacing=10;" parent="18" connectable="0" vertex="1">
                    <mxGeometry relative="1" as="geometry"/>
                </mxCell>
                <mxCell id="20" value="&lt;font&gt;Push Notifications&lt;br&gt;System&lt;br&gt;&lt;/font&gt;&lt;font style=&quot;font-size: 8px&quot;&gt;[Software System]&lt;/font&gt;&lt;br&gt;&lt;br&gt;&lt;font style=&quot;font-size: 10px&quot;&gt;OneSignal&lt;/font&gt;&amp;nbsp;&lt;span style=&quot;font-size: 10px&quot;&gt;service&lt;/span&gt;" style="rounded=0;whiteSpace=wrap;html=1;fillColor=#808080;fontColor=#ffffff;strokeColor=#001DBC;spacing=10;" parent="1" vertex="1">
                    <mxGeometry x="80" y="40" width="160" height="120" as="geometry"/>
                </mxCell>
                <mxCell id="21" value="" style="endArrow=classic;html=1;fontFamily=Helvetica;fontSize=8;fontColor=#FFFFFF;dashed=1;entryX=1;entryY=0.5;entryDx=0;entryDy=0;strokeWidth=2;strokeColor=#000000;exitX=0;exitY=0.25;exitDx=0;exitDy=0;spacing=10;" parent="1" source="2" target="20" edge="1">
                    <mxGeometry relative="1" as="geometry">
                        <mxPoint x="360" y="20" as="sourcePoint"/>
                        <mxPoint x="360" y="19.409999999999997" as="targetPoint"/>
                    </mxGeometry>
                </mxCell>
                <mxCell id="22" value="&lt;font color=&quot;#000000&quot;&gt;&lt;span style=&quot;font-size: 10px&quot;&gt;Sends push notifications&lt;br&gt;using&lt;br&gt;&lt;/span&gt;&lt;/font&gt;" style="edgeLabel;resizable=0;html=1;align=center;verticalAlign=middle;fontFamily=Helvetica;fontSize=8;fontColor=#FFFFFF;labelBackgroundColor=#FFFFFF;spacing=10;" parent="21" connectable="0" vertex="1">
                    <mxGeometry relative="1" as="geometry"/>
                </mxCell>
                <mxCell id="23" value="" style="endArrow=classic;html=1;fontFamily=Helvetica;fontSize=8;fontColor=#FFFFFF;dashed=1;strokeWidth=2;strokeColor=#000000;exitX=0.5;exitY=0;exitDx=0;exitDy=0;entryX=0;entryY=0.75;entryDx=0;entryDy=0;spacing=10;" parent="1" source="20" target="3" edge="1">
                    <mxGeometry relative="1" as="geometry">
                        <mxPoint x="337.5" y="102.5" as="sourcePoint"/>
                        <mxPoint x="350" y="-40" as="targetPoint"/>
                    </mxGeometry>
                </mxCell>
                <mxCell id="24" value="&lt;font color=&quot;#000000&quot;&gt;&lt;span style=&quot;font-size: 10px&quot;&gt;Sends push notifications to&lt;br&gt;&lt;/span&gt;&lt;/font&gt;" style="edgeLabel;resizable=0;html=1;align=center;verticalAlign=middle;fontFamily=Helvetica;fontSize=8;fontColor=#FFFFFF;labelBackgroundColor=#FFFFFF;spacing=10;" parent="23" connectable="0" vertex="1">
                    <mxGeometry relative="1" as="geometry"/>
                </mxCell>
            </root>
        </mxGraphModel>
    </diagram>
</mxfile>