{
  "project_info": {
    "project_number": "1010157792885",
    "project_id": "olivemoon-8fe96",
    "storage_bucket": "olivemoon-8fe96.appspot.com"
  },
  "client": [
    {
      "client_info": {
        "mobilesdk_app_id": "1:1010157792885:android:774d0569b4205afe18123c",
        "android_client_info": {
          "package_name": "kur.viktor.olivemoon"
        }
      },
      "oauth_client": [
        {
          "client_id": "1010157792885-k9k0umra192ekq582tib51mv6g54g392.apps.googleusercontent.com",
          "client_type": 3
        }
      ],
      "api_key": [
        {
          "current_key": "AIzaSyBVQmi4NggYBg1lgEyAbqdUTsi6UgdsKg8"
        }
      ],
      "services": {
        "appinvite_service": {
          "other_platform_oauth_client": [
            {
              "client_id": "1010157792885-k9k0umra192ekq582tib51mv6g54g392.apps.googleusercontent.com",
              "client_type": 3
            }
          ]
        }
      }
    }
  ],
  "configuration_version": "1"
}