<?xml version="1.0" encoding="UTF-8" standalone="no"?>
<svg
   viewBox="0 0 64 64"
   version="1.1"
   id="svg59"
   sodipodi:docname="playlist-remove.svg"
   width="64"
   height="64"
   inkscape:version="1.1.2 (b8e25be8, 2022-02-05)"
   xmlns:inkscape="http://www.inkscape.org/namespaces/inkscape"
   xmlns:sodipodi="http://sodipodi.sourceforge.net/DTD/sodipodi-0.dtd"
   xmlns="http://www.w3.org/2000/svg"
   xmlns:svg="http://www.w3.org/2000/svg">
  <defs
     id="defs63" />
  <sodipodi:namedview
     id="namedview61"
     pagecolor="#ffffff"
     bordercolor="#666666"
     borderopacity="1.0"
     inkscape:pageshadow="2"
     inkscape:pageopacity="0.0"
     inkscape:pagecheckerboard="0"
     showgrid="false"
     inkscape:zoom="5.5831973"
     inkscape:cx="18.179547"
     inkscape:cy="24.896129"
     inkscape:window-width="1920"
     inkscape:window-height="942"
     inkscape:window-x="0"
     inkscape:window-y="25"
     inkscape:window-maximized="1"
     inkscape:current-layer="svg59"
     units="px" />
  <path
     fill="#000000"
     d="m 1.8208912,11.910592 v 6.226373 H 39.179128 V 11.910592 H 1.8208912 m 0,12.452746 v 6.226373 H 29.839569 V 24.363338 H 1.8208912 m 37.8874788,2.366021 -4.389593,4.389593 8.810318,8.810318 -8.810318,8.810318 4.389593,4.389592 8.810318,-8.810317 8.810317,8.810317 4.389593,-4.389592 -8.810318,-8.810318 8.810318,-8.810318 -4.389593,-4.389593 -8.810317,8.810318 -8.810318,-8.810318 M 1.8208912,36.816083 v 6.226373 H 29.839569 v -6.226373 z"
     id="path57"
      />
</svg>
