// Jest Snapshot v1, https://goo.gl/fbAQLP

exports[`Global Alert should be rendered 1`] = `
<View
  style={
    Array [
      Object {
        "alignItems": "center",
        "backgroundColor": "rgba(0,0,0,0.5)",
        "bottom": 0,
        "flexBasis": 0,
        "flexGrow": 1,
        "flexShrink": 1,
        "justifyContent": "center",
        "left": 0,
        "position": "absolute",
        "right": 0,
        "top": 0,
      },
    ]
  }
  testID="_globalAlert"
>
  <View
    style={
      Array [
        Object {
          "backgroundColor": "#FFFFFF",
          "borderRadius": 12,
          "width": "80%",
        },
      ]
    }
  >
    <Text
      style={
        Array [
          Object {
            "color": "#2F2F2F",
            "fontFamily": "SF Pro",
            "fontSize": 20,
            "fontWeight": "700",
            "marginHorizontal": 8,
            "marginTop": 24,
            "textAlign": "center",
          },
        ]
      }
      testID="globalAlert_title"
    >
      text
    </Text>
    <Text
      numberOfLines={4}
      style={
        Array [
          Object {
            "color": "#2F2F2F",
            "fontFamily": "SF Pro",
            "fontSize": 16,
            "fontWeight": "400",
            "marginBottom": 18,
            "marginHorizontal": 8,
            "marginTop": -4,
            "textAlign": "center",
          },
        ]
      }
      testID="globalAlert_description"
    >
      text
    </Text>
    <View
      accessible={true}
      focusable={true}
      onBlur={[Function]}
      onClick={[Function]}
      onFocus={[Function]}
      onResponderGrant={[Function]}
      onResponderMove={[Function]}
      onResponderRelease={[Function]}
      onResponderTerminate={[Function]}
      onResponderTerminationRequest={[Function]}
      onStartShouldSetResponder={[Function]}
      style={
        Array [
          Object {
            "borderColor": "#E5E5E5",
            "borderTopWidth": 1,
            "paddingHorizontal": 8,
            "paddingVertical": 8,
          },
        ]
      }
      testID="globalAlert_option_0"
    >
      <Text
        style={
          Array [
            Object {
              "color": "#3366FF",
              "fontFamily": "SF Pro",
              "fontSize": 20,
              "fontWeight": "500",
              "textAlign": "center",
            },
          ]
        }
        testID="globalAlert_optionText_0"
        type="cancel"
      >
        text
      </Text>
    </View>
  </View>
</View>
`;
