{
  "development": {
    "username": "postgres",
    "password": "Yodelia78",
    "database": "ch9",
    "host": "localhost",
    "dialect": "postgres"
  },
  "test": {
    "username": "root",
    "password": null,
    "database": "database_test",
    "host": "127.0.0.1",
    "dialect": "mysql"
  },
  "production": {
    "username": "niogiznenvzfop",
    "password": "e08ca1ea8f23475bf113cf07961ab063f7ece100293bc2f4ca198a9661ff22a4",
    "database": "d48gsjfh7ulk2e",
    "host": "ec2-34-204-121-199.compute-1.amazonaws.com",
    "dialect": "postgres"
  }
}
