[
    {
        "UserName": "rahul.rai",
        "pwd": "Rahul@123",
        "email": "rahulrai1304@gmail.com"
    },
    {
        "UserName": "vikas.rai",
        "pwd": "123",
        "email": "vikas.rai@outlook.com"
    }
]