{
  "type": "object",
  "required": [],
  "properties": {
    "Accounts": {
      "type": "array",
      "items": {
        "type": "object",
        "required": [],
        "properties": {
          "account_id": {
            "type": "string"
          },
          "first_name": {
            "type": "string"
          },
          "last_name": {
            "type": "string"
          },
          "email": {
            "type": "string"
          },
          "gender": {
            "type": "string"
          },
          "phone": {
            "type": "string"
          },
          "account_balance": {
            "type": "number"
          },
          "ASID": {
            "type": "string"
          },
          "apr": {
            "type": "number"
          },
          "_id": {
            "type": "string"
          },
          "credit_score": {
            "type": "number"
          },
          "fees": {
            "type": "number"
          },
          "password": {
            "type": "string"
          },
          "secure_pin": {
            "type": "number"
          },
          "bank_product": {
            "type": "array",
            "items": {
              "type": "object",
              "required": [],
              "properties": {
                "personal_loan": {
                  "type": "string"
                },
                "car_loan": {
                  "type": "boolean"
                },
                "home_loan": {
                  "type": "boolean"
                },
                "fixed_deposit": {
                  "type": "boolean"
                },
                "demat_services": {
                  "type": "boolean"
                }
              }
            }
          },
          "branch": {
            "type": "object",
            "required": [],
            "properties": {
              "IFSC_code": {
                "type": "string"
              },
              "address": {
                "type": "string"
              },
              "id": {
                "type": "string"
              },
              "name": {
                "type": "string"
              }
            }
          },
          "charges_category": {
            "type": "array",
            "items": {
              "type": "object",
              "required": [],
              "properties": {
                "electronics": {
                  "type": "object",
                  "required": [],
                  "properties": {
                    "fees": {
                      "type": "object",
                      "required": [],
                      "properties": {
                        "fall_back_value": {
                          "type": "number"
                        },
                        "value": {
                          "type": "number"
                        },
                        "expiry_date": {
                          "type": "string"
                        }
                      }
                    }
                  }
                }
              }
            }
          },
          "transactions": {
            "type": "array",
            "items": {
              "type": "object",
              "required": [],
              "properties": {
                "transaction_id": {
                  "type": "string"
                },
                "category": {
                  "type": "string"
                },
                "transaction_date": {
                  "type": "string"
                },
                "transaction_amount": {
                  "type": "number"
                }
              }
            }
          }
        }
      }
    }
  }
}