18-06-2021 12:04:41 	In Login Details...
18-06-2021 12:04:43 	Initialesed IP Camera.. PLC Connection Susseccfull 
18-06-2021 12:05:22 	getdatebase value11
18-06-2021 12:05:22 	After JPEGImage..   06/18/2021 12:05:22.762 PM
18-06-2021 12:05:25 	After JPEGImage.. sJpegPicFileName =  .jpg06/18/2021 12:05:25.612 PM
18-06-2021 12:20:21 	getdatebase value11
18-06-2021 12:20:21 	After JPEGImage..   06/18/2021 12:20:21.549 PM
18-06-2021 12:20:24 	After JPEGImage.. sJpegPicFileName =  .jpg06/18/2021 12:20:24.429 PM
18-06-2021 12:25:08 	getdatebase value11
18-06-2021 12:25:08 	After JPEGImage..   06/18/2021 12:25:08.261 PM
18-06-2021 12:25:11 	After JPEGImage.. sJpegPicFileName =  .jpg06/18/2021 12:25:11.779 PM
18-06-2021 12:47:19 	getdatebase value11
18-06-2021 12:47:19 	After JPEGImage..   06/18/2021 12:47:19.843 PM
18-06-2021 12:47:22 	After JPEGImage.. sJpegPicFileName =  .jpg06/18/2021 12:47:22.629 PM
18-06-2021 12:51:43 	getdatebase value11
18-06-2021 12:51:43 	After JPEGImage..   06/18/2021 12:51:43.656 PM
18-06-2021 12:51:46 	After JPEGImage.. sJpegPicFileName =  .jpg06/18/2021 12:51:46.668 PM
18-06-2021 12:52:21 	getdatebase value11
18-06-2021 12:52:21 	After JPEGImage..   06/18/2021 12:52:21.197 PM
18-06-2021 12:52:24 	After JPEGImage.. sJpegPicFileName =  .jpg06/18/2021 12:52:24.129 PM
18-06-2021 12:52:57 	getdatebase value11
18-06-2021 12:52:57 	After JPEGImage..   06/18/2021 12:52:57.240 PM
18-06-2021 12:52:59 	After JPEGImage.. sJpegPicFileName =  .jpg06/18/2021 12:52:59.577 PM
18-06-2021 12:55:15 	getdatebase value11
18-06-2021 12:55:15 	After JPEGImage..   06/18/2021 12:55:15.155 PM
18-06-2021 12:55:18 	After JPEGImage.. sJpegPicFileName =  .jpg06/18/2021 12:55:18.116 PM
18-06-2021 12:58:02 	getdatebase value11
18-06-2021 12:58:02 	After JPEGImage..   06/18/2021 12:58:02.121 PM
18-06-2021 12:58:09 	After JPEGImage.. sJpegPicFileName =  .jpg06/18/2021 12:58:09.084 PM
18-06-2021 13:01:35 	getdatebase value11
18-06-2021 13:01:35 	After JPEGImage..   06/18/2021 01:01:35.976 PM
18-06-2021 13:01:42 	After JPEGImage.. sJpegPicFileName =  .jpg06/18/2021 01:01:42.317 PM
18-06-2021 13:02:48 	getdatebase value11
18-06-2021 13:02:48 	After JPEGImage..   06/18/2021 01:02:48.824 PM
18-06-2021 13:02:55 	After JPEGImage.. sJpegPicFileName =  .jpg06/18/2021 01:02:55.140 PM
18-06-2021 13:05:01 	getdatebase value11
18-06-2021 13:05:01 	After JPEGImage..   06/18/2021 01:05:01.635 PM
18-06-2021 13:05:07 	After JPEGImage.. sJpegPicFileName =  .jpg06/18/2021 01:05:07.806 PM
18-06-2021 13:06:04 	getdatebase value11
18-06-2021 13:06:04 	After JPEGImage..   06/18/2021 01:06:04.235 PM
18-06-2021 13:06:24 	After JPEGImage.. sJpegPicFileName =  .jpg06/18/2021 01:06:24.603 PM
18-06-2021 13:08:13 	getdatebase value11
18-06-2021 13:08:13 	After JPEGImage..   06/18/2021 01:08:13.395 PM
18-06-2021 13:08:19 	After JPEGImage.. sJpegPicFileName =  .jpg06/18/2021 01:08:19.767 PM
18-06-2021 13:09:30 	getdatebase value11
18-06-2021 13:09:30 	After JPEGImage..   06/18/2021 01:09:30.263 PM
18-06-2021 13:09:35 	After JPEGImage.. sJpegPicFileName =  .jpg06/18/2021 01:09:35.641 PM
18-06-2021 13:10:21 	getdatebase value11
18-06-2021 13:10:21 	After JPEGImage..   06/18/2021 01:10:21.250 PM
18-06-2021 13:10:27 	After JPEGImage.. sJpegPicFileName =  .jpg06/18/2021 01:10:27.220 PM
18-06-2021 13:11:16 	getdatebase value11
18-06-2021 13:11:16 	After JPEGImage..   06/18/2021 01:11:16.862 PM
18-06-2021 13:11:24 	After JPEGImage.. sJpegPicFileName =  .jpg06/18/2021 01:11:24.804 PM
18-06-2021 13:11:48 	getdatebase value11
18-06-2021 13:11:48 	After JPEGImage..   06/18/2021 01:11:48.899 PM
18-06-2021 13:11:52 	After JPEGImage.. sJpegPicFileName =  .jpg06/18/2021 01:11:52.144 PM
