17-06-2021 11:38:05 	In Login Details...
17-06-2021 11:38:08 	Initialesed IP Camera.. PLC Connection Susseccfull 
17-06-2021 11:41:03 	getdatebase value11
17-06-2021 11:41:03 	After JPEGImage..   06/17/2021 11:41:03.375 AM
17-06-2021 11:41:06 	After JPEGImage.. sJpegPicFileName =  .jpg06/17/2021 11:41:06.032 AM
17-06-2021 12:50:23 	getdatebase value11
17-06-2021 12:50:23 	After JPEGImage..   06/17/2021 12:50:23.303 PM
17-06-2021 12:50:25 	After JPEGImage.. sJpegPicFileName =  .jpg06/17/2021 12:50:25.870 PM
17-06-2021 12:52:37 	After JPEGImage.. sJpegPicFileName =  .jpg06/17/2021 12:52:37.282 PM
17-06-2021 12:54:25 	getdatebase value11
17-06-2021 12:54:25 	After JPEGImage..   06/17/2021 12:54:25.124 PM
17-06-2021 12:54:27 	After JPEGImage.. sJpegPicFileName =  .jpg06/17/2021 12:54:27.560 PM
17-06-2021 12:56:36 	getdatebase value11
17-06-2021 12:56:36 	After JPEGImage..   06/17/2021 12:56:36.212 PM
17-06-2021 12:56:38 	After JPEGImage.. sJpegPicFileName =  .jpg06/17/2021 12:56:38.934 PM
17-06-2021 12:57:38 	getdatebase value11
17-06-2021 12:57:38 	After JPEGImage..   06/17/2021 12:57:38.548 PM
17-06-2021 12:57:40 	After JPEGImage.. sJpegPicFileName =  .jpg06/17/2021 12:57:40.647 PM
17-06-2021 12:58:22 	getdatebase value11
17-06-2021 12:58:22 	After JPEGImage..   06/17/2021 12:58:22.947 PM
17-06-2021 12:58:25 	After JPEGImage.. sJpegPicFileName =  .jpg06/17/2021 12:58:25.115 PM
