{"total_assessment_level_score":0,"level":2,"actual_score_in_level":0,"training_run_id":29,"syslog":{"severity":"info","timegenerated":"2021-07-08T15:34:21+00:00","@timestamp":"2021-07-08T15:34:21.101Z","host":"192.168.44.11","programname":"kypo-training","@version":"1","procid":"","fromhost-ip":"training-service","type":"syslog","facility":"security"},"type":"cz.muni.csirt.kypo.events.trainings.TrainingRunStarted","pool_id":30,"game_time":0,"sandbox_id":130,"training_instance_id":4,"user_ref_id":204,"training_definition_id":2,"total_game_level_score":0,"timestamp":1625758461097}
{"total_assessment_level_score":0,"level":2,"actual_score_in_level":0,"training_run_id":29,"syslog":{"severity":"info","timegenerated":"2021-07-08T15:34:21+00:00","@timestamp":"2021-07-08T15:34:21.102Z","host":"192.168.44.11","programname":"kypo-training","@version":"1","procid":"","fromhost-ip":"training-service","type":"syslog","facility":"security"},"type":"cz.muni.csirt.kypo.events.trainings.LevelStarted","pool_id":30,"level_type":"INFO","level_title":"Introduction","game_time":268,"max_score":0,"sandbox_id":130,"training_instance_id":4,"user_ref_id":204,"training_definition_id":2,"total_game_level_score":0,"timestamp":1625758461109}
{"total_assessment_level_score":0,"level":2,"actual_score_in_level":0,"training_run_id":29,"syslog":{"severity":"info","timegenerated":"2021-07-08T15:35:04+00:00","@timestamp":"2021-07-08T15:35:04.610Z","host":"192.168.44.11","programname":"kypo-training","@version":"1","procid":"","fromhost-ip":"training-service","type":"syslog","facility":"security"},"type":"cz.muni.csirt.kypo.events.trainings.LevelCompleted","pool_id":30,"level_type":"INFO","game_time":43777,"sandbox_id":130,"training_instance_id":4,"user_ref_id":204,"training_definition_id":2,"total_game_level_score":0,"timestamp":1625758504613}
