{"total_assessment_level_score":0,"level":8,"actual_score_in_level":0,"training_run_id":12,"syslog":{"severity":"info","timegenerated":"2021-06-30T09:10:25+00:00","@timestamp":"2021-06-30T09:10:25.729Z","host":"192.168.44.11","programname":"kypo-training","@version":"1","procid":"","fromhost-ip":"training-service","type":"syslog","facility":"security"},"type":"cz.muni.csirt.kypo.events.trainings.LevelStarted","pool_id":30,"level_type":"INFO","level_title":"Epilogue","game_time":10998834,"max_score":0,"sandbox_id":126,"training_instance_id":4,"user_ref_id":199,"training_definition_id":2,"total_game_level_score":5,"timestamp":1625044225737}
{"total_assessment_level_score":0,"level":8,"actual_score_in_level":0,"training_run_id":12,"syslog":{"severity":"info","timegenerated":"2021-06-30T10:08:16+00:00","@timestamp":"2021-06-30T10:08:16.194Z","host":"192.168.44.11","programname":"kypo-training","@version":"1","procid":"","fromhost-ip":"training-service","type":"syslog","facility":"security"},"type":"cz.muni.csirt.kypo.events.trainings.LevelCompleted","pool_id":30,"level_type":"INFO","game_time":14469299,"sandbox_id":126,"training_instance_id":4,"user_ref_id":199,"training_definition_id":2,"total_game_level_score":5,"timestamp":1625047696196}
{"total_assessment_level_score":0,"level":8,"actual_score_in_level":0,"training_run_id":12,"end_time":1625047696192,"syslog":{"severity":"info","timegenerated":"2021-06-30T10:08:16+00:00","@timestamp":"2021-06-30T10:08:16.194Z","host":"192.168.44.11","programname":"kypo-training","@version":"1","procid":"","fromhost-ip":"training-service","type":"syslog","facility":"security"},"type":"cz.muni.csirt.kypo.events.trainings.TrainingRunEnded","pool_id":30,"start_time":1625033226892,"game_time":14469300,"sandbox_id":126,"training_instance_id":4,"user_ref_id":199,"training_definition_id":2,"total_game_level_score":5,"timestamp":1625047696202}
