{"total_assessment_level_score":0,"level":7,"actual_score_in_level":1,"training_run_id":11,"syslog":{"severity":"info","timegenerated":"2021-06-30T07:42:05+00:00","@timestamp":"2021-06-30T07:42:05.817Z","host":"192.168.44.11","programname":"kypo-training","@version":"1","procid":"","fromhost-ip":"training-service","type":"syslog","facility":"security"},"type":"cz.muni.csirt.kypo.events.trainings.LevelStarted","pool_id":30,"level_type":"GAME","level_title":"Level 5: Steal data and send them to scientists","game_time":5718454,"max_score":1,"sandbox_id":125,"training_instance_id":4,"user_ref_id":197,"training_definition_id":2,"total_game_level_score":0,"timestamp":1625038925825}
{"total_assessment_level_score":0,"level":7,"actual_score_in_level":1,"training_run_id":11,"hint_id":22,"syslog":{"severity":"info","timegenerated":"2021-06-30T07:43:31+00:00","@timestamp":"2021-06-30T07:43:31.335Z","host":"192.168.44.11","programname":"kypo-training","@version":"1","procid":"","fromhost-ip":"training-service","type":"syslog","facility":"security"},"pool_id":30,"type":"cz.muni.csirt.kypo.events.trainings.HintTaken","hint_title":"What should you do if the command doesn't work for you?","game_time":5803973,"sandbox_id":125,"training_instance_id":4,"user_ref_id":197,"training_definition_id":2,"total_game_level_score":0,"timestamp":1625039011333,"hint_penalty_points":0}
{"total_assessment_level_score":0,"level":7,"actual_score_in_level":1,"training_run_id":11,"hint_id":23,"syslog":{"severity":"info","timegenerated":"2021-06-30T07:43:38+00:00","@timestamp":"2021-06-30T07:43:38.112Z","host":"192.168.44.11","programname":"kypo-training","@version":"1","procid":"","fromhost-ip":"training-service","type":"syslog","facility":"security"},"pool_id":30,"type":"cz.muni.csirt.kypo.events.trainings.HintTaken","hint_title":"What command to use to access the server?","game_time":5810750,"sandbox_id":125,"training_instance_id":4,"user_ref_id":197,"training_definition_id":2,"total_game_level_score":0,"timestamp":1625039018111,"hint_penalty_points":0}
{"total_assessment_level_score":0,"level":7,"actual_score_in_level":1,"training_run_id":11,"hint_id":24,"syslog":{"severity":"info","timegenerated":"2021-06-30T07:43:40+00:00","@timestamp":"2021-06-30T07:43:40.311Z","host":"192.168.44.11","programname":"kypo-training","@version":"1","procid":"","fromhost-ip":"training-service","type":"syslog","facility":"security"},"pool_id":30,"type":"cz.muni.csirt.kypo.events.trainings.HintTaken","hint_title":"What is the password?","game_time":5812946,"sandbox_id":125,"training_instance_id":4,"user_ref_id":197,"training_definition_id":2,"total_game_level_score":0,"timestamp":1625039020309,"hint_penalty_points":0}
{"total_assessment_level_score":0,"level":7,"penalty_points":0,"actual_score_in_level":0,"training_run_id":11,"syslog":{"severity":"info","timegenerated":"2021-06-30T07:44:14+00:00","@timestamp":"2021-06-30T07:44:14.707Z","host":"192.168.44.11","programname":"kypo-training","@version":"1","procid":"","fromhost-ip":"training-service","type":"syslog","facility":"security"},"type":"cz.muni.csirt.kypo.events.trainings.SolutionDisplayed","pool_id":30,"game_time":5847344,"sandbox_id":125,"training_instance_id":4,"user_ref_id":197,"training_definition_id":2,"total_game_level_score":0,"timestamp":1625039054705}
{"total_assessment_level_score":0,"flag_content":"WE SURVIVE AFTER ALL","level":7,"actual_score_in_level":0,"training_run_id":11,"syslog":{"severity":"info","timegenerated":"2021-06-30T08:03:45+00:00","@timestamp":"2021-06-30T08:03:45.096Z","host":"192.168.44.11","programname":"kypo-training","@version":"1","procid":"","fromhost-ip":"training-service","type":"syslog","facility":"security"},"type":"cz.muni.csirt.kypo.events.trainings.CorrectFlagSubmitted","pool_id":30,"game_time":7017733,"sandbox_id":125,"training_instance_id":4,"user_ref_id":197,"training_definition_id":2,"total_game_level_score":0,"timestamp":1625040225094}
{"total_assessment_level_score":0,"level":7,"actual_score_in_level":0,"training_run_id":11,"syslog":{"severity":"info","timegenerated":"2021-06-30T08:03:45+00:00","@timestamp":"2021-06-30T08:03:45.096Z","host":"192.168.44.11","programname":"kypo-training","@version":"1","procid":"","fromhost-ip":"training-service","type":"syslog","facility":"security"},"type":"cz.muni.csirt.kypo.events.trainings.LevelCompleted","pool_id":30,"level_type":"GAME","game_time":7017734,"sandbox_id":125,"training_instance_id":4,"user_ref_id":197,"training_definition_id":2,"total_game_level_score":0,"timestamp":1625040225099}
