{"total_assessment_level_score":0,"level":8,"actual_score_in_level":0,"training_run_id":14,"syslog":{"severity":"info","timegenerated":"2021-06-30T08:04:12+00:00","@timestamp":"2021-06-30T08:04:12.610Z","host":"192.168.44.11","programname":"kypo-training","@version":"1","procid":"","fromhost-ip":"training-service","type":"syslog","facility":"security"},"type":"cz.muni.csirt.kypo.events.trainings.LevelStarted","pool_id":30,"level_type":"INFO","level_title":"Epilogue","game_time":7006279,"max_score":0,"sandbox_id":128,"training_instance_id":4,"user_ref_id":198,"training_definition_id":2,"total_game_level_score":1,"timestamp":1625040252618}
{"total_assessment_level_score":0,"level":8,"actual_score_in_level":0,"training_run_id":14,"syslog":{"severity":"info","timegenerated":"2021-06-30T08:04:46+00:00","@timestamp":"2021-06-30T08:04:46.110Z","host":"192.168.44.11","programname":"kypo-training","@version":"1","procid":"","fromhost-ip":"training-service","type":"syslog","facility":"security"},"type":"cz.muni.csirt.kypo.events.trainings.LevelCompleted","pool_id":30,"level_type":"INFO","game_time":7039779,"sandbox_id":128,"training_instance_id":4,"user_ref_id":198,"training_definition_id":2,"total_game_level_score":1,"timestamp":1625040286113}
{"total_assessment_level_score":0,"level":8,"actual_score_in_level":0,"training_run_id":14,"end_time":1625040286108,"syslog":{"severity":"info","timegenerated":"2021-06-30T08:04:46+00:00","@timestamp":"2021-06-30T08:04:46.110Z","host":"192.168.44.11","programname":"kypo-training","@version":"1","procid":"","fromhost-ip":"training-service","type":"syslog","facility":"security"},"type":"cz.muni.csirt.kypo.events.trainings.TrainingRunEnded","pool_id":30,"start_time":1625033246329,"game_time":7039779,"sandbox_id":128,"training_instance_id":4,"user_ref_id":198,"training_definition_id":2,"total_game_level_score":1,"timestamp":1625040286118}
