{"total_assessment_level_score":0,"level":7,"actual_score_in_level":1,"training_run_id":12,"syslog":{"severity":"info","timegenerated":"2021-06-30T08:14:57+00:00","@timestamp":"2021-06-30T08:14:57.638Z","host":"192.168.44.11","programname":"kypo-training","@version":"1","procid":"","fromhost-ip":"training-service","type":"syslog","facility":"security"},"type":"cz.muni.csirt.kypo.events.trainings.LevelStarted","pool_id":30,"level_type":"GAME","level_title":"Level 5: Steal data and send them to scientists","game_time":7670744,"max_score":1,"sandbox_id":126,"training_instance_id":4,"user_ref_id":199,"training_definition_id":2,"total_game_level_score":4,"timestamp":1625040897646}
{"total_assessment_level_score":0,"level":7,"actual_score_in_level":1,"training_run_id":12,"hint_id":22,"syslog":{"severity":"info","timegenerated":"2021-06-30T08:23:23+00:00","@timestamp":"2021-06-30T08:23:23.027Z","host":"192.168.44.11","programname":"kypo-training","@version":"1","procid":"","fromhost-ip":"training-service","type":"syslog","facility":"security"},"pool_id":30,"type":"cz.muni.csirt.kypo.events.trainings.HintTaken","hint_title":"What should you do if the command doesn't work for you?","game_time":8176132,"sandbox_id":126,"training_instance_id":4,"user_ref_id":199,"training_definition_id":2,"total_game_level_score":4,"timestamp":1625041403025,"hint_penalty_points":0}
{"total_assessment_level_score":0,"level":7,"actual_score_in_level":1,"training_run_id":12,"hint_id":23,"syslog":{"severity":"info","timegenerated":"2021-06-30T08:23:32+00:00","@timestamp":"2021-06-30T08:23:32.118Z","host":"192.168.44.11","programname":"kypo-training","@version":"1","procid":"","fromhost-ip":"training-service","type":"syslog","facility":"security"},"pool_id":30,"type":"cz.muni.csirt.kypo.events.trainings.HintTaken","hint_title":"What command to use to access the server?","game_time":8185224,"sandbox_id":126,"training_instance_id":4,"user_ref_id":199,"training_definition_id":2,"total_game_level_score":4,"timestamp":1625041412117,"hint_penalty_points":0}
{"total_assessment_level_score":0,"level":7,"actual_score_in_level":1,"training_run_id":12,"hint_id":24,"syslog":{"severity":"info","timegenerated":"2021-06-30T08:31:27+00:00","@timestamp":"2021-06-30T08:31:27.535Z","host":"192.168.44.11","programname":"kypo-training","@version":"1","procid":"","fromhost-ip":"training-service","type":"syslog","facility":"security"},"pool_id":30,"type":"cz.muni.csirt.kypo.events.trainings.HintTaken","hint_title":"What is the password?","game_time":8660640,"sandbox_id":126,"training_instance_id":4,"user_ref_id":199,"training_definition_id":2,"total_game_level_score":4,"timestamp":1625041887533,"hint_penalty_points":0}
{"total_assessment_level_score":0,"flag_content":"WE SURVIVE AFTER ALL","level":7,"actual_score_in_level":1,"training_run_id":12,"syslog":{"severity":"info","timegenerated":"2021-06-30T09:10:25+00:00","@timestamp":"2021-06-30T09:10:25.660Z","host":"192.168.44.11","programname":"kypo-training","@version":"1","procid":"","fromhost-ip":"training-service","type":"syslog","facility":"security"},"type":"cz.muni.csirt.kypo.events.trainings.CorrectFlagSubmitted","pool_id":30,"game_time":10998764,"sandbox_id":126,"training_instance_id":4,"user_ref_id":199,"training_definition_id":2,"total_game_level_score":5,"timestamp":1625044225657}
{"total_assessment_level_score":0,"level":7,"actual_score_in_level":1,"training_run_id":12,"syslog":{"severity":"info","timegenerated":"2021-06-30T09:10:25+00:00","@timestamp":"2021-06-30T09:10:25.660Z","host":"192.168.44.11","programname":"kypo-training","@version":"1","procid":"","fromhost-ip":"training-service","type":"syslog","facility":"security"},"type":"cz.muni.csirt.kypo.events.trainings.LevelCompleted","pool_id":30,"level_type":"GAME","game_time":10998766,"sandbox_id":126,"training_instance_id":4,"user_ref_id":199,"training_definition_id":2,"total_game_level_score":5,"timestamp":1625044225663}
