{"total_assessment_level_score":0,"level":5,"actual_score_in_level":1,"training_run_id":12,"syslog":{"severity":"info","timegenerated":"2021-06-30T07:30:30+00:00","@timestamp":"2021-06-30T07:30:30.939Z","host":"192.168.44.11","programname":"kypo-training","@version":"1","procid":"","fromhost-ip":"training-service","type":"syslog","facility":"security"},"type":"cz.muni.csirt.kypo.events.trainings.LevelStarted","pool_id":30,"level_type":"GAME","level_title":"Level 3: Find the address of the second server","game_time":5004045,"max_score":1,"sandbox_id":126,"training_instance_id":4,"user_ref_id":199,"training_definition_id":2,"total_game_level_score":2,"timestamp":1625038230948}
{"total_assessment_level_score":0,"flag_content":"Y29yb25h","level":5,"actual_score_in_level":1,"training_run_id":12,"syslog":{"severity":"info","timegenerated":"2021-06-30T07:36:14+00:00","@timestamp":"2021-06-30T07:36:14.313Z","host":"192.168.44.11","programname":"kypo-training","@version":"1","procid":"","fromhost-ip":"training-service","type":"syslog","facility":"security"},"type":"cz.muni.csirt.kypo.events.trainings.CorrectFlagSubmitted","pool_id":30,"game_time":5347417,"sandbox_id":126,"training_instance_id":4,"user_ref_id":199,"training_definition_id":2,"total_game_level_score":3,"timestamp":1625038574310}
{"total_assessment_level_score":0,"level":5,"actual_score_in_level":1,"training_run_id":12,"syslog":{"severity":"info","timegenerated":"2021-06-30T07:36:14+00:00","@timestamp":"2021-06-30T07:36:14.313Z","host":"192.168.44.11","programname":"kypo-training","@version":"1","procid":"","fromhost-ip":"training-service","type":"syslog","facility":"security"},"type":"cz.muni.csirt.kypo.events.trainings.LevelCompleted","pool_id":30,"level_type":"GAME","game_time":5347419,"sandbox_id":126,"training_instance_id":4,"user_ref_id":199,"training_definition_id":2,"total_game_level_score":3,"timestamp":1625038574316}
