{"total_assessment_level_score":0,"level":2,"actual_score_in_level":0,"training_run_id":12,"syslog":{"severity":"info","timegenerated":"2021-06-30T06:07:07+00:00","@timestamp":"2021-06-30T06:07:07.100Z","host":"192.168.44.11","programname":"kypo-training","@version":"1","procid":"","fromhost-ip":"training-service","type":"syslog","facility":"security"},"type":"cz.muni.csirt.kypo.events.trainings.TrainingRunStarted","pool_id":30,"game_time":0,"sandbox_id":126,"training_instance_id":4,"user_ref_id":199,"training_definition_id":2,"total_game_level_score":0,"timestamp":1625033227097}
{"total_assessment_level_score":0,"level":2,"actual_score_in_level":0,"training_run_id":12,"syslog":{"severity":"info","timegenerated":"2021-06-30T06:07:07+00:00","@timestamp":"2021-06-30T06:07:07.100Z","host":"192.168.44.11","programname":"kypo-training","@version":"1","procid":"","fromhost-ip":"training-service","type":"syslog","facility":"security"},"type":"cz.muni.csirt.kypo.events.trainings.LevelStarted","pool_id":30,"level_type":"INFO","level_title":"Introduction","game_time":205,"max_score":0,"sandbox_id":126,"training_instance_id":4,"user_ref_id":199,"training_definition_id":2,"total_game_level_score":0,"timestamp":1625033227107}
{"total_assessment_level_score":0,"level":2,"actual_score_in_level":0,"training_run_id":12,"syslog":{"severity":"info","timegenerated":"2021-06-30T06:09:32+00:00","@timestamp":"2021-06-30T06:09:32.368Z","host":"192.168.44.11","programname":"kypo-training","@version":"1","procid":"","fromhost-ip":"training-service","type":"syslog","facility":"security"},"type":"cz.muni.csirt.kypo.events.trainings.LevelCompleted","pool_id":30,"level_type":"INFO","game_time":145473,"sandbox_id":126,"training_instance_id":4,"user_ref_id":199,"training_definition_id":2,"total_game_level_score":0,"timestamp":1625033372371}
