{"total_assessment_level_score":0,"level":6,"actual_score_in_level":1,"training_run_id":9,"syslog":{"severity":"info","timegenerated":"2021-06-30T07:10:16+00:00","@timestamp":"2021-06-30T07:10:16.385Z","host":"192.168.44.11","programname":"kypo-training","@version":"1","procid":"","fromhost-ip":"training-service","type":"syslog","facility":"security"},"type":"cz.muni.csirt.kypo.events.trainings.LevelStarted","pool_id":30,"level_type":"GAME","level_title":"Level 4: Find the SSH key passphrase","game_time":3843389,"max_score":1,"sandbox_id":123,"training_instance_id":4,"user_ref_id":194,"training_definition_id":2,"total_game_level_score":3,"timestamp":1625037016394}
{"total_assessment_level_score":0,"flag_content":"mrscorona7","level":6,"actual_score_in_level":1,"training_run_id":9,"syslog":{"severity":"info","timegenerated":"2021-06-30T07:18:39+00:00","@timestamp":"2021-06-30T07:18:39.816Z","host":"192.168.44.11","programname":"kypo-training","@version":"1","procid":"","fromhost-ip":"training-service","type":"syslog","facility":"security"},"type":"cz.muni.csirt.kypo.events.trainings.CorrectFlagSubmitted","pool_id":30,"game_time":4346818,"sandbox_id":123,"training_instance_id":4,"user_ref_id":194,"training_definition_id":2,"total_game_level_score":4,"timestamp":1625037519814}
{"total_assessment_level_score":0,"level":6,"actual_score_in_level":1,"training_run_id":9,"syslog":{"severity":"info","timegenerated":"2021-06-30T07:18:39+00:00","@timestamp":"2021-06-30T07:18:39.816Z","host":"192.168.44.11","programname":"kypo-training","@version":"1","procid":"","fromhost-ip":"training-service","type":"syslog","facility":"security"},"type":"cz.muni.csirt.kypo.events.trainings.LevelCompleted","pool_id":30,"level_type":"GAME","game_time":4346820,"sandbox_id":123,"training_instance_id":4,"user_ref_id":194,"training_definition_id":2,"total_game_level_score":4,"timestamp":1625037519819}
