{"total_assessment_level_score":0,"level":9,"actual_score_in_level":1,"training_run_id":2,"syslog":{"severity":"info","timegenerated":"2021-07-12T15:54:59+00:00","@timestamp":"2021-07-12T15:54:59.004Z","programname":"kypo-training","host":"192.168.44.8","@version":"1","procid":"","fromhost-ip":"training-service","type":"syslog","facility":"security"},"type":"cz.muni.csirt.kypo.events.trainings.LevelStarted","pool_id":2,"level_type":"GAME","level_title":"Level 1: Looking for the vulnerable service","game_time":235454,"max_score":1,"sandbox_id":3,"training_instance_id":1,"user_ref_id":166,"training_definition_id":2,"total_game_level_score":0,"timestamp":1626105299012}
{"total_assessment_level_score":0,"level":9,"actual_score_in_level":1,"training_run_id":2,"hint_id":22,"syslog":{"severity":"info","timegenerated":"2021-07-12T16:15:38+00:00","@timestamp":"2021-07-12T16:15:38.569Z","programname":"kypo-training","host":"192.168.44.8","@version":"1","procid":"","fromhost-ip":"training-service","type":"syslog","facility":"security"},"type":"cz.muni.csirt.kypo.events.trainings.HintTaken","pool_id":2,"hint_title":"Which option gives you the version?","game_time":1475018,"sandbox_id":3,"training_instance_id":1,"user_ref_id":166,"training_definition_id":2,"total_game_level_score":0,"timestamp":1626106538567,"hint_penalty_points":0}
{"total_assessment_level_score":0,"level":9,"actual_score_in_level":1,"training_run_id":2,"hint_id":21,"syslog":{"severity":"info","timegenerated":"2021-07-12T16:15:47+00:00","@timestamp":"2021-07-12T16:15:47.831Z","programname":"kypo-training","host":"192.168.44.8","@version":"1","procid":"","fromhost-ip":"training-service","type":"syslog","facility":"security"},"type":"cz.muni.csirt.kypo.events.trainings.HintTaken","pool_id":2,"hint_title":"Which port should you scan?","game_time":1484279,"sandbox_id":3,"training_instance_id":1,"user_ref_id":166,"training_definition_id":2,"total_game_level_score":0,"timestamp":1626106547828,"hint_penalty_points":0}
{"total_assessment_level_score":0,"level":9,"actual_score_in_level":1,"training_run_id":2,"hint_id":23,"syslog":{"severity":"info","timegenerated":"2021-07-12T16:16:12+00:00","@timestamp":"2021-07-12T16:16:12.649Z","programname":"kypo-training","host":"192.168.44.8","@version":"1","procid":"","fromhost-ip":"training-service","type":"syslog","facility":"security"},"type":"cz.muni.csirt.kypo.events.trainings.HintTaken","pool_id":2,"hint_title":"Which tool should you use?","game_time":1509097,"sandbox_id":3,"training_instance_id":1,"user_ref_id":166,"training_definition_id":2,"total_game_level_score":0,"timestamp":1626106572647,"hint_penalty_points":0}
{"flag_content":"Webmin 1.890","total_assessment_level_score":0,"level":9,"actual_score_in_level":1,"training_run_id":2,"count":1,"syslog":{"severity":"info","timegenerated":"2021-07-12T16:23:42+00:00","@timestamp":"2021-07-12T16:23:42.752Z","programname":"kypo-training","host":"192.168.44.8","@version":"1","procid":"","fromhost-ip":"training-service","type":"syslog","facility":"security"},"type":"cz.muni.csirt.kypo.events.trainings.WrongFlagSubmitted","pool_id":2,"game_time":1959200,"sandbox_id":3,"training_instance_id":1,"user_ref_id":166,"training_definition_id":2,"total_game_level_score":0,"timestamp":1626107022750}
{"flag_content":"webmin 1.890","total_assessment_level_score":0,"level":9,"actual_score_in_level":1,"training_run_id":2,"syslog":{"severity":"info","timegenerated":"2021-07-12T16:24:12+00:00","@timestamp":"2021-07-12T16:24:12.893Z","programname":"kypo-training","host":"192.168.44.8","@version":"1","procid":"","fromhost-ip":"training-service","type":"syslog","facility":"security"},"type":"cz.muni.csirt.kypo.events.trainings.CorrectFlagSubmitted","pool_id":2,"game_time":1989337,"sandbox_id":3,"training_instance_id":1,"user_ref_id":166,"training_definition_id":2,"total_game_level_score":1,"timestamp":1626107052887}
{"total_assessment_level_score":0,"level":9,"actual_score_in_level":1,"training_run_id":2,"syslog":{"severity":"info","timegenerated":"2021-07-12T16:24:12+00:00","@timestamp":"2021-07-12T16:24:12.893Z","programname":"kypo-training","host":"192.168.44.8","@version":"1","procid":"","fromhost-ip":"training-service","type":"syslog","facility":"security"},"type":"cz.muni.csirt.kypo.events.trainings.LevelCompleted","pool_id":2,"level_type":"GAME","game_time":1989339,"sandbox_id":3,"training_instance_id":1,"user_ref_id":166,"training_definition_id":2,"total_game_level_score":1,"timestamp":1626107052893}
