{"total_assessment_level_score":0,"level":8,"actual_score_in_level":0,"training_run_id":2,"syslog":{"severity":"info","timegenerated":"2021-07-12T15:51:03+00:00","@timestamp":"2021-07-12T15:51:03.898Z","programname":"kypo-training","host":"192.168.44.8","@version":"1","procid":"","fromhost-ip":"training-service","type":"syslog","facility":"security"},"type":"cz.muni.csirt.kypo.events.trainings.TrainingRunStarted","pool_id":2,"game_time":0,"sandbox_id":3,"training_instance_id":1,"user_ref_id":166,"training_definition_id":2,"total_game_level_score":0,"timestamp":1626105063894}
{"total_assessment_level_score":0,"level":8,"actual_score_in_level":0,"training_run_id":2,"syslog":{"severity":"info","timegenerated":"2021-07-12T15:51:03+00:00","@timestamp":"2021-07-12T15:51:03.898Z","programname":"kypo-training","host":"192.168.44.8","@version":"1","procid":"","fromhost-ip":"training-service","type":"syslog","facility":"security"},"type":"cz.muni.csirt.kypo.events.trainings.LevelStarted","pool_id":2,"level_type":"INFO","level_title":"Introduction","game_time":346,"max_score":0,"sandbox_id":3,"training_instance_id":1,"user_ref_id":166,"training_definition_id":2,"total_game_level_score":0,"timestamp":1626105063905}
{"total_assessment_level_score":0,"level":8,"actual_score_in_level":0,"training_run_id":2,"syslog":{"severity":"info","timegenerated":"2021-07-12T15:54:59+00:00","@timestamp":"2021-07-12T15:54:59.002Z","programname":"kypo-training","host":"192.168.44.8","@version":"1","procid":"","fromhost-ip":"training-service","type":"syslog","facility":"security"},"type":"cz.muni.csirt.kypo.events.trainings.LevelCompleted","pool_id":2,"level_type":"INFO","game_time":235451,"sandbox_id":3,"training_instance_id":1,"user_ref_id":166,"training_definition_id":2,"total_game_level_score":0,"timestamp":1626105299006}
{"total_assessment_level_score":0,"level":9,"actual_score_in_level":1,"training_run_id":2,"syslog":{"severity":"info","timegenerated":"2021-07-12T15:54:59+00:00","@timestamp":"2021-07-12T15:54:59.004Z","programname":"kypo-training","host":"192.168.44.8","@version":"1","procid":"","fromhost-ip":"training-service","type":"syslog","facility":"security"},"type":"cz.muni.csirt.kypo.events.trainings.LevelStarted","pool_id":2,"level_type":"GAME","level_title":"Level 1: Looking for the vulnerable service","game_time":235454,"max_score":1,"sandbox_id":3,"training_instance_id":1,"user_ref_id":166,"training_definition_id":2,"total_game_level_score":0,"timestamp":1626105299012}
{"total_assessment_level_score":0,"level":9,"actual_score_in_level":1,"training_run_id":2,"hint_id":22,"syslog":{"severity":"info","timegenerated":"2021-07-12T16:15:38+00:00","@timestamp":"2021-07-12T16:15:38.569Z","programname":"kypo-training","host":"192.168.44.8","@version":"1","procid":"","fromhost-ip":"training-service","type":"syslog","facility":"security"},"type":"cz.muni.csirt.kypo.events.trainings.HintTaken","pool_id":2,"hint_title":"Which option gives you the version?","game_time":1475018,"sandbox_id":3,"training_instance_id":1,"user_ref_id":166,"training_definition_id":2,"total_game_level_score":0,"timestamp":1626106538567,"hint_penalty_points":0}
{"total_assessment_level_score":0,"level":9,"actual_score_in_level":1,"training_run_id":2,"hint_id":21,"syslog":{"severity":"info","timegenerated":"2021-07-12T16:15:47+00:00","@timestamp":"2021-07-12T16:15:47.831Z","programname":"kypo-training","host":"192.168.44.8","@version":"1","procid":"","fromhost-ip":"training-service","type":"syslog","facility":"security"},"type":"cz.muni.csirt.kypo.events.trainings.HintTaken","pool_id":2,"hint_title":"Which port should you scan?","game_time":1484279,"sandbox_id":3,"training_instance_id":1,"user_ref_id":166,"training_definition_id":2,"total_game_level_score":0,"timestamp":1626106547828,"hint_penalty_points":0}
{"total_assessment_level_score":0,"level":9,"actual_score_in_level":1,"training_run_id":2,"hint_id":23,"syslog":{"severity":"info","timegenerated":"2021-07-12T16:16:12+00:00","@timestamp":"2021-07-12T16:16:12.649Z","programname":"kypo-training","host":"192.168.44.8","@version":"1","procid":"","fromhost-ip":"training-service","type":"syslog","facility":"security"},"type":"cz.muni.csirt.kypo.events.trainings.HintTaken","pool_id":2,"hint_title":"Which tool should you use?","game_time":1509097,"sandbox_id":3,"training_instance_id":1,"user_ref_id":166,"training_definition_id":2,"total_game_level_score":0,"timestamp":1626106572647,"hint_penalty_points":0}
{"flag_content":"Webmin 1.890","total_assessment_level_score":0,"level":9,"actual_score_in_level":1,"training_run_id":2,"count":1,"syslog":{"severity":"info","timegenerated":"2021-07-12T16:23:42+00:00","@timestamp":"2021-07-12T16:23:42.752Z","programname":"kypo-training","host":"192.168.44.8","@version":"1","procid":"","fromhost-ip":"training-service","type":"syslog","facility":"security"},"type":"cz.muni.csirt.kypo.events.trainings.WrongFlagSubmitted","pool_id":2,"game_time":1959200,"sandbox_id":3,"training_instance_id":1,"user_ref_id":166,"training_definition_id":2,"total_game_level_score":0,"timestamp":1626107022750}
{"flag_content":"webmin 1.890","total_assessment_level_score":0,"level":9,"actual_score_in_level":1,"training_run_id":2,"syslog":{"severity":"info","timegenerated":"2021-07-12T16:24:12+00:00","@timestamp":"2021-07-12T16:24:12.893Z","programname":"kypo-training","host":"192.168.44.8","@version":"1","procid":"","fromhost-ip":"training-service","type":"syslog","facility":"security"},"type":"cz.muni.csirt.kypo.events.trainings.CorrectFlagSubmitted","pool_id":2,"game_time":1989337,"sandbox_id":3,"training_instance_id":1,"user_ref_id":166,"training_definition_id":2,"total_game_level_score":1,"timestamp":1626107052887}
{"total_assessment_level_score":0,"level":9,"actual_score_in_level":1,"training_run_id":2,"syslog":{"severity":"info","timegenerated":"2021-07-12T16:24:12+00:00","@timestamp":"2021-07-12T16:24:12.893Z","programname":"kypo-training","host":"192.168.44.8","@version":"1","procid":"","fromhost-ip":"training-service","type":"syslog","facility":"security"},"type":"cz.muni.csirt.kypo.events.trainings.LevelCompleted","pool_id":2,"level_type":"GAME","game_time":1989339,"sandbox_id":3,"training_instance_id":1,"user_ref_id":166,"training_definition_id":2,"total_game_level_score":1,"timestamp":1626107052893}
{"total_assessment_level_score":0,"level":10,"actual_score_in_level":1,"training_run_id":2,"syslog":{"severity":"info","timegenerated":"2021-07-12T16:24:12+00:00","@timestamp":"2021-07-12T16:24:12.986Z","programname":"kypo-training","host":"192.168.44.8","@version":"1","procid":"","fromhost-ip":"training-service","type":"syslog","facility":"security"},"type":"cz.muni.csirt.kypo.events.trainings.LevelStarted","pool_id":2,"level_type":"GAME","level_title":"Level 2: Exploiting the vulnerable service","game_time":1989435,"max_score":1,"sandbox_id":3,"training_instance_id":1,"user_ref_id":166,"training_definition_id":2,"total_game_level_score":1,"timestamp":1626107052995}
{"total_assessment_level_score":0,"level":10,"actual_score_in_level":1,"training_run_id":2,"hint_id":25,"syslog":{"severity":"info","timegenerated":"2021-07-12T16:27:19+00:00","@timestamp":"2021-07-12T16:27:19.784Z","programname":"kypo-training","host":"192.168.44.8","@version":"1","procid":"","fromhost-ip":"training-service","type":"syslog","facility":"security"},"type":"cz.muni.csirt.kypo.events.trainings.HintTaken","pool_id":2,"hint_title":"Which tool should you use?","game_time":2176232,"sandbox_id":3,"training_instance_id":1,"user_ref_id":166,"training_definition_id":2,"total_game_level_score":1,"timestamp":1626107239782,"hint_penalty_points":0}
{"total_assessment_level_score":0,"level":10,"actual_score_in_level":1,"training_run_id":2,"hint_id":27,"syslog":{"severity":"info","timegenerated":"2021-07-12T16:28:08+00:00","@timestamp":"2021-07-12T16:28:08.503Z","programname":"kypo-training","host":"192.168.44.8","@version":"1","procid":"","fromhost-ip":"training-service","type":"syslog","facility":"security"},"type":"cz.muni.csirt.kypo.events.trainings.HintTaken","pool_id":2,"hint_title":"Which exploit should you use?","game_time":2224952,"sandbox_id":3,"training_instance_id":1,"user_ref_id":166,"training_definition_id":2,"total_game_level_score":1,"timestamp":1626107288501,"hint_penalty_points":0}
{"total_assessment_level_score":0,"level":10,"actual_score_in_level":1,"training_run_id":2,"hint_id":26,"syslog":{"severity":"info","timegenerated":"2021-07-12T16:28:21+00:00","@timestamp":"2021-07-12T16:28:21.518Z","programname":"kypo-training","host":"192.168.44.8","@version":"1","procid":"","fromhost-ip":"training-service","type":"syslog","facility":"security"},"type":"cz.muni.csirt.kypo.events.trainings.HintTaken","pool_id":2,"hint_title":"How should the exploit options be set?","game_time":2237967,"sandbox_id":3,"training_instance_id":1,"user_ref_id":166,"training_definition_id":2,"total_game_level_score":1,"timestamp":1626107301516,"hint_penalty_points":0}
{"total_assessment_level_score":0,"level":10,"actual_score_in_level":1,"training_run_id":2,"hint_id":24,"syslog":{"severity":"info","timegenerated":"2021-07-12T16:28:31+00:00","@timestamp":"2021-07-12T16:28:31.567Z","programname":"kypo-training","host":"192.168.44.8","@version":"1","procid":"","fromhost-ip":"training-service","type":"syslog","facility":"security"},"type":"cz.muni.csirt.kypo.events.trainings.HintTaken","pool_id":2,"hint_title":"What are the correct options?","game_time":2248015,"sandbox_id":3,"training_instance_id":1,"user_ref_id":166,"training_definition_id":2,"total_game_level_score":1,"timestamp":1626107311565,"hint_penalty_points":0}
{"total_assessment_level_score":0,"level":10,"penalty_points":0,"actual_score_in_level":0,"training_run_id":2,"syslog":{"severity":"info","timegenerated":"2021-07-12T16:35:27+00:00","@timestamp":"2021-07-12T16:35:27.407Z","programname":"kypo-training","host":"192.168.44.8","@version":"1","procid":"","fromhost-ip":"training-service","type":"syslog","facility":"security"},"type":"cz.muni.csirt.kypo.events.trainings.SolutionDisplayed","pool_id":2,"game_time":2663855,"sandbox_id":3,"training_instance_id":1,"user_ref_id":166,"training_definition_id":2,"total_game_level_score":1,"timestamp":1626107727404}
{"flag_content":"Sauronia gonna rule us all!!!","total_assessment_level_score":0,"level":10,"actual_score_in_level":0,"training_run_id":2,"syslog":{"severity":"info","timegenerated":"2021-07-12T16:37:29+00:00","@timestamp":"2021-07-12T16:37:29.829Z","programname":"kypo-training","host":"192.168.44.8","@version":"1","procid":"","fromhost-ip":"training-service","type":"syslog","facility":"security"},"type":"cz.muni.csirt.kypo.events.trainings.CorrectFlagSubmitted","pool_id":2,"game_time":2786278,"sandbox_id":3,"training_instance_id":1,"user_ref_id":166,"training_definition_id":2,"total_game_level_score":1,"timestamp":1626107849827}
{"total_assessment_level_score":0,"level":10,"actual_score_in_level":0,"training_run_id":2,"syslog":{"severity":"info","timegenerated":"2021-07-12T16:37:29+00:00","@timestamp":"2021-07-12T16:37:29.830Z","programname":"kypo-training","host":"192.168.44.8","@version":"1","procid":"","fromhost-ip":"training-service","type":"syslog","facility":"security"},"type":"cz.muni.csirt.kypo.events.trainings.LevelCompleted","pool_id":2,"level_type":"GAME","game_time":2786280,"sandbox_id":3,"training_instance_id":1,"user_ref_id":166,"training_definition_id":2,"total_game_level_score":1,"timestamp":1626107849833}
{"total_assessment_level_score":0,"level":11,"actual_score_in_level":1,"training_run_id":2,"syslog":{"severity":"info","timegenerated":"2021-07-12T16:37:29+00:00","@timestamp":"2021-07-12T16:37:29.922Z","programname":"kypo-training","host":"192.168.44.8","@version":"1","procid":"","fromhost-ip":"training-service","type":"syslog","facility":"security"},"type":"cz.muni.csirt.kypo.events.trainings.LevelStarted","pool_id":2,"level_type":"GAME","level_title":"Level 3: Find the address of the second server","game_time":2786371,"max_score":1,"sandbox_id":3,"training_instance_id":1,"user_ref_id":166,"training_definition_id":2,"total_game_level_score":1,"timestamp":1626107849930}
{"total_assessment_level_score":0,"level":11,"actual_score_in_level":1,"training_run_id":2,"hint_id":28,"syslog":{"severity":"info","timegenerated":"2021-07-12T16:40:54+00:00","@timestamp":"2021-07-12T16:40:54.440Z","programname":"kypo-training","host":"192.168.44.8","@version":"1","procid":"","fromhost-ip":"training-service","type":"syslog","facility":"security"},"type":"cz.muni.csirt.kypo.events.trainings.HintTaken","pool_id":2,"hint_title":"Where should you start looking? (detailed)","game_time":2990889,"sandbox_id":3,"training_instance_id":1,"user_ref_id":166,"training_definition_id":2,"total_game_level_score":1,"timestamp":1626108054438,"hint_penalty_points":0}
{"total_assessment_level_score":0,"level":11,"actual_score_in_level":1,"training_run_id":2,"hint_id":29,"syslog":{"severity":"info","timegenerated":"2021-07-12T16:41:02+00:00","@timestamp":"2021-07-12T16:41:02.535Z","programname":"kypo-training","host":"192.168.44.8","@version":"1","procid":"","fromhost-ip":"training-service","type":"syslog","facility":"security"},"type":"cz.muni.csirt.kypo.events.trainings.HintTaken","pool_id":2,"hint_title":"Where should you start looking? (less detailed)","game_time":2998983,"sandbox_id":3,"training_instance_id":1,"user_ref_id":166,"training_definition_id":2,"total_game_level_score":1,"timestamp":1626108062533,"hint_penalty_points":0}
{"total_assessment_level_score":0,"level":11,"actual_score_in_level":1,"training_run_id":2,"hint_id":30,"syslog":{"severity":"info","timegenerated":"2021-07-12T16:43:27+00:00","@timestamp":"2021-07-12T16:43:27.449Z","programname":"kypo-training","host":"192.168.44.8","@version":"1","procid":"","fromhost-ip":"training-service","type":"syslog","facility":"security"},"type":"cz.muni.csirt.kypo.events.trainings.HintTaken","pool_id":2,"hint_title":"Which tool can help you with the search?","game_time":3143898,"sandbox_id":3,"training_instance_id":1,"user_ref_id":166,"training_definition_id":2,"total_game_level_score":1,"timestamp":1626108207447,"hint_penalty_points":0}
{"total_assessment_level_score":0,"level":11,"actual_score_in_level":1,"training_run_id":2,"syslog":{"severity":"info","timegenerated":"2021-07-12T16:50:59+00:00","@timestamp":"2021-07-12T16:50:59.189Z","programname":"kypo-training","host":"192.168.44.8","@version":"1","procid":"","fromhost-ip":"training-service","type":"syslog","facility":"security"},"type":"cz.muni.csirt.kypo.events.trainings.TrainingRunResumed","pool_id":2,"game_time":3595634,"sandbox_id":3,"training_instance_id":1,"user_ref_id":166,"training_definition_id":2,"total_game_level_score":1,"timestamp":1626108659183}
{"total_assessment_level_score":0,"level":11,"actual_score_in_level":1,"training_run_id":2,"hint_id":32,"syslog":{"severity":"info","timegenerated":"2021-07-12T16:51:06+00:00","@timestamp":"2021-07-12T16:51:06.187Z","programname":"kypo-training","host":"192.168.44.8","@version":"1","procid":"","fromhost-ip":"training-service","type":"syslog","facility":"security"},"type":"cz.muni.csirt.kypo.events.trainings.HintTaken","pool_id":2,"hint_title":"Where should you look to obtain the flag?","game_time":3602636,"sandbox_id":3,"training_instance_id":1,"user_ref_id":166,"training_definition_id":2,"total_game_level_score":1,"timestamp":1626108666185,"hint_penalty_points":0}
{"total_assessment_level_score":0,"level":11,"actual_score_in_level":1,"training_run_id":2,"hint_id":31,"syslog":{"severity":"info","timegenerated":"2021-07-12T16:51:26+00:00","@timestamp":"2021-07-12T16:51:26.034Z","programname":"kypo-training","host":"192.168.44.8","@version":"1","procid":"","fromhost-ip":"training-service","type":"syslog","facility":"security"},"type":"cz.muni.csirt.kypo.events.trainings.HintTaken","pool_id":2,"hint_title":"Where are the SSH keys stored?","game_time":3622481,"sandbox_id":3,"training_instance_id":1,"user_ref_id":166,"training_definition_id":2,"total_game_level_score":1,"timestamp":1626108686033,"hint_penalty_points":0}
{"total_assessment_level_score":0,"level":11,"penalty_points":0,"actual_score_in_level":0,"training_run_id":2,"syslog":{"severity":"info","timegenerated":"2021-07-12T16:51:32+00:00","@timestamp":"2021-07-12T16:51:32.307Z","programname":"kypo-training","host":"192.168.44.8","@version":"1","procid":"","fromhost-ip":"training-service","type":"syslog","facility":"security"},"type":"cz.muni.csirt.kypo.events.trainings.SolutionDisplayed","pool_id":2,"game_time":3628755,"sandbox_id":3,"training_instance_id":1,"user_ref_id":166,"training_definition_id":2,"total_game_level_score":1,"timestamp":1626108692305}
{"flag_content":"Y29yb25h","total_assessment_level_score":0,"level":11,"actual_score_in_level":0,"training_run_id":2,"syslog":{"severity":"info","timegenerated":"2021-07-12T17:00:32+00:00","@timestamp":"2021-07-12T17:00:32.441Z","programname":"kypo-training","host":"192.168.44.8","@version":"1","procid":"","fromhost-ip":"training-service","type":"syslog","facility":"security"},"type":"cz.muni.csirt.kypo.events.trainings.CorrectFlagSubmitted","pool_id":2,"game_time":4168890,"sandbox_id":3,"training_instance_id":1,"user_ref_id":166,"training_definition_id":2,"total_game_level_score":1,"timestamp":1626109232439}
{"total_assessment_level_score":0,"level":11,"actual_score_in_level":0,"training_run_id":2,"syslog":{"severity":"info","timegenerated":"2021-07-12T17:00:32+00:00","@timestamp":"2021-07-12T17:00:32.441Z","programname":"kypo-training","host":"192.168.44.8","@version":"1","procid":"","fromhost-ip":"training-service","type":"syslog","facility":"security"},"type":"cz.muni.csirt.kypo.events.trainings.LevelCompleted","pool_id":2,"level_type":"GAME","game_time":4168891,"sandbox_id":3,"training_instance_id":1,"user_ref_id":166,"training_definition_id":2,"total_game_level_score":1,"timestamp":1626109232445}
{"total_assessment_level_score":0,"level":12,"actual_score_in_level":1,"training_run_id":2,"syslog":{"severity":"info","timegenerated":"2021-07-12T17:00:32+00:00","@timestamp":"2021-07-12T17:00:32.557Z","programname":"kypo-training","host":"192.168.44.8","@version":"1","procid":"","fromhost-ip":"training-service","type":"syslog","facility":"security"},"type":"cz.muni.csirt.kypo.events.trainings.LevelStarted","pool_id":2,"level_type":"GAME","level_title":"Level 4: Find the SSH key passphrase","game_time":4169003,"max_score":1,"sandbox_id":3,"training_instance_id":1,"user_ref_id":166,"training_definition_id":2,"total_game_level_score":1,"timestamp":1626109232566}
{"total_assessment_level_score":0,"level":12,"penalty_points":0,"actual_score_in_level":0,"training_run_id":2,"syslog":{"severity":"info","timegenerated":"2021-07-12T17:01:12+00:00","@timestamp":"2021-07-12T17:01:12.353Z","programname":"kypo-training","host":"192.168.44.8","@version":"1","procid":"","fromhost-ip":"training-service","type":"syslog","facility":"security"},"type":"cz.muni.csirt.kypo.events.trainings.SolutionDisplayed","pool_id":2,"game_time":4208801,"sandbox_id":3,"training_instance_id":1,"user_ref_id":166,"training_definition_id":2,"total_game_level_score":1,"timestamp":1626109272350}
{"flag_content":"mrscorona7","total_assessment_level_score":0,"level":12,"actual_score_in_level":0,"training_run_id":2,"syslog":{"severity":"info","timegenerated":"2021-07-12T17:16:28+00:00","@timestamp":"2021-07-12T17:16:28.979Z","programname":"kypo-training","host":"192.168.44.8","@version":"1","procid":"","fromhost-ip":"training-service","type":"syslog","facility":"security"},"type":"cz.muni.csirt.kypo.events.trainings.CorrectFlagSubmitted","pool_id":2,"game_time":5125427,"sandbox_id":3,"training_instance_id":1,"user_ref_id":166,"training_definition_id":2,"total_game_level_score":1,"timestamp":1626110188977}
{"total_assessment_level_score":0,"level":12,"actual_score_in_level":0,"training_run_id":2,"syslog":{"severity":"info","timegenerated":"2021-07-12T17:16:28+00:00","@timestamp":"2021-07-12T17:16:28.979Z","programname":"kypo-training","host":"192.168.44.8","@version":"1","procid":"","fromhost-ip":"training-service","type":"syslog","facility":"security"},"type":"cz.muni.csirt.kypo.events.trainings.LevelCompleted","pool_id":2,"level_type":"GAME","game_time":5125429,"sandbox_id":3,"training_instance_id":1,"user_ref_id":166,"training_definition_id":2,"total_game_level_score":1,"timestamp":1626110188982}
{"total_assessment_level_score":0,"level":13,"actual_score_in_level":1,"training_run_id":2,"syslog":{"severity":"info","timegenerated":"2021-07-12T17:16:29+00:00","@timestamp":"2021-07-12T17:16:29.389Z","programname":"kypo-training","host":"192.168.44.8","@version":"1","procid":"","fromhost-ip":"training-service","type":"syslog","facility":"security"},"type":"cz.muni.csirt.kypo.events.trainings.LevelStarted","pool_id":2,"level_type":"GAME","level_title":"Level 5: Steal data and send them to scientists","game_time":5125837,"max_score":1,"sandbox_id":3,"training_instance_id":1,"user_ref_id":166,"training_definition_id":2,"total_game_level_score":1,"timestamp":1626110189398}
{"total_assessment_level_score":0,"level":13,"penalty_points":0,"actual_score_in_level":0,"training_run_id":2,"syslog":{"severity":"info","timegenerated":"2021-07-12T17:18:15+00:00","@timestamp":"2021-07-12T17:18:15.332Z","programname":"kypo-training","host":"192.168.44.8","@version":"1","procid":"","fromhost-ip":"training-service","type":"syslog","facility":"security"},"type":"cz.muni.csirt.kypo.events.trainings.SolutionDisplayed","pool_id":2,"game_time":5231780,"sandbox_id":3,"training_instance_id":1,"user_ref_id":166,"training_definition_id":2,"total_game_level_score":1,"timestamp":1626110295330}
{"flag_content":"connection refused","total_assessment_level_score":0,"level":13,"actual_score_in_level":0,"training_run_id":2,"count":1,"syslog":{"severity":"info","timegenerated":"2021-07-12T17:23:21+00:00","@timestamp":"2021-07-12T17:23:21.601Z","programname":"kypo-training","host":"192.168.44.8","@version":"1","procid":"","fromhost-ip":"training-service","type":"syslog","facility":"security"},"type":"cz.muni.csirt.kypo.events.trainings.WrongFlagSubmitted","pool_id":2,"game_time":5538049,"sandbox_id":3,"training_instance_id":1,"user_ref_id":166,"training_definition_id":2,"total_game_level_score":1,"timestamp":1626110601599}
{"flag_content":"We survived after all","total_assessment_level_score":0,"level":13,"actual_score_in_level":0,"training_run_id":2,"count":2,"syslog":{"severity":"info","timegenerated":"2021-07-12T17:23:33+00:00","@timestamp":"2021-07-12T17:23:33.767Z","programname":"kypo-training","host":"192.168.44.8","@version":"1","procid":"","fromhost-ip":"training-service","type":"syslog","facility":"security"},"type":"cz.muni.csirt.kypo.events.trainings.WrongFlagSubmitted","pool_id":2,"game_time":5550215,"sandbox_id":3,"training_instance_id":1,"user_ref_id":166,"training_definition_id":2,"total_game_level_score":1,"timestamp":1626110613765}
{"flag_content":"WE SURVIVE AFTER ALL","total_assessment_level_score":0,"level":13,"actual_score_in_level":0,"training_run_id":2,"syslog":{"severity":"info","timegenerated":"2021-07-12T17:23:57+00:00","@timestamp":"2021-07-12T17:23:57.741Z","programname":"kypo-training","host":"192.168.44.8","@version":"1","procid":"","fromhost-ip":"training-service","type":"syslog","facility":"security"},"type":"cz.muni.csirt.kypo.events.trainings.CorrectFlagSubmitted","pool_id":2,"game_time":5574188,"sandbox_id":3,"training_instance_id":1,"user_ref_id":166,"training_definition_id":2,"total_game_level_score":1,"timestamp":1626110637739}
{"total_assessment_level_score":0,"level":13,"actual_score_in_level":0,"training_run_id":2,"syslog":{"severity":"info","timegenerated":"2021-07-12T17:23:57+00:00","@timestamp":"2021-07-12T17:23:57.742Z","programname":"kypo-training","host":"192.168.44.8","@version":"1","procid":"","fromhost-ip":"training-service","type":"syslog","facility":"security"},"type":"cz.muni.csirt.kypo.events.trainings.LevelCompleted","pool_id":2,"level_type":"GAME","game_time":5574191,"sandbox_id":3,"training_instance_id":1,"user_ref_id":166,"training_definition_id":2,"total_game_level_score":1,"timestamp":1626110637745}
{"total_assessment_level_score":0,"level":14,"actual_score_in_level":0,"training_run_id":2,"syslog":{"severity":"info","timegenerated":"2021-07-12T17:23:57+00:00","@timestamp":"2021-07-12T17:23:57.970Z","programname":"kypo-training","host":"192.168.44.8","@version":"1","procid":"","fromhost-ip":"training-service","type":"syslog","facility":"security"},"type":"cz.muni.csirt.kypo.events.trainings.LevelStarted","pool_id":2,"level_type":"INFO","level_title":"Epilogue","game_time":5574419,"max_score":0,"sandbox_id":3,"training_instance_id":1,"user_ref_id":166,"training_definition_id":2,"total_game_level_score":1,"timestamp":1626110637979}
{"total_assessment_level_score":0,"level":14,"actual_score_in_level":0,"training_run_id":2,"syslog":{"severity":"info","timegenerated":"2021-07-12T17:24:00+00:00","@timestamp":"2021-07-12T17:24:00.856Z","programname":"kypo-training","host":"192.168.44.8","@version":"1","procid":"","fromhost-ip":"training-service","type":"syslog","facility":"security"},"type":"cz.muni.csirt.kypo.events.trainings.LevelCompleted","pool_id":2,"level_type":"INFO","game_time":5577306,"sandbox_id":3,"training_instance_id":1,"user_ref_id":166,"training_definition_id":2,"total_game_level_score":1,"timestamp":1626110640859}
{"total_assessment_level_score":0,"level":14,"actual_score_in_level":0,"training_run_id":2,"end_time":1626110640855,"syslog":{"severity":"info","timegenerated":"2021-07-12T17:24:00+00:00","@timestamp":"2021-07-12T17:24:00.857Z","programname":"kypo-training","host":"192.168.44.8","@version":"1","procid":"","fromhost-ip":"training-service","type":"syslog","facility":"security"},"type":"cz.muni.csirt.kypo.events.trainings.TrainingRunEnded","pool_id":2,"start_time":1626105063548,"game_time":5577306,"sandbox_id":3,"training_instance_id":1,"user_ref_id":166,"training_definition_id":2,"total_game_level_score":1,"timestamp":1626110640865}
