{"total_assessment_level_score":0,"level":8,"actual_score_in_level":0,"training_run_id":29,"syslog":{"severity":"info","timegenerated":"2021-07-08T17:53:53+00:00","@timestamp":"2021-07-08T17:53:53.723Z","host":"192.168.44.11","programname":"kypo-training","@version":"1","procid":"","fromhost-ip":"training-service","type":"syslog","facility":"security"},"type":"cz.muni.csirt.kypo.events.trainings.LevelStarted","pool_id":30,"level_type":"INFO","level_title":"Epilogue","game_time":8372890,"max_score":0,"sandbox_id":130,"training_instance_id":4,"user_ref_id":204,"training_definition_id":2,"total_game_level_score":5,"timestamp":1625766833732}
{"total_assessment_level_score":0,"level":8,"actual_score_in_level":0,"training_run_id":29,"syslog":{"severity":"info","timegenerated":"2021-07-08T18:17:11+00:00","@timestamp":"2021-07-08T18:17:11.920Z","host":"192.168.44.11","programname":"kypo-training","@version":"1","procid":"","fromhost-ip":"training-service","type":"syslog","facility":"security"},"type":"cz.muni.csirt.kypo.events.trainings.LevelCompleted","pool_id":30,"level_type":"INFO","game_time":9771086,"sandbox_id":130,"training_instance_id":4,"user_ref_id":204,"training_definition_id":2,"total_game_level_score":5,"timestamp":1625768231922}
{"total_assessment_level_score":0,"level":8,"actual_score_in_level":0,"training_run_id":29,"end_time":1625768231918,"syslog":{"severity":"info","timegenerated":"2021-07-08T18:17:11+00:00","@timestamp":"2021-07-08T18:17:11.920Z","host":"192.168.44.11","programname":"kypo-training","@version":"1","procid":"","fromhost-ip":"training-service","type":"syslog","facility":"security"},"type":"cz.muni.csirt.kypo.events.trainings.TrainingRunEnded","pool_id":30,"start_time":1625758460830,"game_time":9771087,"sandbox_id":130,"training_instance_id":4,"user_ref_id":204,"training_definition_id":2,"total_game_level_score":5,"timestamp":1625768231928}
