<svg width="458" height="266" viewBox="0 0 458 266" fill="none" xmlns="http://www.w3.org/2000/svg">
<g clip-path="url(#clip0)">
<path d="M346.779 186.357C346.788 186.357 346.797 186.348 346.805 186.348C346.805 186.34 346.805 186.34 346.797 186.331L346.779 186.357Z" fill="#7D7DD8"/>
<path d="M351.827 189.166C351.836 189.166 351.844 189.166 351.853 189.166C351.844 189.158 351.836 189.149 351.827 189.141C351.827 189.149 351.827 189.158 351.827 189.166Z" fill="#7D7DD8"/>
<path d="M447.121 193.755C435.057 187.27 421.717 184.213 408.788 179.986C396.32 175.908 382.461 177.094 370.397 171.706L371.904 176.188C371.83 175.257 372.999 175.685 373.501 175.776C394.607 179.583 415.796 183.274 435.716 191.555C441.604 194.002 447.607 196.985 452.095 202.019C455.299 205.612 455.463 209.278 452.07 212.673C445.194 219.553 436.144 222.256 427.242 224.983C406.861 231.237 385.78 233.907 364.764 236.873C361.511 237.334 361.347 235.225 360.309 233.264C354.545 222.338 346.927 213.06 336.066 206.782C335.44 206.419 334.937 205.851 334.377 205.381C331.652 205.282 329.552 202.942 326.719 203.206C326.258 207.012 324.948 210.341 321.128 211.923C318.764 212.904 316.524 212.327 314.63 210.63C312.25 208.496 311.979 205.373 311.114 202.58C310.587 200.874 310.052 200.742 308.643 201.574C305.102 203.667 301.388 205.406 297.452 206.642C296.579 207.935 295.278 207.68 294.026 207.573C293.129 207.828 292.223 208.084 291.325 208.339C288.69 211.173 285.94 213.917 283.461 216.875C278.207 223.129 274.987 230.462 272.871 238.274C272.253 240.54 271.479 241.66 268.91 241.981C245.926 244.874 222.935 245.121 199.918 242.492C194.393 241.858 188.883 241.067 183.374 240.35C181.192 240.432 178.763 242.097 177.017 239.361C175.123 236.634 175.535 233.289 174.678 230.273C172.109 221.251 167.802 213.25 161.626 206.23C161.115 206.098 160.605 205.974 160.086 205.842C158.208 206.032 156.43 205.834 154.914 204.574C154.264 204.384 153.605 204.194 152.955 204.005C152.073 204.351 151.497 203.964 151.061 203.214C150.756 203.099 150.451 202.983 150.146 202.868C149.002 203.123 148.145 202.761 147.627 201.681C146.951 201.352 146.284 201.022 145.609 200.693C145.37 200.586 145.131 200.478 144.893 200.371C142.315 198.633 139.746 196.902 137.168 195.164C130.827 195.312 124.882 196.878 119.315 199.976C116.836 201.352 114.736 203.502 111.722 203.824C111.904 204.689 111.385 205.15 110.784 205.678C103.315 212.302 97.8055 220.319 94.0421 229.556C93.4163 231.089 92.6669 232.077 90.7482 231.756C69.8727 228.279 49.0137 224.686 28.9453 217.707C20.9245 214.923 12.8708 211.973 6.53817 205.958C1.35842 201.03 1.72899 196.136 7.47694 191.901C17.8941 184.23 30.197 181.181 42.4258 178.174C54.5394 175.191 66.8176 172.925 79.244 171.607C77.6547 170.527 79.8205 169.44 79.2358 168.36C78.6676 168.566 78.0911 168.772 77.5229 168.987C76.5924 169.135 75.6618 169.283 74.7231 169.432C56.9439 171.961 39.3377 175.282 22.3574 181.305C15.8271 183.62 9.42861 186.339 4.27357 191.168C-1.27675 196.367 -1.41674 202.233 3.96888 207.54C6.07701 209.616 8.53925 211.412 11.0756 212.945C18.9729 217.708 27.6442 220.674 36.4226 223.319C53.4441 228.452 70.8527 231.847 88.3848 234.714C89.5623 234.904 91.9505 234.137 91.7034 236.576C90.6905 246.662 97.0726 251.869 104.509 256.434C106.707 256.376 108.552 256.994 109.598 259.128C109.738 259.219 109.886 259.268 110.051 259.293C110.265 259.408 110.479 259.515 110.693 259.631C111.377 259.927 112.068 260.232 112.752 260.537C112.999 260.619 113.238 260.702 113.485 260.784C113.806 260.875 114.119 260.966 114.44 261.056C114.687 261.163 114.926 261.279 115.173 261.386C115.486 261.468 115.79 261.559 116.103 261.641C116.35 261.748 116.606 261.855 116.853 261.963C117.166 262.037 117.487 262.111 117.8 262.193C118.047 262.292 118.294 262.399 118.541 262.498C118.722 262.539 118.911 262.581 119.093 262.622C119.274 262.679 119.455 262.729 119.628 262.787C120.023 262.91 120.418 263.025 120.814 263.149C122.37 263.141 123.951 263.075 125.252 264.171C125.45 264.204 125.656 264.237 125.854 264.27C128.826 264.69 131.807 265.11 134.78 265.53C135.513 265.621 136.246 265.712 136.979 265.802C137.58 265.341 138.156 265.349 138.708 265.876C141.121 265.876 143.534 265.876 145.947 265.876C146.531 265.712 147.116 265.547 147.709 265.382C147.132 255.816 146.037 246.266 146.597 236.659C146.704 234.854 146.49 231.847 148.071 231.855C149.545 231.863 148.845 234.92 148.664 236.494C147.651 245.261 148.532 253.954 149.232 262.671C149.306 263.553 148.928 264.467 148.755 265.366C151.777 265.036 154.807 264.706 157.83 264.377C158.167 264.311 158.513 264.245 158.851 264.179C159.419 264.031 159.987 263.891 160.555 263.742C160.745 263.742 160.918 263.701 161.091 263.627C161.346 263.528 161.593 263.429 161.848 263.339C162.161 263.264 162.474 263.19 162.787 263.116C163.182 262.968 163.578 262.811 163.965 262.663C164.508 262.465 165.06 262.259 165.603 262.061C166.007 261.897 166.41 261.74 166.814 261.575C166.979 261.551 167.127 261.501 167.267 261.411C167.506 261.287 167.736 261.155 167.975 261.031C168.486 260.793 169.004 260.554 169.515 260.315C169.745 260.175 169.984 260.043 170.215 259.903C170.363 259.878 170.503 259.812 170.627 259.721C170.849 259.581 171.063 259.441 171.285 259.301C171.631 259.087 171.977 258.873 172.331 258.658C172.545 258.502 172.759 258.345 172.982 258.181C175.823 254.835 177.033 250.831 177.149 246.587C177.206 244.396 177.824 243.91 179.866 244.025C209.915 245.722 239.981 246.472 270.071 245.829C271.809 245.788 272.566 246.348 272.871 248.071C273.785 253.171 275.663 257.612 281.262 259.202C282.127 259.243 283.066 259.095 283.519 260.125C284.145 260.315 284.77 260.512 285.396 260.702C287.356 260.636 289.143 261.204 290.823 262.193C291.161 262.259 291.498 262.333 291.828 262.407C292.725 261.905 293.532 261.905 294.191 262.811C294.726 262.894 295.253 262.984 295.789 263.067C296.645 262.432 297.427 262.498 298.119 263.322C299.585 263.437 301.051 263.553 302.508 263.668C303.612 263.52 304.715 263.372 305.819 263.231C304.789 254.003 303.744 244.766 301.463 235.728C301.257 234.928 300.063 233.528 301.594 233.157C302.764 232.868 302.887 234.5 303.151 235.423C305.794 244.676 306.741 254.201 307.515 263.751C307.705 263.784 307.902 263.816 308.092 263.849C309.945 262.861 311.822 263.017 313.716 263.709C315.017 263.643 316.327 263.578 317.628 263.512C318.542 263.19 319.406 262.49 320.444 263.149C320.806 263.116 321.169 263.083 321.531 263.05C321.745 263.034 321.959 263.009 322.165 262.993C322.495 262.935 322.824 262.877 323.153 262.819C325.904 261.798 328.728 261.246 331.676 261.369C332.014 261.287 332.352 261.205 332.689 261.122C334.69 260.002 336.864 259.548 339.129 259.449C339.434 259.367 339.738 259.293 340.043 259.211C340.06 258.996 340.076 258.79 340.092 258.576C338.841 249.364 335.736 240.729 331.948 232.3C331.594 231.517 330.293 230.372 331.767 229.729C332.986 229.202 333.365 230.71 333.793 231.575C337.976 239.979 340.043 249.068 342.299 258.098C345.28 258.016 347.71 256.376 350.328 255.288C356.34 252.784 361.643 249.685 361.627 242.006C361.627 240.268 363.175 240.432 364.336 240.268C374.053 238.908 383.811 237.845 393.471 236.156C411.612 232.984 429.77 229.655 446.356 221.078C451.939 218.185 457.81 214.791 458 207.523C458.181 200.371 452.565 196.68 447.121 193.755Z" fill="#775CD6"/>
<path d="M356.834 152.64C355.113 152.03 355.064 150.308 354.685 149.006C352 139.786 349.126 130.599 347.035 121.247C346.911 120.703 346.854 120.159 346.862 119.632C346.87 115.899 349.604 112.463 350.782 108.871C357.345 88.8402 360.573 68.3482 360.194 47.3124C360.087 41.487 359.387 35.678 358.918 29.8691C358.811 28.5672 357.88 28.9792 357.032 29.0287C332.121 30.4706 309.08 38.3971 286.846 49.1663C286.269 49.4465 285.825 49.9985 285.257 50.2869C282.185 51.8277 278.792 55 276.075 54.5056C270.096 53.418 264.455 50.4682 258.683 48.2764C292.067 26.2519 327.452 9.38538 367.935 5.48803C370.998 5.1914 372.571 6.1472 373.502 9.10523C379.719 28.938 381.053 49.2982 379.76 69.856C378.023 97.3764 371.838 123.809 359.173 148.495C358.432 149.888 357.608 151.255 356.834 152.64Z" fill="#775CD6"/>
<path d="M204.851 39.9871C204.077 43.3489 203.089 45.5159 198.955 47.1226C190.399 50.4432 184.626 48.408 177.503 42.9946C163.199 32.1182 147.726 22.8404 130.202 17.6083C121.259 14.9386 120.139 15.2847 117.314 23.9857C108.758 50.3196 106.979 77.2385 110.438 104.611C110.817 107.61 110.562 110.518 109.384 113.394C106.856 119.607 104.501 125.894 102.03 132.131C101.8 132.724 101.907 134.397 100.466 133.004C97.2541 120.274 96.1177 107.264 95.7718 94.2121C94.973 63.9232 98.687 34.1864 107.276 5.07577C108.404 1.25258 110.175 -0.139915 114.16 0.0166378C129.189 0.585172 143.131 5.19937 156.735 11.0989C173.097 18.1933 188.217 27.4299 202.57 37.9766C203.385 38.5699 204.094 39.3114 204.851 39.9871Z" fill="#775CD6"/>
<path d="M340.077 258.609C338.825 249.398 335.72 240.762 331.932 232.333C331.578 231.551 330.277 230.405 331.751 229.763C332.97 229.235 333.349 230.743 333.777 231.608C337.96 240.013 340.027 249.101 342.284 258.132C342.061 258.305 341.847 258.486 341.625 258.659C341.114 258.642 340.595 258.626 340.077 258.609Z" fill="#AAAAD4"/>
<path d="M305.794 263.28C304.765 254.044 303.719 244.815 301.438 235.776C301.232 234.977 300.038 233.576 301.57 233.206C302.739 232.917 302.863 234.549 303.126 235.471C305.77 244.725 306.717 254.25 307.491 263.799C307.343 263.882 307.194 263.931 307.021 263.931C306.61 263.709 306.206 263.494 305.794 263.28Z" fill="#AAAAD4"/>
<path d="M148.739 265.407C151.761 265.077 154.791 264.748 157.814 264.418C153.968 265.802 149.99 266.181 145.931 265.918C146.515 265.753 147.1 265.588 147.693 265.423C148.047 265.423 148.393 265.415 148.739 265.407Z" fill="#B2B2D8"/>
<path d="M323.138 262.861C325.888 261.839 328.713 261.287 331.661 261.411C328.902 262.383 326.069 262.927 323.138 262.861Z" fill="#B2B2D8"/>
<path d="M104.493 256.475C106.692 256.418 108.537 257.036 109.582 259.17C107.647 258.716 105.877 257.958 104.493 256.475Z" fill="#B2B2D8"/>
<path d="M125.838 264.303C128.811 264.723 131.792 265.143 134.764 265.563C131.709 265.728 128.72 265.39 125.838 264.303Z" fill="#B2B2D8"/>
<path d="M308.067 263.891C309.92 262.902 311.798 263.059 313.692 263.751C311.839 264.501 309.953 264.393 308.067 263.891Z" fill="#B2B2D8"/>
<path d="M332.674 261.164C334.675 260.043 336.849 259.59 339.113 259.491C337.112 260.62 334.955 261.114 332.674 261.164Z" fill="#B2B2D8"/>
<path d="M285.372 260.751C287.332 260.685 289.119 261.254 290.799 262.243C288.831 262.309 287.011 261.88 285.372 260.751Z" fill="#B2B2D8"/>
<path d="M305.795 263.281C306.207 263.495 306.61 263.71 307.022 263.924C305.482 264.377 303.967 264.501 302.484 263.718C303.588 263.578 304.691 263.43 305.795 263.281Z" fill="#B2B2D8"/>
<path d="M120.798 263.182C122.354 263.174 123.935 263.108 125.236 264.204C123.655 264.311 122.165 264.006 120.798 263.182Z" fill="#B2B2D8"/>
<path d="M295.756 263.116C296.613 262.482 297.395 262.548 298.087 263.371C297.263 263.758 296.473 263.758 295.756 263.116Z" fill="#B2B2D8"/>
<path d="M317.604 263.553C318.518 263.231 319.382 262.531 320.42 263.19C319.555 263.841 318.592 263.775 317.604 263.553Z" fill="#B2B2D8"/>
<path d="M291.804 262.456C292.702 261.954 293.509 261.954 294.168 262.86C293.377 262.72 292.595 262.588 291.804 262.456Z" fill="#B2B2D8"/>
<path d="M281.238 259.252C282.103 259.293 283.042 259.145 283.495 260.174C282.573 260.29 281.831 259.952 281.238 259.252Z" fill="#B2B2D8"/>
<path d="M77.5069 169.02C76.5763 169.168 75.6458 169.316 74.707 169.464C75.6376 169.316 76.5763 169.168 77.5069 169.02Z" fill="#B2B2D8"/>
<path d="M136.963 265.844C137.564 265.383 138.141 265.391 138.693 265.918C138.116 265.893 137.54 265.869 136.963 265.844Z" fill="#B2B2D8"/>
<path d="M158.843 264.228C159.411 264.08 159.98 263.94 160.548 263.792C159.971 263.94 159.411 264.08 158.843 264.228Z" fill="#B2B2D8"/>
<path d="M340.077 258.608C340.596 258.625 341.115 258.641 341.634 258.658C341.098 258.855 340.563 259.045 340.027 259.243C340.044 259.037 340.06 258.823 340.077 258.608Z" fill="#B2B2D8"/>
<path d="M162.771 263.157C163.166 263.009 163.561 262.852 163.948 262.704C163.561 262.861 163.166 263.009 162.771 263.157Z" fill="#B2B2D8"/>
<path d="M165.587 262.102C165.991 261.937 166.394 261.781 166.798 261.616C166.394 261.781 165.991 261.946 165.587 262.102Z" fill="#B2B2D8"/>
<path d="M170.61 259.771C170.833 259.631 171.047 259.491 171.269 259.351C171.047 259.491 170.833 259.631 170.61 259.771Z" fill="#B2B2D8"/>
<path d="M110.026 259.326C110.241 259.441 110.455 259.549 110.669 259.664C110.455 259.549 110.241 259.441 110.026 259.326Z" fill="#B2B2D8"/>
<path d="M169.499 260.364C169.73 260.224 169.969 260.092 170.199 259.952C169.969 260.092 169.73 260.232 169.499 260.364Z" fill="#B2B2D8"/>
<path d="M112.735 260.569C112.982 260.652 113.221 260.734 113.468 260.816C113.221 260.734 112.974 260.652 112.735 260.569Z" fill="#B2B2D8"/>
<path d="M114.424 261.089C114.671 261.196 114.91 261.311 115.157 261.418C114.91 261.311 114.663 261.196 114.424 261.089Z" fill="#B2B2D8"/>
<path d="M167.25 261.46C167.489 261.336 167.72 261.205 167.958 261.081C167.72 261.205 167.481 261.336 167.25 261.46Z" fill="#B2B2D8"/>
<path d="M116.079 261.674C116.326 261.781 116.582 261.888 116.829 261.995C116.582 261.888 116.326 261.781 116.079 261.674Z" fill="#B2B2D8"/>
<path d="M172.307 258.707C172.521 258.551 172.735 258.394 172.957 258.229C172.743 258.394 172.529 258.551 172.307 258.707Z" fill="#B2B2D8"/>
<path d="M117.775 262.227C118.023 262.325 118.27 262.432 118.517 262.531C118.27 262.432 118.023 262.325 117.775 262.227Z" fill="#B2B2D8"/>
<path d="M119.068 262.654C119.25 262.712 119.431 262.761 119.604 262.819C119.431 262.761 119.25 262.704 119.068 262.654Z" fill="#B2B2D8"/>
<path d="M321.507 263.091C321.721 263.074 321.935 263.05 322.141 263.033C321.935 263.05 321.721 263.074 321.507 263.091Z" fill="#B2B2D8"/>
<path d="M161.074 263.676C161.33 263.577 161.577 263.478 161.832 263.388C161.577 263.478 161.33 263.577 161.074 263.676Z" fill="#B2B2D8"/>
<path d="M294.002 207.589C293.104 207.845 292.198 208.1 291.301 208.356C286.483 208.694 281.658 209.138 276.832 208.496C262.166 206.535 250.637 199.407 242.13 187.328C245.309 185.812 244.312 183.958 242.501 182.121C240.211 179.797 237.864 177.531 235.55 175.232C234.875 170.173 233.162 165.353 232.635 160.228C230.008 134.586 246.215 107.338 272.55 99.9881C273.167 99.8151 273.834 99.8398 274.485 99.7656C275.366 100.029 276.297 100.202 277.128 100.573C291.144 106.811 305.588 111.573 320.88 113.493C340.455 133.581 340.809 169.934 321.523 190.492C319.629 192.511 319.645 193.393 322.165 194.62C325.657 196.318 326.917 199.44 326.719 203.222C326.258 207.029 324.948 210.358 321.127 211.94C318.764 212.92 316.524 212.344 314.63 210.646C312.25 208.512 311.978 205.389 311.114 202.596C310.587 200.891 310.051 200.759 308.643 201.591C305.102 203.684 301.388 205.422 297.452 206.658C296.291 206.963 295.146 207.276 294.002 207.589ZM293.697 155.968C293.623 147.819 291.754 140.222 287.191 133.392C279.006 121.147 266.39 119.244 257.183 128.876C244.666 141.969 243.579 168.707 254.985 182.722C261.433 190.649 270.4 192.049 278.858 186.306C289.555 179.039 293.598 168.451 293.697 155.968Z" fill="white"/>
<path d="M154.882 204.598C154.231 204.408 153.573 204.219 152.922 204.038C152.288 203.774 151.662 203.51 151.028 203.247C150.723 203.131 150.419 203.016 150.114 202.901C149.447 202.134 148.648 201.656 147.594 201.714C146.919 201.384 146.252 201.055 145.576 200.725C145.338 200.618 145.099 200.511 144.86 200.396C142.283 198.657 139.713 196.927 137.136 195.188C132.071 189.61 126.966 184.114 123.77 177.086C119.431 167.536 117.866 157.632 118.55 147.209C118.912 141.68 121.168 136.58 121.662 131.117C138.742 121.394 155.096 110.707 168.354 95.9007C197.885 95.0108 221.148 117.324 221.84 146.953C222.079 157.162 220.242 166.803 215.787 175.965C215.598 176.344 215.68 176.863 215.639 177.308C214.017 178.948 212.559 180.81 210.731 182.17C208.96 183.48 209.364 184.419 210.574 185.63C210.196 185.869 209.71 186.026 209.438 186.347C196.962 201.36 181.192 208.388 161.593 206.221C161.083 206.089 160.572 205.966 160.053 205.834C158.332 205.447 156.603 205.018 154.882 204.598ZM198.239 129.205C198.206 129.09 198.132 129.016 198.016 128.983C197.909 128.859 197.802 128.736 197.695 128.612C197.687 128.505 197.629 128.431 197.53 128.398C197.415 128.258 197.308 128.118 197.193 127.969L197.045 127.788C196.855 127.549 196.658 127.31 196.468 127.071C196.435 126.939 196.361 126.841 196.238 126.783L196.205 126.536L195.966 126.478C195.925 126.346 195.842 126.256 195.719 126.206L195.669 125.959L195.422 125.909C195.373 125.778 195.291 125.695 195.159 125.646L195.109 125.399L194.862 125.349C194.813 125.217 194.731 125.135 194.599 125.085L194.549 124.838L194.302 124.805C194.236 124.682 194.138 124.599 193.998 124.575C193.767 124.393 193.536 124.204 193.306 124.023C193.265 123.924 193.191 123.858 193.084 123.841C192.952 123.742 192.82 123.644 192.688 123.545C192.631 123.446 192.548 123.38 192.433 123.372L192.351 123.133L192.095 123.124C191.997 123.001 191.873 122.927 191.717 122.91C191.478 122.762 191.239 122.614 191 122.465C190.918 122.358 190.802 122.309 190.671 122.309C190.407 122.177 190.144 122.037 189.88 121.905C189.781 121.806 189.658 121.757 189.518 121.765C189.081 121.6 188.653 121.435 188.217 121.271C188.126 121.18 188.019 121.139 187.887 121.155C185.005 119.812 182.123 119.96 179.232 121.155C179.101 121.139 178.985 121.18 178.887 121.271C178.45 121.427 178.005 121.592 177.569 121.748C177.437 121.74 177.322 121.781 177.223 121.88C176.951 122.012 176.68 122.144 176.4 122.276C176.268 122.276 176.169 122.325 176.087 122.424C175.831 122.572 175.568 122.721 175.313 122.869C175.181 122.877 175.074 122.935 174.992 123.05C174.86 123.133 174.736 123.223 174.604 123.306C174.489 123.314 174.407 123.372 174.357 123.479C174.11 123.652 173.863 123.817 173.625 123.99C173.493 124.006 173.394 124.08 173.32 124.196C173.205 124.294 173.081 124.393 172.966 124.492C160.078 134.668 156.488 159.494 165.521 175.957C173.657 190.78 189.065 191.645 197.95 177.259C207.256 162.205 207.89 146.443 199.284 130.647C199.103 130.375 198.93 130.095 198.749 129.823C198.733 129.708 198.667 129.626 198.56 129.584C198.461 129.436 198.354 129.321 198.239 129.205Z" fill="white"/>
<path d="M347.841 196.845C353.606 196.845 358.728 198.996 363.776 201.5C365.48 202.349 367.49 203.536 369.285 202.02C371.187 200.413 370.1 198.328 369.31 196.59C366.806 191.069 364.155 185.623 361.61 180.119C361.281 179.402 360.869 178.281 361.182 177.787C361.734 176.922 362.697 177.779 363.455 177.976C365.349 178.462 367.193 179.245 369.12 179.517C370.899 179.764 373.32 180.185 372.027 176.782C371.393 175.117 372.892 175.686 373.477 175.785C394.583 179.591 415.771 183.283 435.691 191.563C441.579 194.011 447.582 196.993 452.07 202.028C455.274 205.62 455.438 209.287 452.046 212.682C445.169 219.562 436.119 222.264 427.217 224.992C406.836 231.246 385.755 233.915 364.739 236.881C361.487 237.343 361.322 235.233 360.284 233.272C354.52 222.347 346.903 213.069 336.041 206.79C335.415 206.428 334.913 205.859 334.353 205.39C337.235 201.838 340.916 199.358 345.05 197.496C345.626 197.298 346.203 197.1 346.771 196.903C347.141 196.886 347.487 196.87 347.841 196.845ZM436.498 198.617C435.839 198.74 435.172 198.872 434.497 198.996C435.131 199.243 435.757 199.622 436.416 199.704C437.198 199.795 438.087 199.836 438.598 198.971C437.915 198.856 437.231 198.74 436.498 198.617Z" fill="#EDE9FB"/>
<path d="M111.698 203.856C111.879 204.722 111.36 205.183 110.759 205.71C103.29 212.335 97.7806 220.352 94.0173 229.589C93.3914 231.121 92.6421 232.11 90.7233 231.789C69.8479 228.312 48.9889 224.719 28.9205 217.74C20.8997 214.955 12.846 212.005 6.51332 205.99C1.33357 201.063 1.70414 196.169 7.4521 191.934C17.8692 184.263 30.1722 181.214 42.401 178.206C54.5145 175.224 66.7927 172.958 79.2192 171.639C79.9603 171.598 80.7015 171.565 81.4426 171.524C81.632 171.466 81.8296 171.4 82.0191 171.343C89.7928 170.634 89.9081 170.782 86.927 178.009C85.3295 181.873 83.6413 185.704 82.0932 189.594C81.6238 190.772 81.0967 192.214 82.1673 193.293C83.2049 194.348 84.4401 193.45 85.5436 193.12C86.5235 192.832 87.4623 192.42 88.4176 192.065C96.496 189.033 96.7842 189.264 102.557 195.674C105.291 198.682 108.634 201.137 111.698 203.856Z" fill="#EDE9FB"/>
<path d="M210.567 185.655C209.356 184.444 208.961 183.505 210.723 182.195C212.551 180.835 214.009 178.973 215.631 177.333C216.315 176.88 217.08 176.501 217.682 175.949C223.446 170.667 229.408 170.865 235.543 175.232C237.865 177.523 240.204 179.797 242.493 182.121C244.305 183.958 245.301 185.812 242.123 187.328C231.426 190.261 220.852 190.698 210.567 185.655Z" fill="#775CD6"/>
<path d="M125.771 125.201C126.257 121.172 129 118.387 131.396 115.528C140.043 105.204 150.559 97.9858 164.327 96.4697C153.564 108.112 140.603 116.871 127.106 124.921C126.735 125.135 126.224 125.111 125.771 125.201Z" fill="white"/>
<path d="M125.771 125.202C126.215 125.111 126.734 125.136 127.105 124.921C140.602 116.871 153.572 108.113 164.327 96.47C168.115 92.1442 171.894 87.8102 175.715 83.5091C176.292 82.8581 176.975 81.5398 177.848 82.1578C178.878 82.8911 177.634 83.8222 177.165 84.4401C174.283 88.3045 171.293 92.0948 168.345 95.9097C155.095 110.716 138.741 121.403 121.653 131.126C119.619 131.909 117.585 132.691 115.551 133.466C114.785 133.499 114.011 133.524 113.237 133.557C117.223 131.035 121.209 128.522 125.203 126.001C125.4 125.721 125.598 125.432 125.804 125.152L125.771 125.202Z" fill="#775CD6"/>
<path d="M320.873 113.492C305.589 111.572 291.136 106.818 277.121 100.572C276.289 100.202 275.358 100.029 274.477 99.7649C270.599 97.0705 266.448 94.6893 263.821 90.5612C263.426 89.9432 262.1 89.4488 263.031 88.559C263.821 87.8092 264.628 88.7238 265.139 89.3088C269.075 93.7582 274.033 96.6173 279.525 98.6772C291.63 103.605 303.793 108.351 316.92 109.858C323.45 110.872 329.98 111.885 336.511 112.899C336.857 112.957 337.202 113.055 337.548 113.138C337.178 113.195 336.815 113.253 336.445 113.311C331.265 114.135 326.069 114.151 320.873 113.492Z" fill="#775CD6"/>
<path d="M316.928 109.86C303.801 108.36 291.638 103.606 279.533 98.6784C293.673 96.7998 306.091 100.681 316.928 109.86Z" fill="white"/>
<path d="M113.246 133.556C114.02 133.532 114.786 133.499 115.56 133.466C114.819 133.754 114.103 134.125 113.337 134.306C112.711 134.455 112.028 134.38 111.377 134.405C111.986 134.125 112.612 133.845 113.246 133.556Z" fill="#7D7DD8"/>
<path d="M346.789 196.91C346.212 197.108 345.636 197.306 345.067 197.503C345.323 196.383 345.891 196.161 346.789 196.91Z" fill="#D1D1ED"/>
<path d="M346.805 186.33C346.525 186.166 346.245 186.001 345.965 185.828C346.072 185.721 346.179 185.614 346.286 185.507C346.451 185.787 346.616 186.067 346.789 186.347C346.78 186.355 346.805 186.33 346.805 186.33Z" fill="#7D7DD8"/>
<path d="M125.804 125.16C125.607 125.44 125.409 125.728 125.203 126.008C125.401 125.72 125.607 125.44 125.804 125.16Z" fill="white"/>
<path d="M82.0356 171.344C81.8461 171.401 81.6484 171.467 81.459 171.525C81.6484 171.459 81.8379 171.401 82.0356 171.344Z" fill="#7D7DD8"/>
<path d="M148.738 265.407C148.392 265.415 148.038 265.415 147.692 265.424C147.116 255.857 146.021 246.308 146.581 236.7C146.688 234.896 146.474 231.888 148.055 231.897C149.529 231.905 148.829 234.962 148.648 236.535C147.635 245.302 148.516 253.995 149.216 262.713C149.282 263.594 148.911 264.509 148.738 265.407Z" fill="#AAAAD4"/>
<path d="M114.951 261.427C114.605 261.402 114.259 261.369 113.913 261.345C114.168 252.652 113.905 243.934 115.288 235.308C115.544 233.693 115.593 230.949 117.174 231.114C118.64 231.262 117.676 233.948 117.364 235.357C115.601 243.176 115.725 251.103 115.667 259.038C115.651 259.837 115.198 260.628 114.951 261.427Z" fill="#AAAAD4"/>
<path d="M359.651 196.318C359.107 195.082 356.859 196.582 356.982 194.884C357.015 194.398 359.28 194.019 360.556 193.706C360.985 193.599 361.997 193.689 361.454 194.448C360.985 195.098 361.001 196.392 359.651 196.318Z" fill="#D1D1ED"/>
<path d="M176.984 239.386C179.101 239.715 181.225 240.045 183.342 240.375C181.159 240.457 178.73 242.121 176.984 239.386Z" fill="#AAAAD4"/>
<path d="M357.748 183.579C356.282 184.032 355.451 184.353 354.594 184.535C354.084 184.642 353.614 184.32 353.87 183.752C354.29 182.804 355.228 182.953 356.044 183.01C356.414 183.035 356.785 183.249 357.748 183.579Z" fill="#D1D1ED"/>
<path d="M154.882 204.599C156.603 205.019 158.332 205.447 160.053 205.868C158.176 206.057 156.397 205.859 154.882 204.599Z" fill="#B2B2D8"/>
<path d="M351.827 189.141C351.877 190.286 351.679 191.332 350.608 191.983C350.584 192 350.221 191.662 350.197 191.464C350.049 190.212 350.353 189.248 351.852 189.165L351.827 189.141Z" fill="#D1D1ED"/>
<path d="M147.594 201.715C148.648 201.657 149.447 202.135 150.114 202.901C148.969 203.156 148.113 202.793 147.594 201.715Z" fill="#B2B2D8"/>
<path d="M294.002 207.589C295.147 207.276 296.283 206.963 297.428 206.658C296.555 207.944 295.254 207.688 294.002 207.589Z" fill="#B2B2D8"/>
<path d="M151.028 203.247C151.663 203.511 152.289 203.774 152.923 204.038C152.042 204.375 151.457 203.988 151.028 203.247Z" fill="#B2B2D8"/>
<path d="M363.661 167.792C363.48 168.072 363.307 168.352 363.126 168.632C363.018 168.525 362.92 168.426 362.812 168.319C363.093 168.138 363.373 167.965 363.661 167.792C363.653 167.784 363.661 167.792 363.661 167.792Z" fill="#B2B2D8"/>
<path d="M348.146 189.857C348.221 189.709 348.254 189.495 348.361 189.454C348.46 189.413 348.715 189.528 348.748 189.627C348.789 189.726 348.682 189.973 348.575 190.014C348.476 190.055 348.303 189.915 348.146 189.857Z" fill="#D1D1ED"/>
<path d="M144.86 200.396C145.099 200.503 145.338 200.61 145.577 200.725C145.338 200.618 145.099 200.503 144.86 200.396Z" fill="#B2B2D8"/>
<path d="M293.697 155.968C293.598 168.443 289.563 179.039 278.858 186.306C270.401 192.049 261.433 190.648 254.985 182.722C243.58 168.706 244.667 141.969 257.184 128.876C266.39 119.244 279.006 121.147 287.192 133.391C291.754 140.23 293.623 147.819 293.697 155.968ZM277.631 155.169C277.96 149.862 276.98 146.36 274.625 143.229C270.648 137.948 265.328 138.014 261.96 143.715C257.645 151.008 257.011 158.489 261.927 165.88C265.427 171.145 272.295 170.849 275.515 165.419C277.689 161.76 277.335 157.698 277.631 155.169Z" fill="#775CD6"/>
<path d="M199.301 130.623C207.907 146.418 207.272 162.18 197.967 177.234C189.082 191.612 173.666 190.755 165.538 175.932C156.504 159.47 160.095 134.652 172.982 124.468C173.098 124.369 173.221 124.27 173.345 124.171C173.411 124.056 173.509 123.981 173.641 123.965C173.888 123.792 174.135 123.627 174.382 123.454C174.432 123.347 174.514 123.289 174.629 123.281C174.753 123.199 174.885 123.108 175.016 123.026C175.09 122.919 175.198 122.853 175.338 122.844C175.593 122.696 175.856 122.548 176.112 122.399C176.194 122.301 176.293 122.251 176.416 122.251C176.688 122.119 176.96 121.987 177.24 121.856C177.33 121.757 177.446 121.716 177.577 121.724C178.014 121.567 178.459 121.402 178.895 121.246C178.994 121.155 179.109 121.114 179.241 121.131C182.123 121.131 185.005 121.131 187.896 121.131C188.027 121.114 188.135 121.155 188.225 121.246C188.662 121.411 189.09 121.575 189.526 121.74C189.666 121.732 189.79 121.781 189.889 121.88C190.152 122.012 190.416 122.152 190.679 122.284C190.811 122.284 190.926 122.342 191.009 122.441C191.247 122.589 191.486 122.737 191.725 122.886C191.881 122.902 192.005 122.976 192.096 123.1L192.186 123.33L192.433 123.355C192.548 123.372 192.639 123.429 192.688 123.528C192.82 123.627 192.952 123.726 193.092 123.825C193.199 123.841 193.273 123.899 193.306 124.006C193.537 124.187 193.767 124.377 194.006 124.558C194.146 124.591 194.245 124.665 194.311 124.789L194.377 125.02L194.607 125.077C194.739 125.127 194.821 125.209 194.871 125.341C194.854 125.555 194.953 125.654 195.167 125.638C195.299 125.687 195.381 125.769 195.431 125.901C195.414 126.115 195.513 126.214 195.727 126.206C195.851 126.256 195.933 126.346 195.974 126.478C195.949 126.684 196.04 126.791 196.254 126.783C196.378 126.841 196.46 126.939 196.485 127.071C196.674 127.31 196.872 127.549 197.061 127.788C197.061 127.788 197.209 127.969 197.201 127.969C197.316 128.109 197.423 128.25 197.539 128.398C197.638 128.439 197.695 128.513 197.703 128.612C197.811 128.736 197.918 128.859 198.025 128.983C198.14 129.016 198.214 129.098 198.247 129.205C198.354 129.321 198.469 129.436 198.585 129.551C198.692 129.593 198.758 129.675 198.774 129.79C198.939 130.071 199.12 130.342 199.301 130.623ZM196.814 150.628C196.584 149.327 196.32 147.094 195.777 144.935C194.92 141.532 192.903 139.011 189.353 138.236C185.936 137.486 183.432 139.324 181.275 141.705C175.642 147.934 176.622 160.203 183.144 165.493C187.097 168.698 191.074 168.022 193.767 163.647C196.048 159.947 196.658 155.811 196.814 150.628Z" fill="#775CD6"/>
<path d="M187.879 121.138C184.997 121.138 182.107 121.138 179.225 121.138C182.115 119.944 184.997 119.787 187.879 121.138Z" fill="#7D7DD8"/>
<path d="M178.887 121.246C178.451 121.403 178.006 121.567 177.569 121.724C178.006 121.567 178.442 121.411 178.887 121.246Z" fill="#7D7DD8"/>
<path d="M189.51 121.74C189.074 121.576 188.637 121.411 188.209 121.246C188.646 121.411 189.074 121.576 189.51 121.74Z" fill="#7D7DD8"/>
<path d="M199.301 130.622C199.12 130.351 198.947 130.071 198.766 129.799C198.939 130.071 199.12 130.342 199.301 130.622Z" fill="#7D7DD8"/>
<path d="M177.223 121.856C176.951 121.988 176.671 122.12 176.399 122.252C176.679 122.12 176.951 121.988 177.223 121.856Z" fill="#7D7DD8"/>
<path d="M190.654 122.292C190.39 122.16 190.127 122.02 189.863 121.889C190.135 122.02 190.399 122.152 190.654 122.292Z" fill="#7D7DD8"/>
<path d="M197.053 127.788C196.864 127.549 196.666 127.31 196.477 127.071C196.666 127.31 196.855 127.549 197.053 127.788Z" fill="#7D7DD8"/>
<path d="M176.095 122.408C175.839 122.556 175.576 122.705 175.32 122.853C175.576 122.705 175.839 122.556 176.095 122.408Z" fill="#7D7DD8"/>
<path d="M191.701 122.894C191.462 122.746 191.223 122.597 190.984 122.449C191.223 122.597 191.462 122.746 191.701 122.894Z" fill="#7D7DD8"/>
<path d="M174.366 123.462C174.119 123.635 173.872 123.8 173.625 123.973C173.88 123.8 174.119 123.627 174.366 123.462Z" fill="#7D7DD8"/>
<path d="M193.989 124.558C193.759 124.376 193.52 124.187 193.289 124.006C193.528 124.195 193.759 124.376 193.989 124.558Z" fill="#7D7DD8"/>
<path d="M194.59 125.078L194.36 125.02L194.294 124.798L194.541 124.831L194.59 125.078Z" fill="#7D7DD8"/>
<path d="M173.328 124.172C173.205 124.271 173.089 124.37 172.966 124.468C173.089 124.37 173.213 124.271 173.328 124.172Z" fill="#7D7DD8"/>
<path d="M193.076 123.833C192.944 123.734 192.804 123.635 192.672 123.536C192.812 123.635 192.944 123.734 193.076 123.833Z" fill="#7D7DD8"/>
<path d="M195.151 125.637C194.937 125.654 194.838 125.555 194.854 125.341L195.101 125.39L195.151 125.637Z" fill="#7D7DD8"/>
<path d="M192.417 123.355L192.17 123.331L192.079 123.108L192.334 123.117L192.417 123.355Z" fill="#7D7DD8"/>
<path d="M175 123.025C174.869 123.116 174.745 123.198 174.613 123.281C174.745 123.198 174.877 123.116 175 123.025Z" fill="#7D7DD8"/>
<path d="M195.71 126.197C195.496 126.214 195.397 126.107 195.414 125.893L195.661 125.942L195.71 126.197Z" fill="#7D7DD8"/>
<path d="M196.238 126.774C196.032 126.774 195.933 126.676 195.958 126.47L196.205 126.527L196.238 126.774Z" fill="#7D7DD8"/>
<path d="M197.53 128.39C197.415 128.25 197.308 128.102 197.192 127.962C197.308 128.11 197.415 128.25 197.53 128.39Z" fill="#7D7DD8"/>
<path d="M198.017 128.983C197.909 128.859 197.802 128.736 197.695 128.612C197.802 128.736 197.909 128.859 198.017 128.983Z" fill="#7D7DD8"/>
<path d="M198.576 129.551C198.461 129.436 198.354 129.32 198.238 129.205C198.354 129.32 198.461 129.436 198.576 129.551Z" fill="#7D7DD8"/>
<path d="M436.498 198.616C437.231 198.74 437.915 198.855 438.598 198.971C438.079 199.836 437.198 199.794 436.416 199.704C435.757 199.621 435.139 199.242 434.497 198.995C435.172 198.863 435.839 198.74 436.498 198.616Z" fill="#7D7DD8"/>
<path d="M246.429 204.154C247.228 204.393 248.018 204.656 248.825 204.879C249.69 205.109 250.629 205.571 250.538 206.452C250.407 207.614 249.114 207.713 248.298 207.524C243.514 206.419 238.318 209.979 233.64 205.727C232.035 204.269 229.045 205.777 227.275 207.416C223.734 210.704 220.012 210.638 216.314 208.092C211.003 204.442 205.881 202.473 200.701 208.207C200.462 208.471 199.902 208.43 199.49 208.537C199.573 208.043 199.507 207.449 199.754 207.054C202.488 202.637 208.647 200.882 213.317 203.206C218.076 205.579 222.474 208.232 227.901 203.808C230.585 201.616 234.719 201.813 237.922 204.211C240.097 205.843 242.048 204.17 244.099 204.121C244.865 204.129 245.647 204.145 246.429 204.154Z" fill="#775CD6"/>
<path d="M246.43 204.152C245.648 204.144 244.873 204.128 244.091 204.12C244.873 203.576 245.656 203.568 246.43 204.152Z" fill="#7D7DD8"/>
<path d="M277.631 155.169C277.335 157.69 277.689 161.753 275.515 165.419C272.295 170.849 265.427 171.138 261.927 165.881C257.011 158.498 257.645 151.016 261.96 143.716C265.337 138.014 270.648 137.948 274.626 143.23C276.981 146.361 277.952 149.863 277.631 155.169Z" fill="white"/>
<path d="M196.814 150.629C196.657 155.811 196.048 159.948 193.767 163.647C191.074 168.022 187.097 168.698 183.144 165.493C176.622 160.203 175.642 147.926 181.275 141.705C183.424 139.324 185.936 137.486 189.353 138.236C192.894 139.019 194.912 141.54 195.776 144.935C196.32 147.102 196.583 149.327 196.814 150.629Z" fill="white"/>
<path d="M345.965 185.836C346.228 185.992 346.492 186.149 346.756 186.305C346.599 186.042 346.443 185.778 346.286 185.515C346.179 185.622 346.072 185.729 345.965 185.836Z" fill="#D1D1ED"/>
<path d="M190.984 48.7126C186.29 48.6384 182.189 46.5538 177.504 42.9943C163.2 32.118 147.726 22.8401 130.202 17.608C121.259 14.9383 120.139 15.2844 117.315 23.9854C108.759 50.3193 106.98 77.2382 110.439 104.61C110.752 107.09 110.62 109.505 109.903 111.894C113.024 103.465 131.273 61.7889 190.984 48.7126Z" fill="#BEAFEF"/>
<path d="M125.805 125.16C125.797 125.177 125.788 125.186 125.771 125.203L125.805 125.16Z" fill="#D1D1ED"/>
<path d="M347.027 121.238C346.047 116.863 349.423 112.966 350.766 108.862C357.329 88.8319 360.557 68.34 360.178 47.3042C360.071 41.4788 359.371 35.6698 358.902 29.8609C358.795 28.559 357.864 28.971 357.016 29.0205C332.105 30.4624 309.064 38.3889 286.83 49.1581C286.253 49.4383 285.809 49.9903 285.24 50.2787C282.169 51.8195 278.776 54.9918 276.059 54.4974C334.617 68.5048 347.027 121.238 347.027 121.238Z" fill="#BEAFEF"/>
<path d="M346.755 186.307C346.763 186.323 346.78 186.34 346.788 186.356C346.796 186.356 346.805 186.348 346.813 186.348C346.813 186.34 346.813 186.34 346.805 186.331C346.788 186.323 346.771 186.315 346.755 186.307Z" fill="#D1D1ED"/>
<path d="M351.854 189.166C351.845 189.158 351.837 189.149 351.828 189.141L351.854 189.166Z" fill="#D1D1ED"/>
<path d="M109.384 113.392C109.59 112.89 109.754 112.396 109.903 111.894C109.549 112.857 109.384 113.392 109.384 113.392Z" fill="#D1D1ED"/>
<path d="M363.662 167.793C363.481 168.073 363.308 168.353 363.126 168.633C363.019 168.526 362.921 168.427 362.814 168.32C363.094 168.139 363.374 167.966 363.662 167.793C364.106 166.178 362.715 165.453 362.04 164.381C360.648 163.78 359.141 162.742 358.359 165.082C358.07 165.939 357.296 166.969 358.433 167.743C358.836 168.015 359.602 167.719 360.055 167.966C361.15 168.567 361.068 169.968 360.187 170.059C359.24 170.157 357.576 170.487 357 168.715C356.662 167.677 355.756 167.661 355.015 168.435C353.772 169.737 353.22 171.27 354.134 172.967C354.925 174.434 355.435 172.835 356.003 172.621C356.613 172.39 357.123 171.245 357.774 172.267C358.342 173.157 357.461 174.03 356.761 174.228C355.542 174.566 354.192 174.426 352.923 174.632C352.207 174.747 350.7 175.266 352.026 176.032C355.517 178.043 351.771 179.328 351.4 179.452C349.432 180.086 350.041 182.706 348.18 183.209C349.242 183.885 350.231 184.733 351.375 185.195C352.405 185.615 353.343 186.043 353.409 187.181C353.467 188.136 352.981 188.993 351.836 189.158C351.845 189.166 351.853 189.175 351.861 189.183C351.853 189.183 351.845 189.183 351.836 189.183C351.886 190.32 351.672 191.35 350.618 192.001C350.593 192.017 350.231 191.679 350.206 191.482C350.058 190.237 350.362 189.273 351.836 189.183C351.836 189.175 351.836 189.166 351.836 189.158C350.395 187.807 349.564 185.351 346.821 186.365C348.007 188.054 344.433 190.147 347.274 191.696C346.945 191.935 346.64 192.289 346.27 192.38C345.545 192.569 344.771 190.806 344.227 192.083C343.684 193.36 345.389 193.467 346.014 194.159C346.739 194.959 347.25 195.947 347.859 196.854C353.623 196.854 358.746 199.004 363.794 201.509C365.498 202.358 367.507 203.544 369.303 202.028C371.205 200.422 370.118 198.337 369.327 196.598C366.824 191.078 364.172 185.631 361.628 180.127C361.298 179.411 360.887 178.29 361.2 177.796C361.751 176.93 362.715 177.787 363.472 177.985C365.366 178.471 367.211 179.254 369.138 179.526C370.917 179.773 373.338 180.193 372.045 176.79C371.954 176.551 371.905 176.362 371.897 176.205L370.39 171.723C368.076 170.677 365.819 169.399 363.662 167.793ZM348.575 190.015C348.477 190.056 348.304 189.916 348.147 189.858C348.221 189.71 348.254 189.496 348.361 189.455C348.46 189.413 348.715 189.529 348.748 189.628C348.79 189.727 348.674 189.974 348.575 190.015ZM353.87 183.761C354.29 182.814 355.229 182.962 356.044 183.019C356.423 183.044 356.786 183.258 357.749 183.588C356.283 184.041 355.452 184.363 354.595 184.544C354.085 184.651 353.615 184.321 353.87 183.761ZM361.455 194.456C360.994 195.107 361.002 196.392 359.651 196.327C359.108 195.091 356.86 196.59 356.983 194.893C357.016 194.407 359.281 194.028 360.557 193.715C360.977 193.607 361.998 193.698 361.455 194.456Z" fill="#D3CAF2"/>
<path d="M210.567 185.655C220.853 190.698 231.426 190.261 242.132 187.328C250.638 199.407 262.159 206.534 276.833 208.496C281.659 209.138 286.485 208.702 291.302 208.355C288.675 211.198 285.917 213.934 283.438 216.892C278.184 223.146 274.964 230.479 272.848 238.29C272.23 240.556 271.456 241.677 268.887 241.998C245.903 244.89 222.911 245.137 199.895 242.509C194.369 241.874 188.86 241.083 183.351 240.366C181.235 240.037 179.118 239.707 176.994 239.378C175.1 236.65 175.511 233.305 174.655 230.289C172.086 221.267 167.779 213.266 161.603 206.246C181.193 208.413 196.971 201.385 209.447 186.372C209.703 186.051 210.188 185.894 210.567 185.655ZM246.43 204.153C245.656 203.568 244.882 203.576 244.091 204.112C242.041 204.161 240.089 205.834 237.915 204.211C234.712 201.813 230.57 201.615 227.893 203.807C222.467 208.24 218.069 205.579 213.309 203.206C208.64 200.882 202.481 202.637 199.747 207.054C199.5 207.449 199.565 208.034 199.483 208.537C199.895 208.438 200.455 208.471 200.694 208.207C205.873 202.464 210.995 204.433 216.307 208.092C220.004 210.638 223.727 210.704 227.268 207.416C229.038 205.776 232.027 204.269 233.633 205.727C238.311 209.979 243.507 206.419 248.291 207.523C249.107 207.713 250.399 207.614 250.531 206.452C250.63 205.579 249.683 205.117 248.818 204.878C248.02 204.656 247.229 204.392 246.43 204.153Z" fill="#D3CAF2"/>
<path d="M360.048 167.958C359.603 167.711 358.837 168.008 358.425 167.736C357.281 166.961 358.063 165.94 358.351 165.074C359.133 162.743 360.64 163.781 362.032 164.374C360.583 160.337 357.001 157.247 356.836 152.633C355.115 152.023 355.065 150.301 354.687 148.999C352.002 139.779 349.128 130.592 347.036 121.24L276.076 54.4904C270.098 53.4028 264.457 50.453 258.684 48.2612C253.908 48.7474 250.186 47.3878 247.155 43.268C241.803 35.9842 236.45 28.5932 228.734 23.4929C227.309 22.5536 225.58 21.3671 223.826 22.6442C222.08 23.9131 222.665 25.9483 223.085 27.5798C224.081 31.4606 225.366 35.2756 226.527 39.1152C226.947 40.4995 227.161 42.1145 225.069 41.6695C218.391 40.2523 211.655 39.8403 204.861 39.9804C204.087 43.3422 203.099 45.5092 198.965 47.1159C196.033 48.253 193.439 48.7474 190.993 48.7062L109.394 113.387C106.866 119.6 104.511 125.887 102.04 132.124C101.81 132.717 101.917 134.39 100.475 132.998C100.154 134.522 100.928 136.022 100.212 137.62C97.2639 144.261 94.1017 150.77 89.4572 156.423C86.1303 160.477 82.6387 164.399 79.213 168.387C79.8059 169.466 77.6319 170.554 79.2212 171.633C79.9623 171.592 80.7035 171.559 81.4446 171.518C81.634 171.46 81.8317 171.394 82.0211 171.337C89.7948 170.628 89.9101 170.776 86.9291 178.002C85.3315 181.867 83.6433 185.698 82.0952 189.587C81.6258 190.766 81.0988 192.208 82.1693 193.287C83.2069 194.342 84.4421 193.444 85.5456 193.114C86.5255 192.826 87.4643 192.414 88.4196 192.059C96.498 189.027 96.7862 189.258 102.559 195.668C105.276 198.692 108.62 201.148 111.683 203.858C114.697 203.537 116.797 201.387 119.276 200.011C124.834 196.912 130.788 195.355 137.129 195.199C132.065 189.62 126.959 184.125 123.764 177.104C119.424 167.555 117.859 157.651 118.543 147.236C118.905 141.707 121.162 136.607 121.656 131.144C119.622 131.926 117.588 132.709 115.554 133.484C114.812 133.772 114.096 134.143 113.33 134.324C112.704 134.472 112.021 134.398 111.37 134.423C111.996 134.143 112.622 133.855 113.248 133.574C117.233 131.053 121.219 128.54 125.213 126.019C125.402 125.747 125.592 125.483 125.781 125.211C126.267 121.19 129.009 118.397 131.406 115.538C140.052 105.214 150.568 97.9956 164.345 96.4795C168.133 92.1537 171.913 87.8197 175.734 83.5186C176.311 82.8677 176.994 81.5493 177.867 82.1673C178.896 82.9006 177.653 83.8317 177.183 84.4497C174.301 88.3141 171.312 92.1043 168.364 95.9193C197.894 95.0294 221.15 117.342 221.85 146.972C222.088 157.181 220.252 166.821 215.797 175.984C215.607 176.363 215.69 176.874 215.649 177.327C216.332 176.874 217.098 176.495 217.699 175.943C223.464 170.661 229.426 170.859 235.561 175.226C234.885 170.167 233.173 165.346 232.646 160.221C230.019 134.58 246.225 107.331 272.56 99.9814C273.178 99.8084 273.845 99.8331 274.495 99.7589C270.617 97.0646 266.466 94.6833 263.839 90.5553C263.444 89.9373 262.118 89.4429 263.049 88.553C263.839 87.8032 264.646 88.7178 265.157 89.3028C269.093 93.7522 274.051 96.6114 279.543 98.6713C293.683 96.7927 306.101 100.674 316.946 109.852C323.476 110.866 330.007 111.879 336.537 112.893C336.883 112.951 337.229 113.049 337.575 113.132C337.204 113.19 336.842 113.247 336.471 113.305C331.291 114.137 326.095 114.154 320.891 113.494C340.465 133.583 340.819 169.936 321.533 190.494C319.639 192.512 319.655 193.394 322.175 194.622C325.667 196.319 326.927 199.442 326.729 203.224C329.562 202.96 331.654 205.3 334.388 205.399C337.278 201.848 340.951 199.368 345.085 197.506C345.348 196.385 345.908 196.171 346.806 196.912C347.16 196.896 347.506 196.871 347.86 196.855C347.259 195.948 346.74 194.96 346.015 194.16C345.381 193.46 343.677 193.353 344.228 192.084C344.78 190.807 345.546 192.562 346.271 192.381C346.641 192.29 346.946 191.927 347.275 191.697C344.442 190.148 348.008 188.055 346.822 186.366C346.814 186.366 346.806 186.374 346.798 186.374C346.789 186.357 346.773 186.341 346.765 186.324C346.501 186.168 346.238 186.011 345.974 185.855C346.081 185.748 346.188 185.641 346.295 185.533C346.452 185.797 346.608 186.061 346.765 186.324C346.781 186.333 346.798 186.349 346.814 186.357C346.814 186.366 346.814 186.366 346.822 186.374C349.573 185.36 350.404 187.808 351.837 189.167C352.982 189.002 353.46 188.145 353.41 187.19C353.344 186.053 352.406 185.616 351.376 185.204C350.232 184.742 349.243 183.894 348.181 183.218C350.042 182.716 349.433 180.095 351.401 179.461C351.78 179.337 355.518 178.052 352.027 176.041C350.701 175.283 352.208 174.756 352.924 174.641C354.193 174.435 355.535 174.575 356.762 174.237C357.47 174.039 358.343 173.166 357.775 172.276C357.124 171.254 356.614 172.408 356.004 172.63C355.436 172.844 354.925 174.443 354.135 172.976C353.221 171.279 353.773 169.755 355.016 168.444C355.757 167.67 356.663 167.686 357.001 168.725C357.577 170.496 359.241 170.167 360.188 170.068C361.069 169.961 361.143 168.568 360.048 167.958Z" fill="#D3CAF2"/>
<path d="M190.985 48.7129C131.274 61.7974 113.026 103.465 109.905 111.894C109.756 112.397 109.592 112.9 109.386 113.394L190.985 48.7129Z" fill="#D3CAF2"/>
<path d="M276.066 54.4883L347.026 121.238C347.026 121.238 334.616 68.5039 276.066 54.4883Z" fill="#D3CAF2"/>
<path d="M225.059 41.675C223.173 40.3237 210.129 31.0953 204.315 32.9739C203.87 33.1222 202.726 33.4848 202.083 34.523C200.272 37.4563 204.315 42.6637 204.315 42.6637C211.224 42.3341 218.141 42.0045 225.059 41.675Z" fill="#D3CAF2"/>
</g>
<defs>
<clipPath id="clip0">
<rect width="458" height="266" fill="white"/>
</clipPath>
</defs>
</svg>
