
<svg width="19" height="19" viewBox="0 0 19 19" fill="none" xmlns="http://www.w3.org/2000/svg">
<path d="M18.9503 7.28595C18.8252 6.90122 18.484 6.62884 18.0819 6.59246L12.5971 6.09452L10.4295 1.01972C10.2695 0.646885 9.90534 0.40625 9.50002 0.40625C9.09471 0.40625 8.73043 0.646885 8.57141 1.01972L6.4038 6.09452L0.918194 6.59246C0.516072 6.62957 0.175559 6.90195 0.0497331 7.28595C-0.0753682 7.67068 0.0401656 8.09266 0.344294 8.35939L4.49032 11.9949L3.26787 17.379C3.17842 17.7749 3.33208 18.1843 3.66056 18.4217C3.83713 18.55 4.04457 18.6141 4.25273 18.6141C4.43161 18.6141 4.61064 18.5665 4.77053 18.4708L9.50002 15.6429L14.2286 18.4708C14.5755 18.6781 15.0117 18.6591 15.3395 18.4217C15.668 18.1843 15.8216 17.7749 15.7322 17.379L14.5097 11.9949L18.6558 8.35939C18.9597 8.09266 19.0754 7.67155 18.9503 7.28595Z" fill="#4621C5"/>
</svg>