<svg width="137" height="24" viewBox="0 0 137 24" fill="none" xmlns="http://www.w3.org/2000/svg">
<path d="M31.0742 23.2921H33.8754V18.2292C34.3809 18.9312 35.4339 19.5055 36.8661 19.5055C39.7937 19.5055 41.7524 17.1655 41.7524 13.9959C41.7524 10.8901 40.0043 8.55008 36.9714 8.55008C35.4129 8.55008 34.2545 9.25208 33.7911 10.0604V8.78408H31.0742V23.2921ZM38.9933 14.0172C38.9933 15.8892 37.856 16.9741 36.4238 16.9741C34.9916 16.9741 33.8333 15.8679 33.8333 14.0172C33.8333 12.1664 34.9916 11.0815 36.4238 11.0815C37.856 11.0815 38.9933 12.1664 38.9933 14.0172ZM50.2887 11.5921V8.74154C50.078 8.72027 49.8674 8.69899 49.6358 8.69899C48.7512 8.69899 47.319 8.95427 46.6872 10.337V8.78408H43.9702V19.2503H46.7714V14.4639C46.7714 12.209 48.014 11.507 49.4462 11.507C49.6989 11.507 49.9727 11.5283 50.2887 11.5921ZM56.8108 8.46499C53.7148 8.46499 51.377 10.7837 51.377 14.0172C51.377 17.2294 53.7148 19.5694 56.8108 19.5694C59.9069 19.5694 62.2447 17.2294 62.2447 14.0172C62.2447 10.7837 59.9069 8.46499 56.8108 8.46499ZM56.8108 16.9954C55.4418 16.9954 54.1781 15.9743 54.1781 14.0172C54.1781 12.0388 55.4418 11.039 56.8108 11.039C58.1798 11.039 59.4435 12.0388 59.4435 14.0172C59.4435 15.9955 58.1798 16.9954 56.8108 16.9954ZM64.1188 5.3379C64.1188 6.29518 64.8981 7.06099 65.8459 7.06099C66.8147 7.06099 67.5729 6.29518 67.5729 5.3379C67.5729 4.35936 66.8147 3.57227 65.8459 3.57227C64.8981 3.57227 64.1188 4.35936 64.1188 5.3379ZM64.4558 8.78408V19.8884C64.4558 20.6543 64.1399 21.1223 63.2974 21.1223C62.8973 21.1223 62.6235 21.0584 62.4339 21.0159V23.3772C62.5813 23.441 63.1921 23.6112 64.0135 23.6112C66.0144 23.6112 67.257 22.1859 67.257 20.165V8.78408H64.4558ZM79.544 16.2508L77.2062 15.5488C76.8692 16.4848 76.1531 17.1443 74.8473 17.1443C73.4572 17.1443 72.2989 16.1444 72.2357 14.7617H79.6493C79.6493 14.7192 79.6914 14.2937 79.6914 13.8895C79.6914 10.5284 77.7748 8.46499 74.5735 8.46499C71.9197 8.46499 69.4766 10.6348 69.4766 13.9746C69.4766 17.5059 71.9829 19.5694 74.8262 19.5694C77.3747 19.5694 79.0175 18.059 79.544 16.2508ZM76.9324 12.8259H72.2989C72.362 11.8686 73.1624 10.7624 74.6156 10.7624C76.2163 10.7624 76.8903 11.7835 76.9324 12.8259ZM86.5517 11.0815C87.9418 11.0815 88.5947 11.975 88.8474 12.8472L91.3537 11.9963C90.9114 10.2306 89.3108 8.46499 86.4885 8.46499C83.4767 8.46499 81.1179 10.7837 81.1179 14.0172C81.1179 17.2294 83.5189 19.5694 86.5728 19.5694C89.3318 19.5694 90.9535 17.7824 91.4169 16.0381L88.9527 15.2084C88.721 16.0168 88.0049 16.9741 86.5728 16.9741C85.1406 16.9741 83.919 15.9104 83.919 14.0172C83.919 12.1239 85.1195 11.0815 86.5517 11.0815ZM96.931 8.78408V5.65699H94.4036V7.12481C94.4036 8.06081 93.8981 8.78408 92.8029 8.78408H92.2764V11.2943H94.1508V16.1657C94.1508 18.1866 95.4145 19.3992 97.4364 19.3992C98.2578 19.3992 98.7633 19.2503 99.016 19.1439V16.8039C98.8686 16.8464 98.4895 16.889 98.1525 16.889C97.3522 16.889 96.931 16.5912 96.931 15.6764V11.2943H99.016V8.78408H96.931ZM108.239 19.2503H110.914C110.872 18.8886 110.809 18.1654 110.809 17.357V8.78408H108.008V14.8681C108.008 16.0806 107.292 16.9315 106.049 16.9315C104.743 16.9315 104.153 15.9955 104.153 14.8255V8.78408H101.352V15.3999C101.352 17.6761 102.784 19.5268 105.291 19.5268C106.386 19.5268 107.586 19.1014 108.155 18.1228C108.155 18.5483 108.197 19.0375 108.239 19.2503ZM113.798 19.2503H116.515V17.9739C117.062 18.8674 118.158 19.5055 119.59 19.5055C122.538 19.5055 124.476 17.1443 124.476 13.9746C124.476 10.8688 122.728 8.50754 119.695 8.50754C118.158 8.50754 117.02 9.18827 116.557 9.93281V3.84881H113.798V19.2503ZM121.675 13.9959C121.675 15.9104 120.538 16.9741 119.105 16.9741C117.694 16.9741 116.515 15.8892 116.515 13.9959C116.515 12.0814 117.694 11.039 119.105 11.039C120.538 11.039 121.675 12.0814 121.675 13.9959ZM135.982 16.2508L133.644 15.5488C133.307 16.4848 132.591 17.1443 131.285 17.1443C129.895 17.1443 128.737 16.1444 128.674 14.7617H136.087C136.087 14.7192 136.13 14.2937 136.13 13.8895C136.13 10.5284 134.213 8.46499 131.012 8.46499C128.358 8.46499 125.915 10.6348 125.915 13.9746C125.915 17.5059 128.421 19.5694 131.264 19.5694C133.813 19.5694 135.456 18.059 135.982 16.2508ZM133.371 12.8259H128.737C128.8 11.8686 129.601 10.7624 131.054 10.7624C132.654 10.7624 133.328 11.7835 133.371 12.8259Z" fill="#1B2431"/>
<path d="M19.4293 1.45459H4.84826C3.17058 1.45459 1.81055 2.82826 1.81055 4.52277V19.25C1.81055 20.9446 3.17058 22.3182 4.84826 22.3182H19.4293C21.1069 22.3182 22.467 20.9446 22.467 19.25V4.52277C22.467 2.82826 21.1069 1.45459 19.4293 1.45459Z" stroke="#532BDC" stroke-width="2"/>
<path d="M17.8086 4.52246H6.46777C5.57301 4.52246 4.84766 5.25509 4.84766 6.15882V13.5225C4.84766 14.4262 5.57301 15.1588 6.46777 15.1588H17.8086C18.7033 15.1588 19.4287 14.4262 19.4287 13.5225V6.15882C19.4287 5.25509 18.7033 4.52246 17.8086 4.52246Z" fill="#532BDC"/>
</svg>
