[
  "Khoa học",
  "Công nghệ",
  "Robotics",
  "Kỹ thuật",
  "Toán học",
  "Thiên văn",
  "Từ thiện",
  "Môi trường",
  "Nhân quyền",
  "LGBTQ+",
  "Kinh tế",
  "Tài chính",
  "Giáo dục",
  "Văn học",
  "Lịch sử",
  "Triết học",
  "Văn hóa",
  "Truyền thống",
  "Ẩm thực",
  "Mỹ thuật",
  "Âm nhạc",
  "Nhiếp ảnh",
  "Thời trang",
  "Thể thao",
  "eSport",
  "Sách",
  "Tranh biện",
  "MC",
  "Kỹ năng mềm",
  "Du học",
  "Chiêm tinh",
  "Truyền thông",
  "Sức khỏe",
  "Đời sống"
]
