<svg width="137" height="24" viewBox="0 0 137 24" fill="none" xmlns="http://www.w3.org/2000/svg">
<path d="M31.0752 23.2921H33.8764V18.2292C34.3818 18.9312 35.4349 19.5055 36.8671 19.5055C39.7946 19.5055 41.7534 17.1655 41.7534 13.9959C41.7534 10.8901 40.0053 8.55008 36.9724 8.55008C35.4139 8.55008 34.2555 9.25208 33.7921 10.0604V8.78408H31.0752V23.2921ZM38.9943 14.0172C38.9943 15.8892 37.857 16.9741 36.4248 16.9741C34.9926 16.9741 33.8342 15.8679 33.8342 14.0172C33.8342 12.1664 34.9926 11.0815 36.4248 11.0815C37.857 11.0815 38.9943 12.1664 38.9943 14.0172ZM50.2896 11.5921V8.74154C50.079 8.72027 49.8684 8.69899 49.6367 8.69899C48.7522 8.69899 47.32 8.95427 46.6881 10.337V8.78408H43.9712V19.2503H46.7724V14.4639C46.7724 12.209 48.015 11.507 49.4472 11.507C49.6999 11.507 49.9737 11.5283 50.2896 11.5921ZM56.8118 8.46499C53.7158 8.46499 51.378 10.7837 51.378 14.0172C51.378 17.2294 53.7158 19.5694 56.8118 19.5694C59.9078 19.5694 62.2457 17.2294 62.2457 14.0172C62.2457 10.7837 59.9078 8.46499 56.8118 8.46499ZM56.8118 16.9954C55.4428 16.9954 54.1791 15.9743 54.1791 14.0172C54.1791 12.0388 55.4428 11.039 56.8118 11.039C58.1808 11.039 59.4445 12.0388 59.4445 14.0172C59.4445 15.9955 58.1808 16.9954 56.8118 16.9954ZM64.1198 5.3379C64.1198 6.29518 64.8991 7.06099 65.8468 7.06099C66.8157 7.06099 67.5739 6.29518 67.5739 5.3379C67.5739 4.35936 66.8157 3.57227 65.8468 3.57227C64.8991 3.57227 64.1198 4.35936 64.1198 5.3379ZM64.4568 8.78408V19.8884C64.4568 20.6543 64.1409 21.1223 63.2984 21.1223C62.8982 21.1223 62.6244 21.0584 62.4349 21.0159V23.3772C62.5823 23.441 63.1931 23.6112 64.0145 23.6112C66.0153 23.6112 67.258 22.1859 67.258 20.165V8.78408H64.4568ZM79.545 16.2508L77.2071 15.5488C76.8702 16.4848 76.1541 17.1443 74.8483 17.1443C73.4582 17.1443 72.2998 16.1444 72.2366 14.7617H79.6503C79.6503 14.7192 79.6924 14.2937 79.6924 13.8895C79.6924 10.5284 77.7758 8.46499 74.5745 8.46499C71.9207 8.46499 69.4776 10.6348 69.4776 13.9746C69.4776 17.5059 71.9839 19.5694 74.8272 19.5694C77.3756 19.5694 79.0184 18.059 79.545 16.2508ZM76.9333 12.8259H72.2998C72.363 11.8686 73.1634 10.7624 74.6166 10.7624C76.2173 10.7624 76.8912 11.7835 76.9333 12.8259ZM86.5527 11.0815C87.9427 11.0815 88.5956 11.975 88.8484 12.8472L91.3547 11.9963C90.9124 10.2306 89.3117 8.46499 86.4895 8.46499C83.4777 8.46499 81.1188 10.7837 81.1188 14.0172C81.1188 17.2294 83.5198 19.5694 86.5737 19.5694C89.3328 19.5694 90.9545 17.7824 91.4179 16.0381L88.9537 15.2084C88.722 16.0168 88.0059 16.9741 86.5737 16.9741C85.1416 16.9741 83.92 15.9104 83.92 14.0172C83.92 12.1239 85.1205 11.0815 86.5527 11.0815ZM96.9319 8.78408V5.65699H94.4046V7.12481C94.4046 8.06081 93.8991 8.78408 92.8039 8.78408H92.2774V11.2943H94.1518V16.1657C94.1518 18.1866 95.4155 19.3992 97.4374 19.3992C98.2588 19.3992 98.7643 19.2503 99.017 19.1439V16.8039C98.8696 16.8464 98.4905 16.889 98.1535 16.889C97.3532 16.889 96.9319 16.5912 96.9319 15.6764V11.2943H99.017V8.78408H96.9319ZM108.24 19.2503H110.915C110.873 18.8886 110.81 18.1654 110.81 17.357V8.78408H108.009V14.8681C108.009 16.0806 107.293 16.9315 106.05 16.9315C104.744 16.9315 104.154 15.9955 104.154 14.8255V8.78408H101.353V15.3999C101.353 17.6761 102.785 19.5268 105.292 19.5268C106.387 19.5268 107.587 19.1014 108.156 18.1228C108.156 18.5483 108.198 19.0375 108.24 19.2503ZM113.799 19.2503H116.516V17.9739C117.063 18.8674 118.159 19.5055 119.591 19.5055C122.539 19.5055 124.477 17.1443 124.477 13.9746C124.477 10.8688 122.729 8.50754 119.696 8.50754C118.159 8.50754 117.021 9.18827 116.558 9.93281V3.84881H113.799V19.2503ZM121.676 13.9959C121.676 15.9104 120.539 16.9741 119.106 16.9741C117.695 16.9741 116.516 15.8892 116.516 13.9959C116.516 12.0814 117.695 11.039 119.106 11.039C120.539 11.039 121.676 12.0814 121.676 13.9959ZM135.983 16.2508L133.645 15.5488C133.308 16.4848 132.592 17.1443 131.286 17.1443C129.896 17.1443 128.738 16.1444 128.675 14.7617H136.088C136.088 14.7192 136.131 14.2937 136.131 13.8895C136.131 10.5284 134.214 8.46499 131.013 8.46499C128.359 8.46499 125.916 10.6348 125.916 13.9746C125.916 17.5059 128.422 19.5694 131.265 19.5694C133.814 19.5694 135.457 18.059 135.983 16.2508ZM133.371 12.8259H128.738C128.801 11.8686 129.601 10.7624 131.055 10.7624C132.655 10.7624 133.329 11.7835 133.371 12.8259Z" fill="white"/>
<path d="M19.4288 1.45459H4.84777C3.17009 1.45459 1.81006 2.82826 1.81006 4.52277V19.25C1.81006 20.9446 3.17009 22.3182 4.84777 22.3182H19.4288C21.1065 22.3182 22.4665 20.9446 22.4665 19.25V4.52277C22.4665 2.82826 21.1065 1.45459 19.4288 1.45459Z" stroke="white" stroke-width="2"/>
<path d="M17.8086 4.52271H6.46777C5.57301 4.52271 4.84766 5.25533 4.84766 6.15907V13.5227C4.84766 14.4264 5.57301 15.1591 6.46777 15.1591H17.8086C18.7033 15.1591 19.4287 14.4264 19.4287 13.5227V6.15907C19.4287 5.25533 18.7033 4.52271 17.8086 4.52271Z" fill="white"/>
</svg>
