{
	"id": "5c80c801-c8f9-40b4-bf21-811bd75b3471",
	"name": "learning-elasticsearch-env",
	"values": [
		{
			"key": "url_es",
			"value": "http://localhost:9200",
			"enabled": true
		},
		{
			"key": "url_app",
			"value": "http://0.0.0.0:5000/api/v1",
			"enabled": true
		}
	],
	"_postman_variable_scope": "environment",
	"_postman_exported_at": "2020-12-27T23:26:08.943Z",
	"_postman_exported_using": "Postman/7.36.1"
}