com/greetz/urlshortener/service/UrlShortenerServiceImpl.class
com/greetz/urlshortener/UrlshortenerApplication.class
com/greetz/urlshortener/service/UrlShortenerService.class
com/greetz/urlshortener/controller/UrlShortenerController.class
com/greetz/urlshortener/domain/Url.class
com/greetz/urlshortener/dto/UrlShortenerDto.class
com/greetz/urlshortener/repository/UrlShortenerRepository.class
