{
  "accessor": [
    "bson"
  ],
  "defs": "{\"!name\":\"LIB/bson\",\"bson\":{\"BSON\":{\"BSONError\":{},\"BSONOffsetError\":{},\"BSONRegExp\":{},\"BSONRuntimeError\":{},\"BSONSymbol\":{},\"BSONType\":{},\"BSONValue\":{},\"BSONVersionError\":{},\"Binary\":{},\"Code\":{},\"DBRef\":{},\"Decimal128\":{},\"Double\":{},\"EJSON\":{},\"Int32\":{},\"Long\":{},\"MaxKey\":{},\"MinKey\":{},\"ObjectId\":{},\"Timestamp\":{},\"UUID\":{},\"calculateObjectSize\":{},\"deserialize\":{},\"deserializeStream\":{},\"onDemand\":{},\"serialize\":{},\"serializeWithBufferAndIndex\":{},\"setInternalBufferSize\":{}},\"BSONError\":{},\"BSONOffsetError\":{},\"BSONRegExp\":{},\"BSONRuntimeError\":{},\"BSONSymbol\":{},\"BSONType\":{},\"BSONValue\":{},\"BSONVersionError\":{},\"Binary\":{},\"Code\":{},\"DBRef\":{},\"Decimal128\":{},\"Double\":{},\"EJSON\":{},\"Int32\":{},\"Long\":{},\"MaxKey\":{},\"MinKey\":{},\"ObjectId\":{},\"Timestamp\":{},\"UUID\":{},\"calculateObjectSize\":{},\"deserialize\":{},\"deserializeStream\":{},\"onDemand\":{},\"serialize\":{},\"serializeWithBufferAndIndex\":{},\"setInternalBufferSize\":{}}}",
  "name": "bson",
  "uidString": "bson_https://cdn.jsdelivr.net/npm/bson@6.7.0/+esm",
  "url": "https://cdn.jsdelivr.net/npm/bson@6.7.0/+esm",
  "version": "6.7.0"
}