{
  "animateLoading": true,
  "borderRadius": "{{appsmith.theme.borderRadius.appBorderRadius}}",
  "bottomRow": 6,
  "boxShadow": "none",
  "buttonColor": "#3b82f6",
  "buttonVariant": "PRIMARY",
  "disabledWhenInvalid": false,
  "dynamicBindingPathList": [
    {
      "key": "borderRadius"
    }
  ],
  "dynamicPropertyPathList": [
    {
      "key": "onClick"
    }
  ],
  "dynamicTriggerPathList": [
    {
      "key": "onClick"
    }
  ],
  "iconAlign": "left",
  "iconName": "refresh",
  "isDefaultClickDisabled": true,
  "isDisabled": false,
  "isLoading": false,
  "isVisible": true,
  "key": "igtliq7pnp",
  "leftColumn": 1,
  "minWidth": 120,
  "mobileBottomRow": 6,
  "mobileLeftColumn": 1,
  "mobileRightColumn": 17,
  "mobileTopRow": 2,
  "needsErrorInfo": false,
  "onClick": "{{utils.syncLibrary();}}",
  "parentColumnSpace": 9.59375,
  "parentId": "erujladred",
  "parentRowSpace": 10,
  "placement": "CENTER",
  "recaptchaType": "V3",
  "renderMode": "CANVAS",
  "resetFormOnClick": false,
  "responsiveBehavior": "hug",
  "rightColumn": 17,
  "text": "Sincronizar",
  "topRow": 2,
  "type": "BUTTON_WIDGET",
  "version": 1,
  "widgetId": "0nmz9wiyxv",
  "widgetName": "sync_button"
}