{
  "accentColor": "{{appsmith.theme.colors.primaryColor}}",
  "animateLoading": true,
  "borderRadius": "{{appsmith.theme.borderRadius.appBorderRadius}}",
  "bottomRow": 20,
  "boxShadow": "none",
  "defaultOptionValue": "profesional",
  "displayName": "Select",
  "dynamicBindingPathList": [
    {
      "key": "accentColor"
    },
    {
      "key": "borderRadius"
    }
  ],
  "dynamicHeight": "FIXED",
  "dynamicPropertyPathList": [
    {
      "key": "sourceData"
    }
  ],
  "dynamicTriggerPathList": [
    {
      "key": "onOptionChange"
    }
  ],
  "hideCard": false,
  "iconSVG": "/static/media/icon.c94480439adb48de6883bb496aa5ef7d.svg",
  "isDeprecated": false,
  "isDisabled": false,
  "isFilterable": true,
  "isLoading": false,
  "isRequired": false,
  "isVisible": true,
  "key": "keb3kazmat",
  "labelAlignment": "left",
  "labelPosition": "Top",
  "labelText": "Entorno",
  "labelTextSize": "0.875rem",
  "labelWidth": 5,
  "leftColumn": 2,
  "maxDynamicHeight": 9000,
  "minDynamicHeight": 4,
  "minWidth": 450,
  "mobileBottomRow": 15,
  "mobileLeftColumn": 2,
  "mobileRightColumn": 22,
  "mobileTopRow": 8,
  "needsErrorInfo": false,
  "onCanvasUI": {
    "disableParentSelection": false,
    "focusBGCSSVar": "--on-canvas-ui-widget-focus",
    "focusColorCSSVar": "--on-canvas-ui-widget-selection",
    "selectionBGCSSVar": "--on-canvas-ui-widget-selection",
    "selectionColorCSSVar": "--on-canvas-ui-widget-focus"
  },
  "onOptionChange": "{{fixerH5P.loadProcessingAssets();}}",
  "optionLabel": "name",
  "optionValue": "code",
  "originalBottomRow": 20,
  "originalTopRow": 13,
  "parentColumnSpace": 12.29638671875,
  "parentId": "ecf8whyu7k",
  "parentRowSpace": 10,
  "placeholderText": "Select option",
  "renderMode": "CANVAS",
  "responsiveBehavior": "fill",
  "rightColumn": 22,
  "searchTags": [
    "dropdown"
  ],
  "serverSideFiltering": false,
  "sourceData": "[\n  {\n    \"name\": \"core\",\n    \"code\": \"core\"\n  },\n  {\n    \"name\": \"colegios\",\n    \"code\": \"colegios\"\n  },\n  {\n    \"name\": \"beta\",\n    \"code\": \"beta\"\n  },\n\t{\n\t\"name\": \"profesional\",\n\t\"code\": \"profesional\"\n\t}\n]",
  "tags": [
    "Suggested",
    "Select"
  ],
  "thumbnailSVG": "/static/media/thumbnail.9aef24cb159e9c6e4d0f1d7ca4fb0c79.svg",
  "topRow": 13,
  "type": "SELECT_WIDGET",
  "version": 1,
  "widgetId": "zk6pahvxt9",
  "widgetName": "env"
}