{
  "accentColor": "{{appsmith.theme.colors.primaryColor}}",
  "animateLoading": true,
  "autoFocus": false,
  "borderRadius": "{{appsmith.theme.borderRadius.appBorderRadius}}",
  "bottomRow": 11,
  "boxShadow": "none",
  "defaultText": "",
  "displayName": "Input",
  "dynamicBindingPathList": [
    {
      "key": "accentColor"
    },
    {
      "key": "borderRadius"
    }
  ],
  "dynamicHeight": "FIXED",
  "dynamicTriggerPathList": [],
  "hideCard": false,
  "iconAlign": "left",
  "iconSVG": "/static/media/icon.f4dd498ee72f01127e5bfe3a1a8ad671.svg",
  "inputType": "TEXT",
  "isDeprecated": false,
  "isDisabled": false,
  "isLoading": false,
  "isRequired": false,
  "isVisible": true,
  "key": "tyr1fbhrsa",
  "label": "Titulo",
  "labelAlignment": "left",
  "labelPosition": "Top",
  "labelStyle": "",
  "labelTextSize": "0.875rem",
  "labelWidth": 5,
  "leftColumn": 2,
  "maxDynamicHeight": 9000,
  "minDynamicHeight": 4,
  "minWidth": 450,
  "mobileBottomRow": 8,
  "mobileLeftColumn": 0,
  "mobileRightColumn": 20,
  "mobileTopRow": 1,
  "needsErrorInfo": false,
  "parentColumnSpace": 17.97833251953125,
  "parentId": "75p5xs5r1w",
  "parentRowSpace": 10,
  "renderMode": "CANVAS",
  "resetOnSubmit": true,
  "responsiveBehavior": "fill",
  "rightColumn": 22,
  "searchTags": [
    "form",
    "text input",
    "number",
    "textarea"
  ],
  "showStepArrows": false,
  "tags": [
    "Suggested",
    "Inputs"
  ],
  "thumbnailSVG": "/static/media/thumbnail.a4eac1a16753ea7fc54cac7731f9ea6a.svg",
  "topRow": 4,
  "type": "INPUT_WIDGET_V2",
  "version": 2,
  "widgetId": "a6vlpbg2w1",
  "widgetName": "create_asset_title"
}