{
  "gitSyncId": "666867f4a92f183a985a82a4_66687272a92f183a985a82e3",
  "id": "Listado de assets_upload_file",
  "pluginId": "amazons3-plugin",
  "pluginType": "DB",
  "unpublishedAction": {
    "actionConfiguration": {
      "encodeParamsToggle": true,
      "formData": {
        "body": {
          "data": "{{this.params.content}}"
        },
        "bucket": {
          "data": "{{this.params.bucket_name}}"
        },
        "command": {
          "data": "UPLOAD_FILE_FROM_BODY"
        },
        "create": {
          "dataType": {
            "data": "YES"
          },
          "expiry": {
            "data": "5"
          }
        },
        "list": {
          "expiry": {
            "data": "5"
          },
          "prefix": {
            "data": ""
          },
          "signedUrl": {
            "data": "NO"
          },
          "sortBy": {
            "data": [
              {
                "column": "",
                "order": "Ascending"
              }
            ]
          },
          "unSignedUrl": {
            "data": "YES"
          },
          "where": {
            "data": {
              "children": [
                {
                  "condition": "EQ"
                }
              ],
              "condition": "AND"
            }
          }
        },
        "path": {
          "data": "{{this.params.file_path}}"
        },
        "read": {
          "dataType": {
            "data": "YES"
          }
        },
        "smartSubstitution": {
          "data": true
        }
      },
      "paginationType": "NONE",
      "timeoutInMillisecond": 10000
    },
    "confirmBeforeExecute": false,
    "datasource": {
      "id": "s3-upload",
      "isAutoGenerated": false,
      "name": "s3-upload",
      "pluginId": "amazons3-plugin"
    },
    "dynamicBindingPathList": [
      {
        "key": "formData.bucket.data"
      },
      {
        "key": "formData.path.data"
      },
      {
        "key": "formData.body.data"
      }
    ],
    "executeOnLoad": false,
    "name": "upload_file",
    "pageId": "Listado de assets",
    "userSetOnLoad": false
  }
}