{
  "animateLoading": true,
  "borderRadius": "{{appsmith.theme.borderRadius.appBorderRadius}}",
  "bottomRow": 16,
  "dynamicBindingPathList": [
    {
      "key": "truncateButtonColor"
    },
    {
      "key": "fontFamily"
    },
    {
      "key": "borderRadius"
    },
    {
      "key": "text"
    }
  ],
  "dynamicHeight": "AUTO_HEIGHT",
  "dynamicTriggerPathList": [],
  "fontFamily": "{{appsmith.theme.fontFamily.appFont}}",
  "fontSize": "0.875rem",
  "fontStyle": "BOLD",
  "isLoading": false,
  "isVisible": true,
  "key": "3dqin1onhb",
  "leftColumn": 1,
  "maxDynamicHeight": 9000,
  "minDynamicHeight": 4,
  "minWidth": 450,
  "mobileBottomRow": 16,
  "mobileLeftColumn": 1,
  "mobileRightColumn": 17,
  "mobileTopRow": 12,
  "needsErrorInfo": false,
  "originalBottomRow": 16,
  "originalTopRow": 12,
  "overflow": "NONE",
  "parentColumnSpace": 9.34375,
  "parentId": "exybzhaw9o",
  "parentRowSpace": 10,
  "renderMode": "CANVAS",
  "responsiveBehavior": "fill",
  "rightColumn": 62,
  "shouldTruncate": false,
  "text": "{{resources_list.triggeredItem._id}}",
  "textAlign": "CENTER",
  "textColor": "#231F20",
  "topRow": 12,
  "truncateButtonColor": "{{appsmith.theme.colors.primaryColor}}",
  "type": "TEXT_WIDGET",
  "version": 1,
  "widgetId": "8fwvkqg7xe",
  "widgetName": "Text3"
}