{
  "animateLoading": true,
  "borderRadius": "{{appsmith.theme.borderRadius.appBorderRadius}}",
  "bottomRow": 18,
  "dynamicBindingPathList": [
    {
      "key": "truncateButtonColor"
    },
    {
      "key": "fontFamily"
    },
    {
      "key": "borderRadius"
    },
    {
      "key": "text"
    }
  ],
  "dynamicHeight": "AUTO_HEIGHT",
  "dynamicTriggerPathList": [],
  "fontFamily": "{{appsmith.theme.fontFamily.appFont}}",
  "fontSize": "1rem",
  "fontStyle": "",
  "isLoading": false,
  "isVisible": true,
  "key": "oajqdx8sg0",
  "leftColumn": 1,
  "maxDynamicHeight": 9000,
  "minDynamicHeight": 4,
  "minWidth": 450,
  "mobileBottomRow": 18,
  "mobileLeftColumn": 1,
  "mobileRightColumn": 17,
  "mobileTopRow": 14,
  "needsErrorInfo": false,
  "originalBottomRow": 18,
  "originalTopRow": 14,
  "overflow": "NONE",
  "parentColumnSpace": 7.4375,
  "parentId": "4qr45mw6x4",
  "parentRowSpace": 10,
  "renderMode": "CANVAS",
  "responsiveBehavior": "fill",
  "rightColumn": 61,
  "shouldTruncate": false,
  "text": "{{tags_list.triggeredRow.type}}",
  "textAlign": "CENTER",
  "textColor": "#231F20",
  "topRow": 14,
  "truncateButtonColor": "{{appsmith.theme.colors.primaryColor}}",
  "type": "TEXT_WIDGET",
  "version": 1,
  "widgetId": "gqyjq78u65",
  "widgetName": "Text1"
}