{
  "accentColor": "{{appsmith.theme.colors.primaryColor}}",
  "allowClear": false,
  "animateLoading": true,
  "borderRadius": "{{appsmith.theme.borderRadius.appBorderRadius}}",
  "bottomRow": 25,
  "boxShadow": "none",
  "defaultOptionValue": "{{resource_utils.tagsResults.ma_codigo_area.filter((element => resource_detail.data.tags.find(tag => tag._id === element.value))).map(element => element.value)}}",
  "displayName": "Multi TreeSelect",
  "dynamicBindingPathList": [
    {
      "key": "accentColor"
    },
    {
      "key": "borderRadius"
    },
    {
      "key": "options"
    },
    {
      "key": "defaultOptionValue"
    }
  ],
  "dynamicHeight": "FIXED",
  "dynamicTriggerPathList": [],
  "expandAll": false,
  "hideCard": false,
  "iconSVG": "/static/media/icon.8e0988176ef2c5bf3b641e36cf34d0e3.svg",
  "isDeprecated": false,
  "isDisabled": false,
  "isLoading": false,
  "isRequired": false,
  "isVisible": true,
  "key": "w6b2l7pvrq",
  "labelAlignment": "left",
  "labelPosition": "Top",
  "labelText": "Modelo autónomo: código de area",
  "labelTextSize": "0.875rem",
  "labelTooltip": "Código de area",
  "labelWidth": 5,
  "leftColumn": 0,
  "maxDynamicHeight": 9000,
  "minDynamicHeight": 4,
  "minWidth": 450,
  "mobileBottomRow": 17,
  "mobileLeftColumn": 0,
  "mobileRightColumn": 5,
  "mobileTopRow": 10,
  "mode": "SHOW_ALL",
  "needsErrorInfo": false,
  "options": "{{resource_utils.tagsResults.ma_codigo_area}}",
  "originalBottomRow": 25,
  "originalTopRow": 18,
  "parentColumnSpace": 17.97833251953125,
  "parentId": "fcqencswwu",
  "parentRowSpace": 10,
  "placeholderText": "",
  "renderMode": "CANVAS",
  "responsiveBehavior": "fill",
  "rightColumn": 62,
  "searchTags": [
    "dropdown",
    "multiselecttree"
  ],
  "tags": [
    "Select"
  ],
  "thumbnailSVG": "/static/media/thumbnail.d1dd4f1ce55fa3e93b8a4de404e481cc.svg",
  "topRow": 18,
  "type": "MULTI_SELECT_TREE_WIDGET",
  "version": 1,
  "widgetId": "y1ss4a2fyi",
  "widgetName": "ma_codigo_area"
}