{
  "gitSyncId": "671121cf83cf5c41b0ae07c6_a7fef822-e8ee-4012-935f-cb39bff65a37",
  "id": "Listado de assets_JSObject1",
  "unpublishedCollection": {
    "name": "JSObject1",
    "pageId": "Listado de assets",
    "pluginId": "js-plugin",
    "pluginType": "JS",
    "variables": []
  }
}