{
  "animateLoading": true,
  "borderRadius": "{{appsmith.theme.borderRadius.appBorderRadius}}",
  "bottomRow": 4,
  "boxShadow": "none",
  "buttonColor": "{{appsmith.theme.colors.primaryColor}}",
  "buttonVariant": "TERTIARY",
  "dynamicBindingPathList": [
    {
      "key": "buttonColor"
    },
    {
      "key": "borderRadius"
    }
  ],
  "dynamicTriggerPathList": [
    {
      "key": "onClick"
    }
  ],
  "iconName": "cross",
  "iconSize": 24,
  "isDisabled": false,
  "isLoading": false,
  "isVisible": true,
  "key": "2tc0jxh658",
  "leftColumn": 58,
  "minWidth": 50,
  "mobileBottomRow": 4,
  "mobileLeftColumn": 58,
  "mobileRightColumn": 64,
  "mobileTopRow": 0,
  "needsErrorInfo": false,
  "onClick": "{{closeModal(Modal1.name);}}",
  "parentId": "cw8burqcd5",
  "renderMode": "CANVAS",
  "responsiveBehavior": "hug",
  "rightColumn": 64,
  "topRow": 0,
  "type": "ICON_BUTTON_WIDGET",
  "version": 1,
  "widgetId": "2h527tg0pu",
  "widgetName": "IconButton2"
}