{
  "gitSyncId": "66ec41865e880414a30d6e84_a2e37ddf-6517-4bbd-a039-719f5f35579b",
  "id": "Detalle de recurso_getResorces",
  "pluginId": "amazons3-plugin",
  "pluginType": "DB",
  "unpublishedAction": {
    "actionConfiguration": {
      "encodeParamsToggle": true,
      "formData": {
        "body": {
          "data": ""
        },
        "bucket": {
          "data": "cdn.{{appsmith.URL.queryParams.environment}}.ticmas.io"
        },
        "command": {
          "data": "LIST"
        },
        "create": {
          "dataType": {
            "data": "YES"
          },
          "expiry": {
            "data": "5"
          }
        },
        "list": {
          "expiry": {
            "data": "5"
          },
          "pagination": {
            "data": {
              "limit": "5"
            }
          },
          "prefix": {
            "data": "resources/{{appsmith.URL.queryParams._id}}"
          },
          "signedUrl": {
            "data": "NO"
          },
          "sortBy": {
            "data": [
              {
                "column": "",
                "order": "Ascending"
              }
            ]
          },
          "unSignedUrl": {
            "data": "YES"
          },
          "where": {
            "data": {
              "children": [
                {
                  "condition": "EQ"
                }
              ],
              "condition": "AND"
            }
          }
        },
        "path": {
          "data": "resources/5d5312425186a90010dff39d/"
        },
        "read": {
          "dataType": {
            "data": "YES"
          }
        },
        "smartSubstitution": {
          "data": true
        }
      },
      "paginationType": "NONE",
      "timeoutInMillisecond": 80000
    },
    "confirmBeforeExecute": false,
    "datasource": {
      "id": "s3-getResoruces",
      "isAutoGenerated": false,
      "name": "s3-getResoruces",
      "pluginId": "amazons3-plugin"
    },
    "dynamicBindingPathList": [
      {
        "key": "formData.bucket.data"
      },
      {
        "key": "formData.list.prefix.data"
      }
    ],
    "executeOnLoad": true,
    "name": "getResorces",
    "pageId": "Detalle de recurso",
    "userSetOnLoad": false
  }
}