{
  "animateLoading": true,
  "borderRadius": "{{appsmith.theme.borderRadius.appBorderRadius}}",
  "bottomRow": 14,
  "boxShadow": "none",
  "defaultImage": "https://assets.appsmith.com/widgets/default.png",
  "displayName": "Image",
  "dynamicBindingPathList": [
    {
      "key": "image"
    },
    {
      "key": "borderRadius"
    }
  ],
  "dynamicTriggerPathList": [],
  "enableDownload": false,
  "enableRotation": false,
  "flexVerticalAlignment": "start",
  "hideCard": false,
  "iconSVG": "/static/media/icon.0ca0b0d56b58addbf45114ae5a79e88a.svg",
  "image": "{{currentItem.coverUrl}}",
  "imageShape": "RECTANGLE",
  "isDeprecated": false,
  "isLoading": false,
  "isVisible": true,
  "key": "hma2xb8xic",
  "leftColumn": 0,
  "maxZoomLevel": 1,
  "mobileBottomRow": 8,
  "mobileLeftColumn": 0,
  "mobileRightColumn": 16,
  "mobileTopRow": 0,
  "needsErrorInfo": false,
  "objectFit": "cover",
  "parentId": "51a0vris20",
  "renderMode": "CANVAS",
  "rightColumn": 8,
  "tags": [
    "Media"
  ],
  "thumbnailSVG": "/static/media/thumbnail.74089bb21dfcb5890f6b106f93c3b9c8.svg",
  "topRow": 0,
  "type": "IMAGE_WIDGET",
  "version": 1,
  "widgetId": "fqnl15j8ff",
  "widgetName": "coverImage"
}