{
  "gitSyncId": "671121cf83cf5c41b0ae07c6_9b9295b4-9cb1-4152-8cd7-a37bbe5f6fde",
  "id": "Corrector de contenidos_sentry",
  "unpublishedCollection": {
    "name": "sentry",
    "pageId": "Corrector de contenidos",
    "pluginId": "js-plugin",
    "pluginType": "JS",
    "variables": []
  }
}