{
  "animateLoading": true,
  "borderRadius": "{{appsmith.theme.borderRadius.appBorderRadius}}",
  "bottomRow": 4,
  "boxShadow": "none",
  "dynamicBindingPathList": [
    {
      "key": "text"
    },
    {
      "key": "fontFamily"
    }
  ],
  "dynamicHeight": "FIXED",
  "dynamicTriggerPathList": [],
  "fontFamily": "{{appsmith.theme.fontFamily.appFont}}",
  "fontSize": "1rem",
  "fontStyle": "BOLD",
  "isLoading": false,
  "isVisible": true,
  "key": "kx4fqqxs5m",
  "leftColumn": 16,
  "maxDynamicHeight": 9000,
  "minDynamicHeight": 4,
  "minWidth": 450,
  "mobileBottomRow": 4,
  "mobileLeftColumn": 16,
  "mobileRightColumn": 28,
  "mobileTopRow": 0,
  "needsErrorInfo": false,
  "overflow": "NONE",
  "parentId": "0m2olumlae",
  "renderMode": "CANVAS",
  "responsiveBehavior": "fill",
  "rightColumn": 53,
  "shouldTruncate": false,
  "text": "{{currentItem.title}}",
  "textAlign": "LEFT",
  "textColor": "#231F20",
  "textStyle": "HEADING",
  "topRow": 0,
  "truncateButtonColor": "{{appsmith.theme.colors.primaryColor}}",
  "type": "TEXT_WIDGET",
  "version": 1,
  "widgetId": "umzcvzb8yt",
  "widgetName": "Text1"
}