{
  "animateLoading": true,
  "borderRadius": "{{appsmith.theme.borderRadius.appBorderRadius}}",
  "bottomRow": 31,
  "boxShadow": "none",
  "buttonColor": "green",
  "buttonStyle": "PRIMARY_BUTTON",
  "buttonVariant": "PRIMARY",
  "disabledWhenInvalid": false,
  "displayName": "Button",
  "dynamicBindingPathList": [
    {
      "key": "borderRadius"
    },
    {
      "key": "isDisabled"
    }
  ],
  "dynamicPropertyPathList": [
    {
      "key": "isDisabled"
    },
    {
      "key": "onClick"
    }
  ],
  "dynamicTriggerPathList": [
    {
      "key": "onClick"
    }
  ],
  "hideCard": false,
  "iconSVG": "/static/media/icon.cb7371e9a48acf9db0f2f3ea0a714255.svg",
  "isDefaultClickDisabled": true,
  "isDeprecated": false,
  "isDisabled": "{{resource_modals_utils.disableReplaceAssetBtn()}}",
  "isLoading": false,
  "isVisible": true,
  "key": "u849ndycp3",
  "leftColumn": 47,
  "minWidth": 120,
  "mobileBottomRow": 22,
  "mobileLeftColumn": 47,
  "mobileRightColumn": 63,
  "mobileTopRow": 18,
  "needsErrorInfo": false,
  "onClick": "{{resource_modals_utils.replaceAssetOnList();}}",
  "originalBottomRow": 31,
  "originalTopRow": 27,
  "parentId": "600jjubwpd",
  "placement": "CENTER",
  "recaptchaType": "V3",
  "renderMode": "CANVAS",
  "resetFormOnClick": true,
  "responsiveBehavior": "hug",
  "rightColumn": 63,
  "searchTags": [
    "click",
    "submit"
  ],
  "tags": [
    "Buttons"
  ],
  "text": "Reemplazar",
  "thumbnailSVG": "/static/media/thumbnail.a348658e996feaad96cadc30d99374ff.svg",
  "topRow": 27,
  "type": "BUTTON_WIDGET",
  "version": 1,
  "widgetId": "r7jq72ur7c",
  "widgetName": "replace_button"
}