{
  "animateLoading": true,
  "borderRadius": "{{appsmith.theme.borderRadius.appBorderRadius}}",
  "bottomRow": 33,
  "boxShadow": "none",
  "canEscapeKeyClose": true,
  "canOutsideClickClose": true,
  "children": [
    {
      "borderRadius": "{{appsmith.theme.borderRadius.appBorderRadius}}",
      "bottomRow": 330,
      "boxShadow": "{{appsmith.theme.boxShadow.appBoxShadow}}",
      "canExtend": true,
      "detachFromLayout": true,
      "displayName": "Canvas",
      "dynamicBindingPathList": [
        {
          "key": "borderRadius"
        },
        {
          "key": "boxShadow"
        }
      ],
      "dynamicHeight": "AUTO_HEIGHT",
      "flexLayers": [],
      "hideCard": true,
      "isDeprecated": false,
      "isDisabled": false,
      "isLoading": false,
      "isVisible": true,
      "key": "22mnzazos6",
      "leftColumn": 0,
      "maxDynamicHeight": 9000,
      "minDynamicHeight": 4,
      "minHeight": 430,
      "minWidth": 450,
      "mobileBottomRow": 240,
      "mobileLeftColumn": 0,
      "mobileRightColumn": 416.2734375,
      "mobileTopRow": 0,
      "needsErrorInfo": false,
      "parentColumnSpace": 1,
      "parentId": "mvlvsb8nsj",
      "parentRowSpace": 1,
      "renderMode": "CANVAS",
      "responsiveBehavior": "fill",
      "rightColumn": 416.2734375,
      "shouldScrollContents": false,
      "topRow": 0,
      "type": "CANVAS_WIDGET",
      "version": 1,
      "widgetId": "600jjubwpd",
      "widgetName": "Canvas2Copy"
    }
  ],
  "detachFromLayout": true,
  "displayName": "Modal",
  "dynamicBindingPathList": [
    {
      "key": "borderRadius"
    }
  ],
  "dynamicHeight": "AUTO_HEIGHT",
  "dynamicTriggerPathList": [],
  "height": 330,
  "hideCard": false,
  "iconSVG": "/static/media/icon.4b2718a4b16cd370332555ef28633b8d.svg",
  "isCanvas": true,
  "isDeprecated": false,
  "isLoading": false,
  "key": "cxzg17rm1i",
  "leftColumn": 14,
  "maxDynamicHeight": 9000,
  "minDynamicHeight": 10,
  "minHeight": 330,
  "mobileBottomRow": 30,
  "mobileLeftColumn": 14,
  "mobileRightColumn": 38,
  "mobileTopRow": 6,
  "needsErrorInfo": false,
  "originalBottomRow": 423,
  "originalTopRow": 6,
  "parentColumnSpace": 17.3447265625,
  "parentId": "0",
  "parentRowSpace": 10,
  "renderMode": "CANVAS",
  "rightColumn": 38,
  "searchTags": [
    "dialog",
    "popup",
    "notification"
  ],
  "shouldScrollContents": true,
  "tags": [
    "Layout"
  ],
  "thumbnailSVG": "/static/media/thumbnail.c20e144182d9af35cde59e39d9afe632.svg",
  "topRow": 141,
  "type": "MODAL_WIDGET",
  "version": 2,
  "widgetId": "mvlvsb8nsj",
  "widgetName": "replace_asset_modal",
  "width": 1070
}