{
  "gitSyncId": "66fad2cd61cc9c7ad201098e_db486d71-8207-4373-ab92-2c175bbea3cc",
  "id": "Detalle de recurso_remove_utils",
  "unpublishedCollection": {
    "name": "remove_utils",
    "pageId": "Detalle de recurso",
    "pluginId": "js-plugin",
    "pluginType": "JS",
    "variables": []
  }
}