{
  "animateLoading": true,
  "borderRadius": "{{appsmith.theme.borderRadius.appBorderRadius}}",
  "bottomRow": 4,
  "boxShadow": "none",
  "buttonColor": "{{appsmith.theme.colors.primaryColor}}",
  "buttonVariant": "PRIMARY",
  "disabledWhenInvalid": false,
  "dynamicBindingPathList": [
    {
      "key": "buttonColor"
    },
    {
      "key": "borderRadius"
    }
  ],
  "dynamicPropertyPathList": [],
  "dynamicTriggerPathList": [
    {
      "key": "onClick"
    }
  ],
  "iconAlign": "left",
  "iconName": "refresh",
  "isDefaultClickDisabled": true,
  "isDisabled": false,
  "isLoading": false,
  "isVisible": true,
  "key": "jf8wcghf5d",
  "leftColumn": 58,
  "minWidth": 120,
  "mobileBottomRow": 4,
  "mobileLeftColumn": 48,
  "mobileRightColumn": 64,
  "mobileTopRow": 0,
  "needsErrorInfo": false,
  "onClick": "{{showModal(Modal1.name);}}",
  "parentColumnSpace": 13.431640625,
  "parentId": "ecf8whyu7k",
  "parentRowSpace": 10,
  "placement": "CENTER",
  "recaptchaType": "V3",
  "renderMode": "CANVAS",
  "resetFormOnClick": false,
  "responsiveBehavior": "hug",
  "rightColumn": 64,
  "text": "",
  "tooltip": "Reprocesar todos los contenidos",
  "topRow": 0,
  "type": "BUTTON_WIDGET",
  "version": 1,
  "widgetId": "dnzx7a9cxf",
  "widgetName": "Button2"
}