{
  "animateLoading": true,
  "borderRadius": "{{appsmith.theme.borderRadius.appBorderRadius}}",
  "bottomRow": 25,
  "boxShadow": "none",
  "buttonColor": "#ef4444",
  "buttonStyle": "PRIMARY_BUTTON",
  "buttonVariant": "PRIMARY",
  "disabledWhenInvalid": false,
  "dynamicBindingPathList": [
    {
      "key": "borderRadius"
    }
  ],
  "dynamicPropertyPathList": [],
  "dynamicTriggerPathList": [
    {
      "key": "onClick"
    }
  ],
  "isDefaultClickDisabled": true,
  "isDisabled": false,
  "isLoading": false,
  "isVisible": true,
  "key": "mgielyind0",
  "leftColumn": 47,
  "minWidth": 120,
  "mobileBottomRow": 22,
  "mobileLeftColumn": 47,
  "mobileRightColumn": 63,
  "mobileTopRow": 18,
  "needsErrorInfo": false,
  "onClick": "{{delete_tag.run().then(() => {\n  showAlert('Tag eliminado con exito!', 'success'); closeModal(delete_tag_modal.name);\n\ttags_utils.loadData();\n}).catch(() => {\n  showAlert('Ocurrio un error eliminando el tag!', 'error');\n});}}",
  "originalBottomRow": 25,
  "originalTopRow": 21,
  "parentId": "4qr45mw6x4",
  "placement": "CENTER",
  "recaptchaType": "V3",
  "renderMode": "CANVAS",
  "resetFormOnClick": false,
  "responsiveBehavior": "hug",
  "rightColumn": 63,
  "text": "Eliminar",
  "topRow": 21,
  "type": "BUTTON_WIDGET",
  "version": 1,
  "widgetId": "4y6olbrnff",
  "widgetName": "delete_tag_btn"
}