{
  "animateLoading": true,
  "borderRadius": "{{appsmith.theme.borderRadius.appBorderRadius}}",
  "bottomRow": 5,
  "displayName": "Text",
  "dynamicBindingPathList": [
    {
      "key": "truncateButtonColor"
    },
    {
      "key": "fontFamily"
    },
    {
      "key": "borderRadius"
    }
  ],
  "dynamicHeight": "AUTO_HEIGHT",
  "dynamicTriggerPathList": [],
  "fontFamily": "{{appsmith.theme.fontFamily.appFont}}",
  "fontSize": "1.25rem",
  "fontStyle": "BOLD",
  "hideCard": false,
  "iconSVG": "/static/media/icon.a55b701a2ae86aa2c6718ecb7b4083f0.svg",
  "isDeprecated": false,
  "isLoading": false,
  "isVisible": true,
  "key": "n8t04pm7nh",
  "leftColumn": 1,
  "maxDynamicHeight": 9000,
  "minDynamicHeight": 4,
  "minWidth": 450,
  "mobileBottomRow": 5,
  "mobileLeftColumn": 1,
  "mobileRightColumn": 41,
  "mobileTopRow": 1,
  "needsErrorInfo": false,
  "overflow": "NONE",
  "parentId": "3o33yoxr4u",
  "renderMode": "CANVAS",
  "responsiveBehavior": "fill",
  "rightColumn": 41,
  "searchTags": [
    "typography",
    "paragraph",
    "label"
  ],
  "shouldTruncate": false,
  "tags": [
    "Suggested",
    "Content"
  ],
  "text": "Crear Asset",
  "textAlign": "LEFT",
  "textColor": "#231F20",
  "thumbnailSVG": "/static/media/thumbnail.0c129b82c9b3e4cd4920563b289659ab.svg",
  "topRow": 1,
  "truncateButtonColor": "{{appsmith.theme.colors.primaryColor}}",
  "type": "TEXT_WIDGET",
  "version": 1,
  "widgetId": "shoxtv9agb",
  "widgetName": "Text1"
}