{
  "animateLoading": true,
  "borderRadius": "{{appsmith.theme.borderRadius.appBorderRadius}}",
  "bottomRow": 8,
  "boxShadow": "none",
  "defaultImage": "https://assets.appsmith.com/widgets/default.png",
  "dynamicBindingPathList": [
    {
      "key": "image"
    },
    {
      "key": "borderRadius"
    }
  ],
  "dynamicTriggerPathList": [],
  "enableDownload": false,
  "enableRotation": false,
  "flexVerticalAlignment": "start",
  "image": "{{currentItem.coverUrl}}",
  "imageShape": "RECTANGLE",
  "isLoading": false,
  "isVisible": true,
  "key": "b96gc6g18f",
  "leftColumn": 0,
  "maxZoomLevel": 1,
  "mobileBottomRow": 8,
  "mobileLeftColumn": 0,
  "mobileRightColumn": 16,
  "mobileTopRow": 0,
  "needsErrorInfo": false,
  "objectFit": "cover",
  "parentId": "65pgdgt1wm",
  "renderMode": "CANVAS",
  "rightColumn": 6,
  "topRow": 0,
  "type": "IMAGE_WIDGET",
  "version": 1,
  "widgetId": "e2avajaa1x",
  "widgetName": "Image1"
}