{
  "animateLoading": true,
  "borderRadius": "{{appsmith.theme.borderRadius.appBorderRadius}}",
  "bottomRow": 21,
  "boxShadow": "none",
  "buttonColor": "{{appsmith.theme.colors.primaryColor}}",
  "buttonStyle": "PRIMARY_BUTTON",
  "buttonVariant": "PRIMARY",
  "disabledWhenInvalid": false,
  "dynamicBindingPathList": [
    {
      "key": "buttonColor"
    },
    {
      "key": "borderRadius"
    }
  ],
  "dynamicPropertyPathList": [
    {
      "key": "onClick"
    }
  ],
  "dynamicTriggerPathList": [
    {
      "key": "onClick"
    }
  ],
  "isDefaultClickDisabled": true,
  "isDisabled": false,
  "isLoading": false,
  "isVisible": true,
  "key": "mgielyind0",
  "leftColumn": 47,
  "minWidth": 120,
  "mobileBottomRow": 22,
  "mobileLeftColumn": 47,
  "mobileRightColumn": 63,
  "mobileTopRow": 18,
  "needsErrorInfo": false,
  "onClick": "{{tags_utils.saveTag();\ncreate_tag.run({\n  body: appsmith.store.newTag\n}).then(() => {\n  showAlert('Tag creado con exito!', 'success');\n  closeModal(create_tag_modal.name);\n\ttags_utils.clearFields();\n  tags_utils.loadData();\n  \n}).catch(() => {\n  showAlert('Ocurrio un error!', 'error');\n  closeModal(create_tag_modal.name);\n});}}",
  "parentId": "5paoza6g7c",
  "placement": "CENTER",
  "recaptchaType": "V3",
  "renderMode": "CANVAS",
  "resetFormOnClick": false,
  "responsiveBehavior": "hug",
  "rightColumn": 63,
  "text": "Guardar",
  "topRow": 17,
  "type": "BUTTON_WIDGET",
  "version": 1,
  "widgetId": "47d58wxze4",
  "widgetName": "save_tag"
}