{
  "animateLoading": true,
  "bottomRow": 13,
  "capSide": 0,
  "capType": "nc",
  "displayName": "Divider",
  "dividerColor": "#858282",
  "dynamicBindingPathList": [],
  "hideCard": false,
  "iconSVG": "/static/media/icon.2903cd917d4a4a08afe7e1377c2adc93.svg",
  "isDeprecated": false,
  "isLoading": false,
  "isVisible": true,
  "key": "2lhjgry17b",
  "leftColumn": 1,
  "minWidth": 450,
  "mobileBottomRow": 19,
  "mobileLeftColumn": 2,
  "mobileRightColumn": 22,
  "mobileTopRow": 15,
  "needsErrorInfo": false,
  "onCanvasUI": {
    "disableParentSelection": false,
    "focusBGCSSVar": "--on-canvas-ui-widget-focus",
    "focusColorCSSVar": "--on-canvas-ui-widget-selection",
    "selectionBGCSSVar": "--on-canvas-ui-widget-selection",
    "selectionColorCSSVar": "--on-canvas-ui-widget-focus"
  },
  "orientation": "horizontal",
  "originalBottomRow": 13,
  "originalTopRow": 9,
  "parentColumnSpace": 12.29638671875,
  "parentId": "ecf8whyu7k",
  "parentRowSpace": 10,
  "renderMode": "CANVAS",
  "responsiveBehavior": "fill",
  "rightColumn": 63,
  "searchTags": [
    "line"
  ],
  "strokeStyle": "solid",
  "tags": [
    "Layout"
  ],
  "thickness": 2,
  "thumbnailSVG": "/static/media/thumbnail.85250b0a5e6d690bf6499c965e769b14.svg",
  "topRow": 9,
  "type": "DIVIDER_WIDGET",
  "version": 1,
  "widgetId": "9snktsliqr",
  "widgetName": "Divider1"
}