{
  "animateLoading": true,
  "borderRadius": "{{appsmith.theme.borderRadius.appBorderRadius}}",
  "bottomRow": 4,
  "boxShadow": "none",
  "buttonColor": "{{appsmith.theme.colors.primaryColor}}",
  "buttonVariant": "TERTIARY",
  "dynamicBindingPathList": [
    {
      "key": "buttonColor"
    },
    {
      "key": "borderRadius"
    }
  ],
  "dynamicTriggerPathList": [
    {
      "key": "onClick"
    }
  ],
  "iconName": "cross",
  "iconSize": 24,
  "isDisabled": false,
  "isLoading": false,
  "isVisible": true,
  "key": "a98138eu4a",
  "leftColumn": 58,
  "minWidth": 50,
  "mobileBottomRow": 4,
  "mobileLeftColumn": 58,
  "mobileRightColumn": 64,
  "mobileTopRow": 0,
  "needsErrorInfo": false,
  "onClick": "{{closeModal(delete_tag_modal.name);}}",
  "parentId": "4qr45mw6x4",
  "renderMode": "CANVAS",
  "responsiveBehavior": "hug",
  "rightColumn": 64,
  "topRow": 0,
  "type": "ICON_BUTTON_WIDGET",
  "version": 1,
  "widgetId": "2rddtvyjvm",
  "widgetName": "IconButton2"
}