{
  "accentColor": "{{appsmith.theme.colors.primaryColor}}",
  "allowClear": false,
  "animateLoading": true,
  "borderRadius": "{{appsmith.theme.borderRadius.appBorderRadius}}",
  "bottomRow": 152,
  "boxShadow": "none",
  "defaultOptionValue": "",
  "displayName": "Multi TreeSelect",
  "dynamicBindingPathList": [
    {
      "key": "accentColor"
    },
    {
      "key": "borderRadius"
    },
    {
      "key": "options"
    }
  ],
  "dynamicHeight": "FIXED",
  "dynamicTriggerPathList": [],
  "expandAll": false,
  "hideCard": false,
  "iconSVG": "/static/media/icon.8e0988176ef2c5bf3b641e36cf34d0e3.svg",
  "isDeprecated": false,
  "isDisabled": false,
  "isLoading": false,
  "isRequired": false,
  "isVisible": true,
  "key": "ibf46i3vb6",
  "labelAlignment": "left",
  "labelPosition": "Top",
  "labelText": "Educación Católica: Tema",
  "labelTextSize": "0.875rem",
  "labelTooltip": "Indica la tipificación que más se aproxime",
  "labelWidth": 5,
  "leftColumn": 0,
  "maxDynamicHeight": 9000,
  "minDynamicHeight": 4,
  "minWidth": 450,
  "mobileBottomRow": 48,
  "mobileLeftColumn": 0,
  "mobileRightColumn": 5,
  "mobileTopRow": 41,
  "mode": "SHOW_ALL",
  "needsErrorInfo": false,
  "options": "{{create_resource_utils.tagsResults[\"temas_generales\"]}}",
  "originalBottomRow": 131,
  "originalTopRow": 124,
  "parentColumnSpace": 17.97833251953125,
  "parentId": "fcqencswwu",
  "parentRowSpace": 10,
  "placeholderText": "",
  "renderMode": "CANVAS",
  "responsiveBehavior": "fill",
  "rightColumn": 62,
  "searchTags": [
    "dropdown",
    "multiselecttree"
  ],
  "tags": [
    "Select"
  ],
  "thumbnailSVG": "/static/media/thumbnail.d1dd4f1ce55fa3e93b8a4de404e481cc.svg",
  "topRow": 145,
  "type": "MULTI_SELECT_TREE_WIDGET",
  "version": 1,
  "widgetId": "c3mc54tz6x",
  "widgetName": "generalTopics_tags"
}