{
    "resetFormOnClick": false,
    "boxShadow": "none",
    "widgetName": "Close_Unassign_Modal",
    "onClick": "{{closeModal('Unassign_Modal');}}",
    "buttonColor": "{{appsmith.theme.colors.primaryColor}}",
    "displayName": "Button",
    "iconSVG": "/static/media/icon.cca026338f1c8eb6df8ba03d084c2fca.svg",
    "searchTags": [
        "click",
        "submit"
    ],
    "topRow": 27,
    "bottomRow": 31,
    "type": "BUTTON_WIDGET",
    "hideCard": false,
    "animateLoading": true,
    "dynamicTriggerPathList": [{"key": "onClick"}],
    "leftColumn": 31,
    "dynamicBindingPathList": [
        {"key": "buttonColor"},
        {"key": "borderRadius"}
    ],
    "text": "Close",
    "isDisabled": false,
    "key": "58a46up6bf",
    "isDeprecated": false,
    "rightColumn": 47,
    "isDefaultClickDisabled": true,
    "widgetId": "v0zjeb2l0j",
    "buttonStyle": "PRIMARY",
    "isVisible": true,
    "recaptchaType": "V3",
    "version": 1,
    "parentId": "1nwykznsrd",
    "renderMode": "CANVAS",
    "isLoading": false,
    "originalTopRow": 25,
    "disabledWhenInvalid": false,
    "borderRadius": "{{appsmith.theme.borderRadius.appBorderRadius}}",
    "originalBottomRow": 29,
    "buttonVariant": "SECONDARY",
    "placement": "CENTER"
}