{
    "resetFormOnClick": true,
    "boxShadow": "none",
    "mobileBottomRow": 37,
    "widgetName": "Reset_Form",
    "onClick": "{{resetWidget(\"Filter_Form\", true).then(() => {\n  handle_get_projects.getProjects();\n});}}",
    "buttonColor": "{{appsmith.theme.colors.primaryColor}}",
    "displayName": "Button",
    "iconSVG": "/static/media/icon.7beb9123fb53027d9d6b778cdfe4caed.svg",
    "searchTags": [
        "click",
        "submit"
    ],
    "topRow": 33,
    "bottomRow": 37,
    "type": "BUTTON_WIDGET",
    "hideCard": false,
    "mobileRightColumn": 46,
    "animateLoading": true,
    "dynamicTriggerPathList": [{"key": "onClick"}],
    "leftColumn": 30,
    "dynamicBindingPathList": [
        {"key": "buttonColor"},
        {"key": "borderRadius"}
    ],
    "text": "Reset",
    "isDisabled": false,
    "key": "zadllkfb3d",
    "isDeprecated": false,
    "rightColumn": 46,
    "isDefaultClickDisabled": true,
    "widgetId": "2pmwuxp6mu",
    "minWidth": 120,
    "isVisible": true,
    "recaptchaType": "V3",
    "version": 1,
    "parentId": "qj9lfc4dci",
    "renderMode": "CANVAS",
    "isLoading": false,
    "mobileTopRow": 33,
    "responsiveBehavior": "hug",
    "disabledWhenInvalid": false,
    "borderRadius": "{{appsmith.theme.borderRadius.appBorderRadius}}",
    "mobileLeftColumn": 30,
    "buttonVariant": "SECONDARY",
    "placement": "CENTER"
}