{
    "resetFormOnClick": true,
    "boxShadow": "none",
    "widgetName": "Confirm_Assign_Modal",
    "onClick": "{{assign_tutors.run(() => handle_get_projects.getProjects().then(closeModal('Assign_Modal')), () => showAlert('Hubo un error al asignar el tutor','error'))}}",
    "buttonColor": "{{appsmith.theme.colors.primaryColor}}",
    "dynamicPropertyPathList": [],
    "displayName": "Button",
    "iconSVG": "/static/media/icon.cca026338f1c8eb6df8ba03d084c2fca.svg",
    "searchTags": [
        "click",
        "submit"
    ],
    "topRow": 25,
    "bottomRow": 29,
    "type": "BUTTON_WIDGET",
    "hideCard": false,
    "animateLoading": true,
    "dynamicTriggerPathList": [{"key": "onClick"}],
    "leftColumn": 48,
    "dynamicBindingPathList": [
        {"key": "buttonColor"},
        {"key": "borderRadius"}
    ],
    "text": "Confirm",
    "isDisabled": false,
    "key": "58a46up6bf",
    "isDeprecated": false,
    "rightColumn": 64,
    "isDefaultClickDisabled": true,
    "widgetId": "y66aanqgm4",
    "buttonStyle": "PRIMARY_BUTTON",
    "isVisible": true,
    "recaptchaType": "V3",
    "version": 1,
    "parentId": "41bfjlbuen",
    "renderMode": "CANVAS",
    "isLoading": false,
    "originalTopRow": 25,
    "disabledWhenInvalid": false,
    "borderRadius": "{{appsmith.theme.borderRadius.appBorderRadius}}",
    "originalBottomRow": 29,
    "buttonVariant": "PRIMARY",
    "placement": "CENTER"
}