{
  "animateLoading": true,
  "borderRadius": "{{appsmith.theme.borderRadius.appBorderRadius}}",
  "bottomRow": 57,
  "boxShadow": "none",
  "canEscapeKeyClose": true,
  "canOutsideClickClose": true,
  "children": [
    {
      "borderRadius": "{{appsmith.theme.borderRadius.appBorderRadius}}",
      "bottomRow": 570,
      "boxShadow": "{{appsmith.theme.boxShadow.appBoxShadow}}",
      "canExtend": true,
      "detachFromLayout": true,
      "displayName": "Canvas",
      "dynamicBindingPathList": [
        {
          "key": "borderRadius"
        },
        {
          "key": "boxShadow"
        }
      ],
      "dynamicHeight": "AUTO_HEIGHT",
      "flexLayers": [],
      "hideCard": true,
      "isDeprecated": false,
      "isDisabled": false,
      "isLoading": false,
      "isVisible": true,
      "key": "k6s8lm3zkl",
      "leftColumn": 0,
      "maxDynamicHeight": 9000,
      "minDynamicHeight": 4,
      "minHeight": 570,
      "minWidth": 450,
      "mobileBottomRow": 0,
      "mobileLeftColumn": 0,
      "mobileRightColumn": 0,
      "mobileTopRow": 0,
      "parentColumnSpace": 1,
      "parentId": "u04kct5lqs",
      "parentRowSpace": 1,
      "renderMode": "CANVAS",
      "responsiveBehavior": "fill",
      "rightColumn": 0,
      "shouldScrollContents": false,
      "topRow": 0,
      "type": "CANVAS_WIDGET",
      "version": 1,
      "widgetId": "lfzk2khhf7",
      "widgetName": "Canvas2"
    }
  ],
  "detachFromLayout": true,
  "displayName": "Modal",
  "dynamicBindingPathList": [
    {
      "key": "borderRadius"
    }
  ],
  "dynamicHeight": "AUTO_HEIGHT",
  "height": 570,
  "hideCard": false,
  "iconSVG": "/static/media/icon.b374721fa8e1aeab7cf326c2d865506f.svg",
  "isCanvas": true,
  "isDeprecated": false,
  "isLoading": false,
  "key": "49dldjo99b",
  "leftColumn": 0,
  "maxDynamicHeight": 9000,
  "minDynamicHeight": 24,
  "minHeight": 570,
  "mobileBottomRow": 0,
  "mobileLeftColumn": 0,
  "mobileRightColumn": 0,
  "mobileTopRow": 0,
  "parentColumnSpace": 1,
  "parentId": "0",
  "parentRowSpace": 1,
  "renderMode": "CANVAS",
  "rightColumn": 0,
  "searchTags": [
    "dialog",
    "popup",
    "notification"
  ],
  "shouldScrollContents": true,
  "tags": [
    "Layout"
  ],
  "topRow": 0,
  "type": "MODAL_WIDGET",
  "version": 2,
  "widgetId": "u04kct5lqs",
  "widgetName": "Modal1",
  "width": 1084
}