{
  "animateLoading": true,
  "borderColor": "#747579",
  "borderOpacity": 100,
  "borderRadius": "{{appsmith.theme.borderRadius.appBorderRadius}}",
  "borderWidth": 1,
  "bottomRow": 101,
  "boxShadow": "{{appsmith.theme.boxShadow.appBoxShadow}}",
  "displayName": "Iframe",
  "dynamicBindingPathList": [
    {
      "key": "borderRadius"
    },
    {
      "key": "boxShadow"
    },
    {
      "key": "srcDoc"
    }
  ],
  "dynamicTriggerPathList": [],
  "flexVerticalAlignment": "start",
  "hideCard": false,
  "iconSVG": "/static/media/icon.a84667dbdc548d14f7c83df551151550.svg",
  "isDeprecated": false,
  "isLoading": false,
  "isVisible": true,
  "key": "b5zq205gem",
  "leftColumn": 25,
  "mobileBottomRow": 43,
  "mobileLeftColumn": 31,
  "mobileRightColumn": 55,
  "mobileTopRow": 11,
  "originalBottomRow": 101,
  "originalTopRow": 7,
  "parentColumnSpace": 17.40625,
  "parentId": "0",
  "parentRowSpace": 10,
  "renderMode": "CANVAS",
  "responsiveBehavior": "fill",
  "rightColumn": 64,
  "searchTags": [
    "embed"
  ],
  "source": "https://www.example.com",
  "srcDoc": "<!DOCTYPE html>\n<html xmlns=\"https://www.w3.org/1999/xhtml\" lang=\"es\">\n\n<head>\n  <meta charset=\"UTF-8\">\n  <meta name=\"viewport\" content=\"width=device-width,initial-scale=1\">\n  <meta name=\"x-apple-disable-message-reformatting\">\n  <!--[if mso]> \n<noscript> \n<xml> \n<o:OfficeDocumentSettings> \n<o:PixelsPerInch>96</o:PixelsPerInch> \n</o:OfficeDocumentSettings> \n</xml> \n</noscript> \n<![endif]-->\n  <link href=\"https://fonts.googleapis.com/css2?family=Roboto:wght@100;400;500&display=swap\" rel=\"stylesheet\" />\n  <link href=\"https://fonts.googleapis.com/css2?family=Inter&display=swap\" rel=\"stylesheet\" />\n</head>\n<body style=\"max-width: 700px;margin: 0 auto\">\n<main style=\"font-family: 'Roboto', sans-serif;margin: 0 auto;text-align: center;width: 100%;padding: 0px;box-sizing: border-box;background-color:#F9FAFB;\">\n  <header style=\"background-color: transparent;width: 100%;height: 89px;display: table;border-bottom: 2px solid #c4c4c4;\">\n    <div style=\" display: table-cell;vertical-align: middle;text-align: center;\">\n      <img style=\"object-fit: cover;height: 59px;margin: 0 auto;display: block;\" src={{Form1.data.image}}  alt=\"imagen-logo\"/>\n</div>\n</header>\n  <div style=\"color: #000000;padding-top: 16px;padding-bottom: 16px;text-align: center;font-style: normal;\">\n    <h2 style=\"font-size: 20px;font-weight: 700;line-height: 30px;text-transform: capitalize;margin: 0px;\">\n      ¡Hola, #user_name!</h2>\n    <h3 style=\"margin: 0;font-size: 14px;letter-spacing: 0.1px;line-height: 22px;font-weight: 400;white-space: pre-wrap;padding: 10px;font-weight: {{SwitchTitle.isSwitchedOn ? '700' : '400'}}\">{{Form1.data.title}}</h3>\n    <a style=\"background-color: {{Form1.data.color ? Form1.data.color : '#000066'}};color: #ffffff;font-size: 14px;font-weight: 500;border-radius: 20px;text-decoration: none;height: 37px;line-height: 37px;display: inline-block;padding: 0 24px;text-transform: uppercase;cursor: pointer;box-sizing: border-box;\" target=\"_blank\" href=\"#button_action\">{{Form1.data.name_button}}</a>\n<div style=\"font-size: 14px;letter-spacing: 0.1px;line-height: 22px;font-weight: 400;white-space: pre-wrap;padding: 10px;min-height: 150px;\"><div style=\"padding: 0 10px;\">\n{{ Form1.data.description1 ? (SwitchDescription1.isSwitchedOn ?\n\t\t\t\t\t\t\t\t\t\t\t\t\t\t\t`<strong>${Form1.data.description1}</strong>` : `<p style=\"margin: 0;\">${Form1.data.description1}</p>`)  \n: ''\n}}{{ Form1.data.link ? \n`<a style=\"color: ${Form1.data.color ? Form1.data.color : '#000066'};cursor:pointer;\" href=\"${Form1.data.link}\" target=\"_blank\">${Form1.data.link}</a>` \n: '' }}\n\n{{ Form1.data.description2 ? (SwitchDescription2.isSwitchedOn ?\n\t\t\t\t\t\t\t\t\t\t\t\t\t\t\t`<strong>${Form1.data.description2}</strong>` : `<p style=\"margin: 0;\">${Form1.data.description2}</p>`)  \n: ''\n}}\n{{ Form1.data.description3 ? (SwitchDescription3.isSwitchedOn ?\n\t\t\t\t\t\t\t\t\t\t\t\t\t\t\t`<strong>${Form1.data.description3}</strong>` : `<p style=\"margin: 0;\">${Form1.data.description3}</p>`)  \n: ''\n}}\n</div>\n</div>\n</div></div>\n<footer style=\"text-align: center;min-height: 75px;background: #2d2d2d;font-family: 'Inter', sans-serif;color: #ffffff;white-space: pre-line;padding: 16px\">\n<p style=\"margin: 0 auto;line-height: 21px;font-size: 11px;\">{{Form1.data.footer}} <a style=\"color: #ffffff;cursor: pointer;\" href=\"mailto:soporte.gsp@trenesargentinos.gob.ar\" target=\"_blank\">\nsoporte.gsp@trenesargentinos.gob.ar</a></p></footer>\n</main>\n</body>\n</html>",
  "tags": [
    "Display"
  ],
  "topRow": 7,
  "type": "IFRAME_WIDGET",
  "version": 1,
  "widgetId": "h96vwc79mu",
  "widgetName": "Iframe1"
}