{
  "accentColor": "{{appsmith.theme.colors.primaryColor}}",
  "animateLoading": true,
  "borderRadius": "{{appsmith.theme.borderRadius.appBorderRadius}}",
  "bottomRow": 17,
  "boxShadow": "none",
  "defaultOptionValue": "{{ ((options, serverSideFiltering) => ( clients.data.data.find(e=>e.id===Table1.triggeredRow.id).template_group.id))(Select2.options, Select2.serverSideFiltering) }}",
  "displayName": "Select",
  "dynamicBindingPathList": [
    {
      "key": "accentColor"
    },
    {
      "key": "borderRadius"
    },
    {
      "key": "sourceData"
    },
    {
      "key": "defaultOptionValue"
    }
  ],
  "dynamicHeight": "FIXED",
  "dynamicPropertyPathList": [
    {
      "key": "sourceData"
    }
  ],
  "dynamicTriggerPathList": [],
  "hideCard": false,
  "iconSVG": "/static/media/icon.a7b19dc8b31d68fcff57f1d2c0084a18.svg",
  "isDeprecated": false,
  "isDisabled": false,
  "isFilterable": true,
  "isLoading": false,
  "isRequired": false,
  "isVisible": true,
  "key": "jl01ne1x8g",
  "labelAlignment": "left",
  "labelPosition": "Top",
  "labelText": "Label",
  "labelTextSize": "0.875rem",
  "labelWidth": 5,
  "leftColumn": 2,
  "maxDynamicHeight": 9000,
  "minDynamicHeight": 4,
  "minWidth": 450,
  "mobileBottomRow": 14,
  "mobileLeftColumn": 4,
  "mobileRightColumn": 24,
  "mobileTopRow": 7,
  "optionLabel": "label",
  "optionValue": "value",
  "originalBottomRow": 17,
  "originalTopRow": 10,
  "parentColumnSpace": 6.408203125,
  "parentId": "1wldzng1fe",
  "parentRowSpace": 10,
  "placeholderText": "Select option",
  "renderMode": "CANVAS",
  "responsiveBehavior": "fill",
  "rightColumn": 64,
  "searchTags": [
    "dropdown"
  ],
  "serverSideFiltering": false,
  "sourceData": "{{list_template_group.data.data.map( (obj) =>{ return  {'label': obj.name, 'value': obj.id } })}}",
  "tags": [
    "Suggested",
    "Select"
  ],
  "topRow": 10,
  "type": "SELECT_WIDGET",
  "version": 1,
  "widgetId": "7nogr5n76d",
  "widgetName": "Select2"
}