{
  "gitSyncId": "657c7408e37f4e4645583e08_65c5495eb9c9626798e24439",
  "unpublishedPage": {
    "isHidden": false,
    "layouts": [
      {
        "dsl": {
          "backgroundColor": "none",
          "bottomRow": 780,
          "canExtend": true,
          "containerStyle": "none",
          "detachFromLayout": true,
          "dynamicBindingPathList": [],
          "leftColumn": 0,
          "minHeight": 620,
          "parentColumnSpace": 1,
          "parentRowSpace": 1,
          "rightColumn": 1224,
          "snapColumns": 64,
          "snapRows": 60,
          "topRow": 0,
          "type": "CANVAS_WIDGET",
          "version": 91,
          "widgetId": "0",
          "widgetName": "MainContainer"
        }
      }
    ],
    "name": "Lista de Template",
    "slug": "lista-de-template"
  }
}