{
  "accentColor": "{{appsmith.theme.colors.primaryColor}}",
  "animateLoading": true,
  "borderColor": "#E0DEDE",
  "borderRadius": "{{appsmith.theme.borderRadius.appBorderRadius}}",
  "borderWidth": "1",
  "bottomRow": 33,
  "boxShadow": "{{appsmith.theme.boxShadow.appBoxShadow}}",
  "canFreezeColumn": true,
  "childStylesheet": {
    "button": {
      "borderRadius": "{{appsmith.theme.borderRadius.appBorderRadius}}",
      "boxShadow": "none",
      "buttonColor": "{{appsmith.theme.colors.primaryColor}}"
    },
    "editActions": {
      "discardBorderRadius": "{{appsmith.theme.borderRadius.appBorderRadius}}",
      "discardButtonColor": "{{appsmith.theme.colors.primaryColor}}",
      "saveBorderRadius": "{{appsmith.theme.borderRadius.appBorderRadius}}",
      "saveButtonColor": "{{appsmith.theme.colors.primaryColor}}"
    },
    "iconButton": {
      "borderRadius": "{{appsmith.theme.borderRadius.appBorderRadius}}",
      "boxShadow": "none",
      "buttonColor": "{{appsmith.theme.colors.primaryColor}}"
    },
    "menuButton": {
      "borderRadius": "{{appsmith.theme.borderRadius.appBorderRadius}}",
      "boxShadow": "none",
      "menuColor": "{{appsmith.theme.colors.primaryColor}}"
    }
  },
  "columnOrder": [
    "id",
    "client_id",
    "name",
    "action",
    "subject",
    "created_at",
    "updated_at",
    "html",
    "customColumn1",
    "customColumn2"
  ],
  "columnUpdatedAt": 1712608615874,
  "columnWidthMap": {},
  "defaultPageSize": 0,
  "defaultSelectedRowIndex": 0,
  "defaultSelectedRowIndices": [
    0
  ],
  "delimiter": ",",
  "displayName": "Table",
  "dynamicBindingPathList": [
    {
      "key": "accentColor"
    },
    {
      "key": "borderRadius"
    },
    {
      "key": "boxShadow"
    },
    {
      "key": "tableData"
    },
    {
      "key": "primaryColumns.id.computedValue"
    },
    {
      "key": "primaryColumns.client_id.computedValue"
    },
    {
      "key": "primaryColumns.subject.computedValue"
    },
    {
      "key": "primaryColumns.name.computedValue"
    },
    {
      "key": "primaryColumns.action.computedValue"
    },
    {
      "key": "primaryColumns.created_at.computedValue"
    },
    {
      "key": "primaryColumns.updated_at.computedValue"
    },
    {
      "key": "primaryColumns.html.computedValue"
    },
    {
      "key": "primaryColumns.customColumn1.buttonColor"
    },
    {
      "key": "primaryColumns.customColumn1.borderRadius"
    },
    {
      "key": "primaryColumns.customColumn1.boxShadow"
    },
    {
      "key": "primaryColumns.customColumn2.borderRadius"
    },
    {
      "key": "primaryColumns.customColumn2.boxShadow"
    }
  ],
  "dynamicPropertyPathList": [
    {
      "key": "tableData"
    }
  ],
  "dynamicTriggerPathList": [
    {
      "key": "primaryColumns.html.onClick"
    },
    {
      "key": "primaryColumns.customColumn1.onClick"
    },
    {
      "key": "primaryColumns.customColumn2.onClick"
    }
  ],
  "enableClientSideSearch": true,
  "flexVerticalAlignment": "start",
  "hideCard": false,
  "horizontalAlignment": "LEFT",
  "iconSVG": "/static/media/icon.e6911f8bb94dc6c4a102a74740c41763.svg",
  "inlineEditingSaveOption": "ROW_LEVEL",
  "isDeprecated": false,
  "isLoading": false,
  "isSortable": true,
  "isVisible": true,
  "isVisibleDownload": true,
  "isVisibleFilters": true,
  "isVisiblePagination": true,
  "isVisibleSearch": true,
  "key": "wsrpj2c0ti",
  "label": "Data",
  "leftColumn": 1,
  "minWidth": 450,
  "mobileBottomRow": 33,
  "mobileLeftColumn": 1,
  "mobileRightColumn": 35,
  "mobileTopRow": 5,
  "needsHeightForContent": true,
  "parentColumnSpace": 6.9375,
  "parentId": "lfzk2khhf7",
  "parentRowSpace": 10,
  "primaryColumns": {
    "action": {
      "alias": "action",
      "allowCellWrapping": false,
      "allowSameOptionsInNewRow": true,
      "columnType": "text",
      "computedValue": "{{Table2.processedTableData.map((currentRow, currentIndex) => ( currentRow[\"action\"]))}}",
      "currencyCode": "USD",
      "decimals": 0,
      "enableFilter": true,
      "enableSort": true,
      "horizontalAlignment": "LEFT",
      "id": "action",
      "index": 4,
      "isCellEditable": false,
      "isCellVisible": true,
      "isDerived": false,
      "isDisabled": false,
      "isDiscardVisible": true,
      "isEditable": false,
      "isSaveVisible": true,
      "isVisible": true,
      "label": "action",
      "notation": "standard",
      "originalId": "action",
      "sticky": "",
      "textSize": "0.875rem",
      "thousandSeparator": true,
      "validation": {},
      "verticalAlignment": "CENTER",
      "width": 150
    },
    "client_id": {
      "alias": "client_id",
      "allowCellWrapping": false,
      "allowSameOptionsInNewRow": true,
      "columnType": "text",
      "computedValue": "{{Table2.processedTableData.map((currentRow, currentIndex) => ( currentRow[\"client_id\"]))}}",
      "currencyCode": "USD",
      "decimals": 0,
      "enableFilter": true,
      "enableSort": true,
      "horizontalAlignment": "LEFT",
      "id": "client_id",
      "index": 1,
      "isCellEditable": false,
      "isCellVisible": true,
      "isDerived": false,
      "isDisabled": false,
      "isDiscardVisible": true,
      "isEditable": false,
      "isSaveVisible": true,
      "isVisible": false,
      "label": "client_id",
      "notation": "standard",
      "originalId": "client_id",
      "sticky": "",
      "textSize": "0.875rem",
      "thousandSeparator": true,
      "validation": {},
      "verticalAlignment": "CENTER",
      "width": 150
    },
    "created_at": {
      "alias": "created_at",
      "allowCellWrapping": false,
      "allowSameOptionsInNewRow": true,
      "columnType": "date",
      "computedValue": "{{Table2.processedTableData.map((currentRow, currentIndex) => ( currentRow[\"created_at\"]))}}",
      "currencyCode": "USD",
      "decimals": 0,
      "enableFilter": true,
      "enableSort": true,
      "horizontalAlignment": "LEFT",
      "id": "created_at",
      "index": 5,
      "isCellEditable": false,
      "isCellVisible": true,
      "isDerived": false,
      "isDisabled": false,
      "isDiscardVisible": true,
      "isEditable": false,
      "isSaveVisible": true,
      "isVisible": false,
      "label": "created_at",
      "notation": "standard",
      "originalId": "created_at",
      "sticky": "",
      "textSize": "0.875rem",
      "thousandSeparator": true,
      "validation": {},
      "verticalAlignment": "CENTER",
      "width": 150
    },
    "customColumn1": {
      "alias": "Ver Template",
      "allowCellWrapping": false,
      "allowSameOptionsInNewRow": true,
      "borderRadius": "{{Table2.processedTableData.map((currentRow, currentIndex) => ( (appsmith.theme.borderRadius.appBorderRadius)))}}",
      "boxShadow": "{{Table2.processedTableData.map((currentRow, currentIndex) => ( \"none\"))}}",
      "buttonColor": "{{Table2.processedTableData.map((currentRow, currentIndex) => ( (appsmith.theme.colors.primaryColor)))}}",
      "buttonLabel": "Ver Template",
      "buttonStyle": "rgb(3, 179, 101)",
      "columnType": "button",
      "computedValue": "",
      "currencyCode": "USD",
      "customAlias": "",
      "decimals": 0,
      "enableFilter": true,
      "enableSort": true,
      "horizontalAlignment": "LEFT",
      "id": "customColumn1",
      "index": 8,
      "isCellEditable": false,
      "isCellVisible": true,
      "isDerived": true,
      "isDisabled": false,
      "isDiscardVisible": true,
      "isEditable": false,
      "isSaveVisible": true,
      "isVisible": true,
      "label": "Ver Template",
      "labelColor": "#FFFFFF",
      "notation": "standard",
      "onClick": "{{showModal('Modal2');}}",
      "originalId": "customColumn1",
      "sticky": "",
      "textSize": "0.875rem",
      "thousandSeparator": true,
      "validation": {},
      "verticalAlignment": "CENTER",
      "width": 150
    },
    "customColumn2": {
      "alias": "Remover Template",
      "allowCellWrapping": false,
      "allowSameOptionsInNewRow": true,
      "borderRadius": "{{Table2.processedTableData.map((currentRow, currentIndex) => ( (appsmith.theme.borderRadius.appBorderRadius)))}}",
      "boxShadow": "{{Table2.processedTableData.map((currentRow, currentIndex) => ( \"none\"))}}",
      "buttonColor": "#ef4444",
      "buttonStyle": "rgb(3, 179, 101)",
      "columnType": "iconButton",
      "computedValue": "",
      "currencyCode": "USD",
      "customAlias": "",
      "decimals": 0,
      "enableFilter": true,
      "enableSort": true,
      "horizontalAlignment": "LEFT",
      "iconName": "trash",
      "id": "customColumn2",
      "index": 9,
      "isCellEditable": false,
      "isCellVisible": true,
      "isDerived": true,
      "isDisabled": false,
      "isDiscardVisible": true,
      "isEditable": false,
      "isSaveVisible": true,
      "isVisible": true,
      "label": "Remover Template",
      "labelColor": "#FFFFFF",
      "notation": "standard",
      "onClick": "{{template_group_remove_template.run().then(() => {\n  showAlert('Se removio el template correctamente', 'success');\n  closeModal('Modal1');\n  list_template_group.run();\n});}}",
      "originalId": "customColumn2",
      "sticky": "",
      "textSize": "0.875rem",
      "thousandSeparator": true,
      "validation": {},
      "verticalAlignment": "CENTER",
      "width": 150
    },
    "html": {
      "alias": "html",
      "allowCellWrapping": false,
      "allowSameOptionsInNewRow": true,
      "buttonLabel": "Ver Template",
      "columnType": "text",
      "computedValue": "{{Table2.processedTableData.map((currentRow, currentIndex) => ( currentRow[\"html\"]))}}",
      "currencyCode": "USD",
      "customAlias": "",
      "decimals": 0,
      "enableFilter": true,
      "enableSort": true,
      "horizontalAlignment": "LEFT",
      "id": "html",
      "index": 7,
      "isCellEditable": false,
      "isCellVisible": true,
      "isDerived": false,
      "isDisabled": false,
      "isDiscardVisible": true,
      "isEditable": false,
      "isSaveVisible": true,
      "isVisible": true,
      "label": "html",
      "notation": "standard",
      "onClick": "{{showModal('Modal2');}}",
      "originalId": "html",
      "sticky": "",
      "textSize": "0.875rem",
      "thousandSeparator": true,
      "validation": {},
      "verticalAlignment": "CENTER",
      "width": 150
    },
    "id": {
      "alias": "id",
      "allowCellWrapping": false,
      "allowSameOptionsInNewRow": true,
      "columnType": "text",
      "computedValue": "{{Table2.processedTableData.map((currentRow, currentIndex) => ( currentRow[\"id\"]))}}",
      "currencyCode": "USD",
      "decimals": 0,
      "enableFilter": true,
      "enableSort": true,
      "horizontalAlignment": "LEFT",
      "id": "id",
      "index": 0,
      "isCellEditable": false,
      "isCellVisible": true,
      "isDerived": false,
      "isDisabled": false,
      "isDiscardVisible": true,
      "isEditable": false,
      "isSaveVisible": true,
      "isVisible": false,
      "label": "id",
      "notation": "standard",
      "originalId": "id",
      "sticky": "",
      "textSize": "0.875rem",
      "thousandSeparator": true,
      "validation": {},
      "verticalAlignment": "CENTER",
      "width": 150
    },
    "name": {
      "alias": "name",
      "allowCellWrapping": false,
      "allowSameOptionsInNewRow": true,
      "columnType": "text",
      "computedValue": "{{Table2.processedTableData.map((currentRow, currentIndex) => ( currentRow[\"name\"]))}}",
      "currencyCode": "USD",
      "decimals": 0,
      "enableFilter": true,
      "enableSort": true,
      "horizontalAlignment": "LEFT",
      "id": "name",
      "index": 3,
      "isCellEditable": false,
      "isCellVisible": true,
      "isDerived": false,
      "isDisabled": false,
      "isDiscardVisible": true,
      "isEditable": false,
      "isSaveVisible": true,
      "isVisible": true,
      "label": "name",
      "notation": "standard",
      "originalId": "name",
      "sticky": "",
      "textSize": "0.875rem",
      "thousandSeparator": true,
      "validation": {},
      "verticalAlignment": "CENTER",
      "width": 150
    },
    "subject": {
      "alias": "subject",
      "allowCellWrapping": false,
      "allowSameOptionsInNewRow": true,
      "columnType": "text",
      "computedValue": "{{Table2.processedTableData.map((currentRow, currentIndex) => ( currentRow[\"subject\"]))}}",
      "currencyCode": "USD",
      "decimals": 0,
      "enableFilter": true,
      "enableSort": true,
      "horizontalAlignment": "LEFT",
      "id": "subject",
      "index": 2,
      "isCellEditable": false,
      "isCellVisible": true,
      "isDerived": false,
      "isDisabled": false,
      "isDiscardVisible": true,
      "isEditable": false,
      "isSaveVisible": true,
      "isVisible": true,
      "label": "subject",
      "notation": "standard",
      "originalId": "subject",
      "sticky": "",
      "textSize": "0.875rem",
      "thousandSeparator": true,
      "validation": {},
      "verticalAlignment": "CENTER",
      "width": 150
    },
    "updated_at": {
      "alias": "updated_at",
      "allowCellWrapping": false,
      "allowSameOptionsInNewRow": true,
      "columnType": "date",
      "computedValue": "{{Table2.processedTableData.map((currentRow, currentIndex) => ( currentRow[\"updated_at\"]))}}",
      "currencyCode": "USD",
      "decimals": 0,
      "enableFilter": true,
      "enableSort": true,
      "horizontalAlignment": "LEFT",
      "id": "updated_at",
      "index": 6,
      "isCellEditable": false,
      "isCellVisible": true,
      "isDerived": false,
      "isDisabled": false,
      "isDiscardVisible": true,
      "isEditable": false,
      "isSaveVisible": true,
      "isVisible": false,
      "label": "updated_at",
      "notation": "standard",
      "originalId": "updated_at",
      "sticky": "",
      "textSize": "0.875rem",
      "thousandSeparator": true,
      "validation": {},
      "verticalAlignment": "CENTER",
      "width": 150
    }
  },
  "renderMode": "CANVAS",
  "responsiveBehavior": "fill",
  "rightColumn": 62,
  "searchKey": "",
  "tableData": "{{get_template_group_by_id.data.data.templates}}",
  "tags": [
    "Suggested",
    "Display"
  ],
  "textSize": "0.875rem",
  "topRow": 5,
  "totalRecordsCount": 0,
  "type": "TABLE_WIDGET_V2",
  "version": 2,
  "verticalAlignment": "CENTER",
  "widgetId": "qkvykiiqzl",
  "widgetName": "Table2"
}