{
  "accentColor": "{{appsmith.theme.colors.primaryColor}}",
  "alignWidget": "LEFT",
  "animateLoading": true,
  "bottomRow": 95,
  "boxShadow": "none",
  "defaultSwitchState": "false",
  "displayName": "Switch",
  "dynamicBindingPathList": [
    {
      "key": "accentColor"
    }
  ],
  "dynamicHeight": "AUTO_HEIGHT",
  "dynamicPropertyPathList": [
    {
      "key": "defaultSwitchState"
    }
  ],
  "dynamicTriggerPathList": [],
  "hideCard": false,
  "iconSVG": "/static/media/icon.afbd826fee9d09b12c5cde30a8c6fe62.svg",
  "isDeprecated": false,
  "isDisabled": false,
  "isLoading": false,
  "isVisible": true,
  "key": "0oisvc2lsq",
  "label": "Negrita",
  "labelPosition": "Left",
  "leftColumn": 43,
  "maxDynamicHeight": 9000,
  "minDynamicHeight": 4,
  "mobileBottomRow": 80,
  "mobileLeftColumn": 49,
  "mobileRightColumn": 61,
  "mobileTopRow": 76,
  "originalBottomRow": 97,
  "originalTopRow": 93,
  "parentColumnSpace": 6.548828125,
  "parentId": "rfb6vspdxd",
  "parentRowSpace": 10,
  "renderMode": "CANVAS",
  "responsiveBehavior": "fill",
  "rightColumn": 61,
  "searchTags": [
    "boolean"
  ],
  "tags": [
    "Toggles"
  ],
  "topRow": 91,
  "type": "SWITCH_WIDGET",
  "version": 1,
  "widgetId": "kweuksu5vs",
  "widgetName": "SwitchDescription1"
}