{
  "animateLoading": true,
  "borderRadius": "{{appsmith.theme.borderRadius.appBorderRadius}}",
  "bottomRow": 1530,
  "boxShadow": "none",
  "canEscapeKeyClose": true,
  "canOutsideClickClose": true,
  "children": [
    {
      "borderRadius": "{{appsmith.theme.borderRadius.appBorderRadius}}",
      "bottomRow": 1460,
      "boxShadow": "{{appsmith.theme.boxShadow.appBoxShadow}}",
      "canExtend": true,
      "detachFromLayout": true,
      "displayName": "Canvas",
      "dynamicBindingPathList": [
        {
          "key": "borderRadius"
        },
        {
          "key": "boxShadow"
        }
      ],
      "dynamicHeight": "AUTO_HEIGHT",
      "flexLayers": [],
      "hideCard": true,
      "isDeprecated": false,
      "isDisabled": false,
      "isLoading": false,
      "isVisible": true,
      "key": "8k134009u6",
      "leftColumn": 0,
      "maxDynamicHeight": 9000,
      "minDynamicHeight": 4,
      "minHeight": 2400,
      "minWidth": 450,
      "mobileBottomRow": 240,
      "mobileLeftColumn": 0,
      "mobileRightColumn": 384.0625,
      "mobileTopRow": 0,
      "parentColumnSpace": 1,
      "parentId": "kiwvm09c4z",
      "parentRowSpace": 1,
      "renderMode": "CANVAS",
      "responsiveBehavior": "fill",
      "rightColumn": 384.0625,
      "shouldScrollContents": false,
      "topRow": 0,
      "type": "CANVAS_WIDGET",
      "version": 1,
      "widgetId": "erxj2ou6ln",
      "widgetName": "Canvas1"
    }
  ],
  "detachFromLayout": true,
  "displayName": "Modal",
  "dynamicBindingPathList": [
    {
      "key": "borderRadius"
    }
  ],
  "dynamicHeight": "AUTO_HEIGHT",
  "height": 1460,
  "hideCard": false,
  "iconSVG": "/static/media/icon.b374721fa8e1aeab7cf326c2d865506f.svg",
  "isCanvas": true,
  "isDeprecated": false,
  "isLoading": false,
  "key": "9gm5cvz1e0",
  "leftColumn": 0,
  "maxDynamicHeight": 9000,
  "minDynamicHeight": 24,
  "mobileBottomRow": 94,
  "mobileLeftColumn": 0,
  "mobileRightColumn": 20,
  "mobileTopRow": 70,
  "parentColumnSpace": 19.203125,
  "parentId": "0",
  "parentRowSpace": 10,
  "renderMode": "CANVAS",
  "rightColumn": 20,
  "searchTags": [
    "dialog",
    "popup",
    "notification"
  ],
  "shouldScrollContents": true,
  "tags": [
    "Layout"
  ],
  "topRow": 70,
  "type": "MODAL_WIDGET",
  "version": 2,
  "widgetId": "kiwvm09c4z",
  "widgetName": "Modal1",
  "width": 1178.95
}