{
  "animateLoading": true,
  "borderRadius": "{{appsmith.theme.borderRadius.appBorderRadius}}",
  "bottomRow": 9,
  "displayName": "Text",
  "dynamicBindingPathList": [
    {
      "key": "truncateButtonColor"
    },
    {
      "key": "borderRadius"
    },
    {
      "key": "text"
    }
  ],
  "dynamicHeight": "AUTO_HEIGHT",
  "dynamicTriggerPathList": [],
  "fontFamily": "System Default",
  "fontSize": "0.875rem",
  "fontStyle": "",
  "hideCard": false,
  "iconSVG": "/static/media/icon.97c59b523e6f70ba6f40a10fc2c7c5b5.svg",
  "isDeprecated": false,
  "isLoading": false,
  "isVisible": true,
  "key": "fg8k0rdm89",
  "leftColumn": 1,
  "maxDynamicHeight": 9000,
  "minDynamicHeight": 4,
  "minWidth": 450,
  "mobileBottomRow": 9,
  "mobileLeftColumn": 0,
  "mobileRightColumn": 13,
  "mobileTopRow": 5,
  "originalBottomRow": 10,
  "originalTopRow": 5,
  "overflow": "NONE",
  "parentColumnSpace": 4.19091796875,
  "parentId": "1jq7sd0upb",
  "parentRowSpace": 10,
  "renderMode": "CANVAS",
  "responsiveBehavior": "fill",
  "rightColumn": 63,
  "searchTags": [
    "typography",
    "paragraph",
    "label"
  ],
  "shouldTruncate": false,
  "text": "{{!rubric_criterions_levels_table.selectedRow.id ? \"\":rubric_criterions_levels_table.selectedRow.id}} ",
  "textAlign": "LEFT",
  "textColor": "#231F20",
  "topRow": 5,
  "truncateButtonColor": "{{appsmith.theme.colors.primaryColor}}",
  "type": "TEXT_WIDGET",
  "version": 1,
  "widgetId": "5syos5yyno",
  "widgetName": "id_level"
}