{
  "appIsExample": false,
  "applicationDetail": {
    "themeSetting": {
      "appMaxWidth": "LARGE",
      "density": 1.0,
      "sizing": 1.0
    }
  },
  "applicationVersion": 2,
  "collapseInvisibleWidgets": true,
  "color": "#F3F1C7",
  "evaluationVersion": 2,
  "icon": "money",
  "pages": [
    {
      "id": "Crear-Editar Criterio",
      "isDefault": true
    },
    {
      "id": "Crear-Editar Rubricas",
      "isDefault": false
    }
  ],
  "unpublishedApplicationDetail": {
    "themeSetting": {
      "appMaxWidth": "LARGE",
      "density": 1.0,
      "sizing": 1.0
    }
  }
}