{
  "animateLoading": true,
  "borderRadius": "{{appsmith.theme.borderRadius.appBorderRadius}}",
  "bottomRow": 37,
  "boxShadow": "none",
  "buttonColor": "{{appsmith.theme.colors.primaryColor}}",
  "buttonVariant": "SECONDARY",
  "disabledWhenInvalid": false,
  "displayName": "Button",
  "dynamicBindingPathList": [
    {
      "key": "buttonColor"
    },
    {
      "key": "borderRadius"
    }
  ],
  "hideCard": false,
  "iconSVG": "/static/media/icon.cca026338f1c8eb6df8ba03d084c2fca.svg",
  "isDefaultClickDisabled": true,
  "isDeprecated": false,
  "isDisabled": false,
  "isLoading": false,
  "isVisible": true,
  "key": "jnrhhhqrsa",
  "leftColumn": 2,
  "minWidth": 120,
  "mobileBottomRow": 37,
  "mobileLeftColumn": 30,
  "mobileRightColumn": 46,
  "mobileTopRow": 33,
  "originalBottomRow": 38,
  "originalTopRow": 34,
  "parentId": "1jq7sd0upb",
  "placement": "CENTER",
  "recaptchaType": "V3",
  "renderMode": "CANVAS",
  "resetFormOnClick": true,
  "responsiveBehavior": "hug",
  "rightColumn": 18,
  "searchTags": [
    "click",
    "submit"
  ],
  "text": "Reset",
  "topRow": 33,
  "type": "BUTTON_WIDGET",
  "version": 1,
  "widgetId": "fl5iio7rln",
  "widgetName": "Button2Copy1"
}