{
  "animateLoading": true,
  "borderRadius": "{{appsmith.theme.borderRadius.appBorderRadius}}",
  "bottomRow": 4,
  "boxShadow": "none",
  "buttonColor": "#000066",
  "buttonVariant": "TERTIARY",
  "displayName": "Icon button",
  "dynamicBindingPathList": [
    {
      "key": "borderRadius"
    }
  ],
  "dynamicTriggerPathList": [
    {
      "key": "onClick"
    }
  ],
  "hideCard": false,
  "iconName": "cross",
  "iconSVG": "/static/media/icon.b08054586989b185a0801e9a34f8ad49.svg",
  "iconSize": 24,
  "isDeprecated": false,
  "isDisabled": false,
  "isLoading": false,
  "isVisible": true,
  "key": "ztne0ofidb",
  "leftColumn": 58,
  "minWidth": 50,
  "mobileBottomRow": 4,
  "mobileLeftColumn": 58,
  "mobileRightColumn": 64,
  "mobileTopRow": 0,
  "onClick": "{{closeModal('ModalUpdate');}}",
  "parentId": "eelqy5g96c",
  "renderMode": "CANVAS",
  "responsiveBehavior": "hug",
  "rightColumn": 64,
  "searchTags": [
    "click",
    "submit"
  ],
  "tags": [
    "Buttons"
  ],
  "topRow": 0,
  "type": "ICON_BUTTON_WIDGET",
  "version": 1,
  "widgetId": "yfh7pt734m",
  "widgetName": "IconButton1"
}