{
  "gitSyncId": "63ea774fae191670a1aa51a8_63f7d9c407609e48fd426276",
  "id": "Proyectos Tutores no usar _handle_get_projects",
  "unpublishedCollection": {
    "name": "handle_get_projects",
    "pageId": "Proyectos Tutores no usar ",
    "pluginId": "js-plugin",
    "pluginType": "JS",
    "variables": []
  }
}