{
  "gitSyncId": "65d8b5fcb9c9626798e2467f_65d8b620b9c9626798e24718",
  "unpublishedPage": {
    "isHidden": true,
    "layouts": [
      {
        "dsl": {
          "backgroundColor": "none",
          "bottomRow": 1610,
          "canExtend": true,
          "containerStyle": "none",
          "detachFromLayout": true,
          "dynamicBindingPathList": [],
          "leftColumn": 0,
          "minHeight": 800,
          "parentColumnSpace": 1,
          "parentRowSpace": 1,
          "rightColumn": 1224,
          "snapColumns": 64,
          "snapRows": 78,
          "topRow": 0,
          "type": "CANVAS_WIDGET",
          "version": 91,
          "widgetId": "0",
          "widgetName": "MainContainer"
        }
      }
    ],
    "name": "Asociar Institucion y Modulo",
    "slug": "asociar-institucion-y-modulo"
  }
}