{
  "animateLoading": true,
  "borderRadius": "{{appsmith.theme.borderRadius.appBorderRadius}}",
  "bottomRow": 4,
  "displayName": "Text",
  "dynamicBindingPathList": [
    {
      "key": "truncateButtonColor"
    },
    {
      "key": "fontFamily"
    },
    {
      "key": "borderRadius"
    }
  ],
  "dynamicHeight": "AUTO_HEIGHT",
  "dynamicTriggerPathList": [],
  "fontFamily": "{{appsmith.theme.fontFamily.appFont}}",
  "fontSize": "1.25rem",
  "fontStyle": "BOLD",
  "hideCard": false,
  "iconSVG": "/static/media/icon.c3b6033f570046f8c6288d911333a827.svg",
  "isDeprecated": false,
  "isLoading": false,
  "isVisible": true,
  "key": "iatbcy7ew1",
  "leftColumn": 2,
  "maxDynamicHeight": 9000,
  "minDynamicHeight": 4,
  "minWidth": 450,
  "mobileBottomRow": 5,
  "mobileLeftColumn": 1.5,
  "mobileRightColumn": 25.5,
  "mobileTopRow": 1,
  "overflow": "NONE",
  "parentId": "l0gbsz1yjg",
  "renderMode": "CANVAS",
  "responsiveBehavior": "fill",
  "rightColumn": 26,
  "searchTags": [
    "typography",
    "paragraph",
    "label"
  ],
  "shouldTruncate": false,
  "text": "Crear Crédito",
  "textAlign": "LEFT",
  "textColor": "#000066",
  "topRow": 0,
  "truncateButtonColor": "{{appsmith.theme.colors.primaryColor}}",
  "type": "TEXT_WIDGET",
  "version": 1,
  "widgetId": "5sdbqbgb86",
  "widgetName": "Text1Copy"
}