{
  "animateLoading": true,
  "borderRadius": "{{appsmith.theme.borderRadius.appBorderRadius}}",
  "bottomRow": 22,
  "boxShadow": "none",
  "buttonColor": "{{appsmith.theme.colors.primaryColor}}",
  "buttonStyle": "PRIMARY_BUTTON",
  "buttonVariant": "PRIMARY",
  "disabledWhenInvalid": false,
  "displayName": "Button",
  "dynamicBindingPathList": [
    {
      "key": "buttonColor"
    },
    {
      "key": "borderRadius"
    }
  ],
  "dynamicPropertyPathList": [
    {
      "key": "onClick"
    }
  ],
  "dynamicTriggerPathList": [
    {
      "key": "onClick"
    }
  ],
  "hideCard": false,
  "iconSVG": "/static/media/icon.7beb9123fb53027d9d6b778cdfe4caed.svg",
  "isDefaultClickDisabled": true,
  "isDeprecated": false,
  "isDisabled": false,
  "isLoading": false,
  "isVisible": true,
  "key": "6a5e3z3evn",
  "leftColumn": 47,
  "minWidth": 120,
  "mobileBottomRow": 22,
  "mobileLeftColumn": 47,
  "mobileRightColumn": 63,
  "mobileTopRow": 18,
  "onClick": "{{\nDelete_Credit.run(\n() => showAlert(\"Token eliminado\", \"success\"),\n        () => showAlert(\"No se pudo eliminar el token\", \"error\")\n).then(() => closeModal(\"Modal_eliminar\"))\n      .then(() => Get_Credits.run());\n}}",
  "originalBottomRow": 22,
  "originalTopRow": 18,
  "parentId": "4dg5ccq5dt",
  "placement": "CENTER",
  "recaptchaType": "V3",
  "renderMode": "CANVAS",
  "resetFormOnClick": false,
  "responsiveBehavior": "hug",
  "rightColumn": 63,
  "searchTags": [
    "click",
    "submit"
  ],
  "text": "Confirm",
  "topRow": 18,
  "type": "BUTTON_WIDGET",
  "version": 1,
  "widgetId": "bnxhck17tg",
  "widgetName": "Button4"
}