{
  "accentColor": "{{appsmith.theme.colors.primaryColor}}",
  "animateLoading": true,
  "borderColor": "#E0DEDE",
  "borderRadius": "{{appsmith.theme.borderRadius.appBorderRadius}}",
  "borderWidth": "1",
  "bottomRow": 148,
  "boxShadow": "{{appsmith.theme.boxShadow.appBoxShadow}}",
  "canFreezeColumn": false,
  "childStylesheet": {
    "button": {
      "borderRadius": "{{appsmith.theme.borderRadius.appBorderRadius}}",
      "boxShadow": "none",
      "buttonColor": "{{appsmith.theme.colors.primaryColor}}"
    },
    "editActions": {
      "discardBorderRadius": "{{appsmith.theme.borderRadius.appBorderRadius}}",
      "discardButtonColor": "{{appsmith.theme.colors.primaryColor}}",
      "saveBorderRadius": "{{appsmith.theme.borderRadius.appBorderRadius}}",
      "saveButtonColor": "{{appsmith.theme.colors.primaryColor}}"
    },
    "iconButton": {
      "borderRadius": "{{appsmith.theme.borderRadius.appBorderRadius}}",
      "boxShadow": "none",
      "buttonColor": "{{appsmith.theme.colors.primaryColor}}"
    },
    "menuButton": {
      "borderRadius": "{{appsmith.theme.borderRadius.appBorderRadius}}",
      "boxShadow": "none",
      "menuColor": "{{appsmith.theme.colors.primaryColor}}"
    }
  },
  "columnOrder": [
    "institution_name",
    "institution_id",
    "academy_name",
    "academy_id",
    "created_at",
    "updated_at",
    "deleted_at"
  ],
  "columnUpdatedAt": 1715342424336,
  "columnWidthMap": {
    "academy_name": 221,
    "created_at": 184,
    "institution_id": 346,
    "institution_name": 299,
    "status": 75,
    "step": 62,
    "task": 245
  },
  "defaultPageSize": 0,
  "defaultSelectedRowIndex": 0,
  "defaultSelectedRowIndices": [
    0
  ],
  "delimiter": ",",
  "displayName": "Table",
  "dynamicBindingPathList": [
    {
      "key": "accentColor"
    },
    {
      "key": "borderRadius"
    },
    {
      "key": "boxShadow"
    },
    {
      "key": "tableData"
    },
    {
      "key": "primaryColumns.created_at.computedValue"
    },
    {
      "key": "primaryColumns.institution_name.computedValue"
    },
    {
      "key": "primaryColumns.academy_name.computedValue"
    },
    {
      "key": "primaryColumns.deleted_at.computedValue"
    },
    {
      "key": "primaryColumns.updated_at.computedValue"
    },
    {
      "key": "primaryColumns.institution_id.computedValue"
    },
    {
      "key": "primaryColumns.academy_id.computedValue"
    }
  ],
  "dynamicPropertyPathList": [
    {
      "key": "tableData"
    }
  ],
  "dynamicTriggerPathList": [],
  "enableClientSideSearch": true,
  "enableServerSideFiltering": false,
  "hideCard": false,
  "horizontalAlignment": "LEFT",
  "iconSVG": "/static/media/icon.db8a9cbd2acd22a31ea91cc37ea2a46c.svg",
  "inlineEditingSaveOption": "ROW_LEVEL",
  "isDeprecated": false,
  "isLoading": false,
  "isSortable": true,
  "isVisible": true,
  "isVisibleDownload": true,
  "isVisibleFilters": true,
  "isVisiblePagination": true,
  "isVisibleSearch": true,
  "key": "m83nyxg5tc",
  "label": "Data",
  "leftColumn": 1,
  "originalBottomRow": 113,
  "originalTopRow": 61,
  "parentColumnSpace": 20.0625,
  "parentId": "0",
  "parentRowSpace": 10,
  "primaryColumns": {
    "academy_id": {
      "alias": "academy_id",
      "allowCellWrapping": false,
      "cellBackground": "",
      "columnType": "text",
      "computedValue": "{{Academy_Institution_Table.processedTableData.map((currentRow, currentIndex) => ( currentRow[\"academy_id\"]))}}",
      "enableFilter": true,
      "enableSort": true,
      "fontStyle": "",
      "horizontalAlignment": "LEFT",
      "id": "academy_id",
      "index": 2,
      "isCellEditable": false,
      "isCellVisible": true,
      "isDerived": false,
      "isDisabled": false,
      "isDiscardVisible": true,
      "isEditable": false,
      "isSaveVisible": true,
      "isVisible": true,
      "label": "academy_id",
      "originalId": "academy_id",
      "sticky": "",
      "textColor": "",
      "textSize": "0.875rem",
      "validation": {},
      "verticalAlignment": "CENTER",
      "width": 150
    },
    "academy_name": {
      "alias": "academy_name",
      "allowCellWrapping": false,
      "cellBackground": "",
      "columnType": "text",
      "computedValue": "{{Academy_Institution_Table.processedTableData.map((currentRow, currentIndex) => ( currentRow[\"academy_name\"]))}}",
      "enableFilter": true,
      "enableSort": true,
      "fontStyle": "",
      "horizontalAlignment": "LEFT",
      "id": "academy_name",
      "index": 2,
      "isCellEditable": false,
      "isCellVisible": true,
      "isDerived": false,
      "isDisabled": false,
      "isDiscardVisible": true,
      "isEditable": false,
      "isSaveVisible": true,
      "isVisible": true,
      "label": "Academia",
      "originalId": "academy_name",
      "sticky": "",
      "textColor": "",
      "textSize": "0.875rem",
      "validation": {},
      "verticalAlignment": "CENTER",
      "width": 150
    },
    "created_at": {
      "alias": "created_at",
      "allowCellWrapping": false,
      "cellBackground": "",
      "columnType": "date",
      "computedValue": "{{Academy_Institution_Table.processedTableData.map((currentRow, currentIndex) => ( currentRow[\"created_at\"]))}}",
      "enableFilter": true,
      "enableSort": true,
      "fontStyle": "",
      "horizontalAlignment": "LEFT",
      "id": "created_at",
      "index": 3,
      "isCellEditable": false,
      "isCellVisible": true,
      "isDerived": false,
      "isDisabled": false,
      "isDiscardVisible": true,
      "isEditable": false,
      "isSaveVisible": true,
      "isVisible": true,
      "label": "Fecha de creacion",
      "originalId": "created_at",
      "outputFormat": "DD/MM/YYYY",
      "sticky": "",
      "textColor": "",
      "textSize": "0.875rem",
      "validation": {},
      "verticalAlignment": "CENTER",
      "width": 150
    },
    "deleted_at": {
      "alias": "deleted_at",
      "allowCellWrapping": false,
      "cellBackground": "",
      "columnType": "text",
      "computedValue": "{{Academy_Institution_Table.processedTableData.map((currentRow, currentIndex) => ( currentRow[\"deleted_at\"]))}}",
      "enableFilter": true,
      "enableSort": true,
      "fontStyle": "",
      "horizontalAlignment": "LEFT",
      "id": "deleted_at",
      "index": 4,
      "isCellEditable": false,
      "isCellVisible": true,
      "isDerived": false,
      "isDisabled": false,
      "isDiscardVisible": true,
      "isEditable": false,
      "isSaveVisible": true,
      "isVisible": true,
      "label": "Fecha de eliminación",
      "originalId": "deleted_at",
      "sticky": "",
      "textColor": "",
      "textSize": "0.875rem",
      "validation": {},
      "verticalAlignment": "CENTER",
      "width": 150
    },
    "institution_id": {
      "alias": "institution_id",
      "allowCellWrapping": false,
      "cellBackground": "",
      "columnType": "text",
      "computedValue": "{{Academy_Institution_Table.processedTableData.map((currentRow, currentIndex) => ( currentRow[\"institution_id\"]))}}",
      "enableFilter": true,
      "enableSort": true,
      "fontStyle": "",
      "horizontalAlignment": "LEFT",
      "id": "institution_id",
      "index": 0,
      "isCellEditable": false,
      "isCellVisible": true,
      "isDerived": false,
      "isDisabled": false,
      "isDiscardVisible": true,
      "isEditable": false,
      "isSaveVisible": true,
      "isVisible": true,
      "label": "institution_id",
      "originalId": "institution_id",
      "sticky": "",
      "textColor": "",
      "textSize": "0.875rem",
      "validation": {},
      "verticalAlignment": "CENTER",
      "width": 150
    },
    "institution_name": {
      "alias": "institution_name",
      "allowCellWrapping": false,
      "cellBackground": "",
      "columnType": "text",
      "computedValue": "{{Academy_Institution_Table.processedTableData.map((currentRow, currentIndex) => ( currentRow[\"institution_name\"]))}}",
      "enableFilter": true,
      "enableSort": true,
      "fontStyle": "",
      "horizontalAlignment": "LEFT",
      "id": "institution_name",
      "index": 1,
      "isCellEditable": false,
      "isCellVisible": true,
      "isDerived": false,
      "isDisabled": false,
      "isDiscardVisible": true,
      "isEditable": false,
      "isSaveVisible": true,
      "isVisible": true,
      "label": "Institución",
      "originalId": "institution_name",
      "sticky": "",
      "textColor": "",
      "textSize": "0.875rem",
      "validation": {},
      "verticalAlignment": "CENTER",
      "width": 150
    },
    "updated_at": {
      "alias": "updated_at",
      "allowCellWrapping": false,
      "cellBackground": "",
      "columnType": "date",
      "computedValue": "{{Academy_Institution_Table.processedTableData.map((currentRow, currentIndex) => ( currentRow[\"updated_at\"]))}}",
      "enableFilter": true,
      "enableSort": true,
      "fontStyle": "",
      "horizontalAlignment": "LEFT",
      "id": "updated_at",
      "index": 5,
      "isCellEditable": false,
      "isCellVisible": true,
      "isDerived": false,
      "isDisabled": false,
      "isDiscardVisible": true,
      "isEditable": false,
      "isSaveVisible": true,
      "isVisible": true,
      "label": "Fecha de actualización",
      "originalId": "updated_at",
      "outputFormat": "DD/MM/YYYY",
      "sticky": "",
      "textColor": "",
      "textSize": "0.875rem",
      "validation": {},
      "verticalAlignment": "CENTER",
      "width": 150
    }
  },
  "renderMode": "CANVAS",
  "rightColumn": 63,
  "searchKey": "",
  "tableData": "{{academies_institutions.data || []}}",
  "textSize": "0.875rem",
  "topRow": 96,
  "totalRecordsCount": 0,
  "type": "TABLE_WIDGET_V2",
  "version": 1,
  "verticalAlignment": "CENTER",
  "widgetId": "6p7mpok30o",
  "widgetName": "Academy_Institution_Table"
}