{
  "animateLoading": true,
  "borderRadius": "{{appsmith.theme.borderRadius.appBorderRadius}}",
  "bottomRow": 4,
  "boxShadow": "none",
  "buttonColor": "{{appsmith.theme.colors.primaryColor}}",
  "buttonVariant": "TERTIARY",
  "displayName": "Icon button",
  "dynamicBindingPathList": [
    {
      "key": "buttonColor"
    },
    {
      "key": "borderRadius"
    }
  ],
  "dynamicPropertyPathList": [],
  "dynamicTriggerPathList": [
    {
      "key": "onClick"
    }
  ],
  "hideCard": false,
  "iconName": "cross",
  "iconSVG": "/static/media/icon.80fc7466c0d7181ec0271de7fda795ec.svg",
  "iconSize": 24,
  "isDeprecated": false,
  "isDisabled": false,
  "isLoading": false,
  "isVisible": true,
  "key": "hhzxru9z2e",
  "leftColumn": 58,
  "minWidth": 50,
  "mobileBottomRow": 4,
  "mobileLeftColumn": 58,
  "mobileRightColumn": 64,
  "mobileTopRow": 0,
  "onClick": "{{closeModal('Modal_actualizar');}}",
  "parentId": "w59nw6x2b4",
  "renderMode": "CANVAS",
  "responsiveBehavior": "hug",
  "rightColumn": 64,
  "searchTags": [
    "click",
    "submit"
  ],
  "topRow": 0,
  "type": "ICON_BUTTON_WIDGET",
  "version": 1,
  "widgetId": "rrdqm9shr5",
  "widgetName": "IconButton2"
}