{
  "accentColor": "{{appsmith.theme.colors.primaryColor}}",
  "animateLoading": true,
  "borderRadius": "{{appsmith.theme.borderRadius.appBorderRadius}}",
  "bottomRow": 12,
  "boxShadow": "none",
  "defaultOptionValue": "",
  "dynamicBindingPathList": [
    {
      "key": "accentColor"
    },
    {
      "key": "borderRadius"
    },
    {
      "key": "sourceData"
    }
  ],
  "dynamicHeight": "FIXED",
  "dynamicPropertyPathList": [
    {
      "key": "sourceData"
    },
    {
      "key": "onOptionChange"
    }
  ],
  "dynamicTriggerPathList": [
    {
      "key": "onOptionChange"
    }
  ],
  "isDisabled": false,
  "isFilterable": true,
  "isLoading": false,
  "isRequired": false,
  "isVisible": true,
  "key": "unnl05l2l4",
  "labelAlignment": "left",
  "labelPosition": "Top",
  "labelText": "Examen",
  "labelTextSize": "0.875rem",
  "labelWidth": 5,
  "leftColumn": 1,
  "maxDynamicHeight": 9000,
  "minDynamicHeight": 4,
  "minWidth": 450,
  "mobileBottomRow": 12,
  "mobileLeftColumn": 1,
  "mobileRightColumn": 21,
  "mobileTopRow": 5,
  "needsErrorInfo": false,
  "onOptionChange": "{{Select_exam.selectedOptionLabel !== '' && exams_by_id_QA.run()}}",
  "optionLabel": "name",
  "optionValue": "code",
  "originalBottomRow": 12,
  "originalTopRow": 5,
  "parentColumnSpace": 19,
  "parentId": "fj9sz0hnj4",
  "parentRowSpace": 10,
  "placeholderText": "Seleccione un examen",
  "renderMode": "CANVAS",
  "responsiveBehavior": "fill",
  "rightColumn": 29,
  "serverSideFiltering": false,
  "sourceData": "{{exams_get.data.data.map(exam => ({\n    name: exam.title,\n    code: exam.id\n}))}}",
  "topRow": 5,
  "type": "SELECT_WIDGET",
  "version": 1,
  "widgetId": "tv22ie7fit",
  "widgetName": "Select_exam"
}