{
  "accentColor": "{{appsmith.theme.colors.primaryColor}}",
  "animateLoading": true,
  "autoFocus": false,
  "borderRadius": "{{appsmith.theme.borderRadius.appBorderRadius}}",
  "bottomRow": 7,
  "boxShadow": "none",
  "defaultText": "{{Institutions_Table.triggeredRow.name}}",
  "dynamicBindingPathList": [
    {
      "key": "accentColor"
    },
    {
      "key": "borderRadius"
    },
    {
      "key": "defaultText"
    }
  ],
  "dynamicHeight": "FIXED",
  "dynamicTriggerPathList": [],
  "iconAlign": "left",
  "inputType": "TEXT",
  "isDisabled": false,
  "isLoading": false,
  "isRequired": false,
  "isVisible": true,
  "key": "p814z0kxfa",
  "label": "Nombre",
  "labelAlignment": "left",
  "labelPosition": "Top",
  "labelStyle": "",
  "labelTextSize": "0.875rem",
  "labelWidth": 5,
  "leftColumn": 1,
  "maxDynamicHeight": 9000,
  "minDynamicHeight": 4,
  "minWidth": 450,
  "mobileBottomRow": 7,
  "mobileLeftColumn": 0,
  "mobileRightColumn": 20,
  "mobileTopRow": 0,
  "needsErrorInfo": false,
  "parentColumnSpace": 6.2998046875,
  "parentId": "lviialbucx",
  "parentRowSpace": 10,
  "renderMode": "CANVAS",
  "resetOnSubmit": true,
  "responsiveBehavior": "fill",
  "rightColumn": 61,
  "showStepArrows": false,
  "topRow": 0,
  "type": "INPUT_WIDGET_V2",
  "version": 2,
  "widgetId": "i8ti0hjuyr",
  "widgetName": "name_update"
}