{
  "accentColor": "{{appsmith.theme.colors.primaryColor}}",
  "animateLoading": true,
  "borderRadius": "{{appsmith.theme.borderRadius.appBorderRadius}}",
  "bottomRow": 13,
  "boxShadow": "none",
  "defaultOptionValue": "",
  "displayName": "Select",
  "dynamicBindingPathList": [
    {
      "key": "accentColor"
    },
    {
      "key": "borderRadius"
    },
    {
      "key": "sourceData"
    }
  ],
  "dynamicHeight": "FIXED",
  "dynamicPropertyPathList": [
    {
      "key": "sourceData"
    }
  ],
  "dynamicTriggerPathList": [],
  "hideCard": false,
  "iconSVG": "/static/media/icon.1a5defb3c19b4cac4a27829d1f979e4c.svg",
  "isDeprecated": false,
  "isDisabled": false,
  "isFilterable": true,
  "isLoading": false,
  "isRequired": false,
  "isVisible": true,
  "key": "uc7uhx5xl7",
  "labelAlignment": "left",
  "labelPosition": "Top",
  "labelText": "Curso",
  "labelTextSize": "0.875rem",
  "labelWidth": 5,
  "leftColumn": 2,
  "maxDynamicHeight": 9000,
  "minDynamicHeight": 4,
  "minWidth": 450,
  "mobileBottomRow": 13,
  "mobileLeftColumn": 2,
  "mobileRightColumn": 22,
  "mobileTopRow": 6,
  "optionLabel": "label",
  "optionValue": "value",
  "parentColumnSpace": 5.822265625,
  "parentId": "yylsqk1wde",
  "parentRowSpace": 10,
  "placeholderText": "Select option",
  "renderMode": "CANVAS",
  "responsiveBehavior": "fill",
  "rightColumn": 62,
  "searchTags": [
    "dropdown"
  ],
  "serverSideFiltering": false,
  "sourceData": "{{get_courses.data.data.map((course) => ({\n  label: `${course.title} - id: ${course.id}`,\n  value: course.id\n}))}}",
  "topRow": 6,
  "type": "SELECT_WIDGET",
  "version": 1,
  "widgetId": "5ak1qdbef2",
  "widgetName": "select_course_desasignar"
}