{
  "animateLoading": true,
  "borderRadius": "{{appsmith.theme.borderRadius.appBorderRadius}}",
  "bottomRow": 5,
  "displayName": "Text",
  "dynamicBindingPathList": [
    {
      "key": "truncateButtonColor"
    },
    {
      "key": "fontFamily"
    },
    {
      "key": "borderRadius"
    }
  ],
  "dynamicHeight": "AUTO_HEIGHT",
  "dynamicTriggerPathList": [],
  "fontFamily": "{{appsmith.theme.fontFamily.appFont}}",
  "fontSize": "1.25rem",
  "fontStyle": "BOLD",
  "hideCard": false,
  "iconSVG": "/static/media/icon.c3b6033f570046f8c6288d911333a827.svg",
  "isDeprecated": false,
  "isLoading": false,
  "isVisible": true,
  "key": "cvh9hs5zpi",
  "leftColumn": 1,
  "maxDynamicHeight": 9000,
  "minDynamicHeight": 4,
  "minWidth": 450,
  "mobileBottomRow": 5,
  "mobileLeftColumn": 1,
  "mobileRightColumn": 41,
  "mobileTopRow": 1,
  "overflow": "NONE",
  "parentId": "fqxlsk09kq",
  "renderMode": "CANVAS",
  "responsiveBehavior": "fill",
  "rightColumn": 41,
  "searchTags": [
    "typography",
    "paragraph",
    "label"
  ],
  "shouldTruncate": false,
  "text": "Actualizar crédito",
  "textAlign": "LEFT",
  "textColor": "#231F20",
  "topRow": 1,
  "truncateButtonColor": "{{appsmith.theme.colors.primaryColor}}",
  "type": "TEXT_WIDGET",
  "version": 1,
  "widgetId": "id8jlgqyhu",
  "widgetName": "Text3"
}