{
  "animateLoading": true,
  "borderRadius": "{{appsmith.theme.borderRadius.appBorderRadius}}",
  "bottomRow": 35,
  "boxShadow": "none",
  "buttonColor": "#000066",
  "buttonVariant": "PRIMARY",
  "disabledWhenInvalid": true,
  "dynamicBindingPathList": [
    {
      "key": "borderRadius"
    }
  ],
  "dynamicTriggerPathList": [
    {
      "key": "onClick"
    }
  ],
  "isDefaultClickDisabled": true,
  "isDisabled": true,
  "isLoading": false,
  "isVisible": true,
  "key": "mgud74oc8y",
  "leftColumn": 46,
  "minWidth": 120,
  "mobileBottomRow": 37,
  "mobileLeftColumn": 46,
  "mobileRightColumn": 62,
  "mobileTopRow": 33,
  "needsErrorInfo": false,
  "onClick": "{{courses_exam_version_unassign.run().then(() => {\n  showAlert('Se quitó correctamente.', 'success');\n}).catch(() => {\n  showAlert('Hubo un error', 'error');\n});}}",
  "originalBottomRow": 35,
  "originalTopRow": 31,
  "parentId": "zfi279ewde",
  "placement": "CENTER",
  "recaptchaType": "V3",
  "renderMode": "CANVAS",
  "resetFormOnClick": true,
  "responsiveBehavior": "hug",
  "rightColumn": 62,
  "text": "Quitar",
  "topRow": 31,
  "type": "BUTTON_WIDGET",
  "version": 1,
  "widgetId": "mqynptz8pv",
  "widgetName": "Button28"
}