{
  "animateLoading": true,
  "borderRadius": "{{appsmith.theme.borderRadius.appBorderRadius}}",
  "bottomRow": 17,
  "boxShadow": "none",
  "buttonColor": "{{appsmith.theme.colors.primaryColor}}",
  "buttonVariant": "SECONDARY",
  "disabledWhenInvalid": false,
  "displayName": "Button",
  "dynamicBindingPathList": [
    {
      "key": "buttonColor"
    },
    {
      "key": "borderRadius"
    }
  ],
  "hideCard": false,
  "iconSVG": "/static/media/icon.7beb9123fb53027d9d6b778cdfe4caed.svg",
  "isDefaultClickDisabled": true,
  "isDeprecated": false,
  "isDisabled": false,
  "isLoading": false,
  "isVisible": true,
  "key": "q0fvhpk5b8",
  "leftColumn": 27,
  "minWidth": 120,
  "mobileBottomRow": 37,
  "mobileLeftColumn": 30,
  "mobileRightColumn": 46,
  "mobileTopRow": 33,
  "parentId": "oefkxo2eai",
  "placement": "CENTER",
  "recaptchaType": "V3",
  "renderMode": "CANVAS",
  "resetFormOnClick": true,
  "responsiveBehavior": "hug",
  "rightColumn": 43,
  "searchTags": [
    "click",
    "submit"
  ],
  "text": "Reset",
  "topRow": 13,
  "type": "BUTTON_WIDGET",
  "version": 1,
  "widgetId": "vpyxic8h52",
  "widgetName": "Button2"
}