{
  "accentColor": "{{appsmith.theme.colors.primaryColor}}",
  "animateLoading": true,
  "borderRadius": "{{appsmith.theme.borderRadius.appBorderRadius}}",
  "bottomRow": 134,
  "boxShadow": "none",
  "defaultOptionValue": "FREE",
  "displayName": "Select",
  "dynamicBindingPathList": [
    {
      "key": "accentColor"
    },
    {
      "key": "borderRadius"
    }
  ],
  "dynamicHeight": "FIXED",
  "dynamicPropertyPathList": [
    {
      "key": "sourceData"
    }
  ],
  "dynamicTriggerPathList": [],
  "hideCard": false,
  "iconSVG": "/static/media/icon.bd99caba5853ad71e4b3d8daffacb3a2.svg",
  "isDeprecated": false,
  "isDisabled": false,
  "isFilterable": false,
  "isLoading": false,
  "isRequired": false,
  "isVisible": true,
  "key": "gtxuelgttw",
  "labelAlignment": "left",
  "labelPosition": "Top",
  "labelText": "Modo de Navegación (default: FREE)",
  "labelTextSize": "0.875rem",
  "labelWidth": 5,
  "leftColumn": 1,
  "maxDynamicHeight": 9000,
  "minDynamicHeight": 4,
  "minWidth": 450,
  "mobileBottomRow": 83,
  "mobileLeftColumn": 1,
  "mobileRightColumn": 21,
  "mobileTopRow": 76,
  "optionLabel": "label",
  "optionValue": "value",
  "originalBottomRow": 134,
  "originalTopRow": 127,
  "parentColumnSpace": 5.69580078125,
  "parentId": "6kox5tlu66",
  "parentRowSpace": 10,
  "placeholderText": "Select option",
  "renderMode": "CANVAS",
  "responsiveBehavior": "fill",
  "rightColumn": 62,
  "searchTags": [
    "dropdown"
  ],
  "serverSideFiltering": false,
  "sourceData": "[\n  {\n    \"label\": \"FREE\",\n    \"value\": \"FREE\"\n  },\n  {\n    \"label\": \"STRICT\",\n    \"value\": \"STRICT\"\n  }\n]",
  "topRow": 127,
  "type": "SELECT_WIDGET",
  "version": 1,
  "widgetId": "busz97e1s2",
  "widgetName": "navigation_mode"
}