{
  "animateLoading": true,
  "borderRadius": "{{appsmith.theme.borderRadius.appBorderRadius}}",
  "bottomRow": 18,
  "displayName": "Text",
  "dynamicBindingPathList": [
    {
      "key": "truncateButtonColor"
    },
    {
      "key": "fontFamily"
    },
    {
      "key": "borderRadius"
    },
    {
      "key": "text"
    }
  ],
  "dynamicHeight": "AUTO_HEIGHT",
  "dynamicTriggerPathList": [],
  "fontFamily": "{{appsmith.theme.fontFamily.appFont}}",
  "fontSize": "1rem",
  "fontStyle": "BOLD",
  "hideCard": false,
  "iconSVG": "/static/media/icon.a47d6d5dbbb718c4dc4b2eb4f218c1b7.svg",
  "isDeprecated": false,
  "isLoading": false,
  "isVisible": true,
  "key": "gjives0ubi",
  "leftColumn": 1,
  "maxDynamicHeight": 9000,
  "minDynamicHeight": 4,
  "minWidth": 450,
  "mobileBottomRow": 11,
  "mobileLeftColumn": 1,
  "mobileRightColumn": 17,
  "mobileTopRow": 7,
  "originalBottomRow": 18,
  "originalTopRow": 7,
  "overflow": "NONE",
  "parentColumnSpace": 6.9375,
  "parentId": "p7mtr49l82",
  "parentRowSpace": 10,
  "renderMode": "CANVAS",
  "responsiveBehavior": "fill",
  "rightColumn": 63,
  "searchTags": [
    "typography",
    "paragraph",
    "label"
  ],
  "shouldTruncate": false,
  "tags": [
    "Suggested",
    "Content"
  ],
  "text": "Estas por desasociar la institucion:\n{{institutions_templates_table.triggeredRow.institution_name}}\n\ndel template:\n{{institutions_templates_table.triggeredRow.template_name}}",
  "textAlign": "LEFT",
  "textColor": "#231F20",
  "topRow": 7,
  "truncateButtonColor": "{{appsmith.theme.colors.primaryColor}}",
  "type": "TEXT_WIDGET",
  "version": 1,
  "widgetId": "xsmgbfga3q",
  "widgetName": "body_unassign_modal"
}