{
  "animateLoading": true,
  "borderRadius": "{{appsmith.theme.borderRadius.appBorderRadius}}",
  "bottomRow": 66,
  "boxShadow": "none",
  "buttonColor": "#000066",
  "buttonStyle": "PRIMARY",
  "buttonVariant": "SECONDARY",
  "disabledWhenInvalid": false,
  "dynamicBindingPathList": [
    {
      "key": "borderRadius"
    }
  ],
  "dynamicTriggerPathList": [
    {
      "key": "onClick"
    }
  ],
  "isDefaultClickDisabled": true,
  "isDisabled": false,
  "isLoading": false,
  "isVisible": true,
  "key": "pbui9iiis3",
  "leftColumn": 29,
  "minWidth": 120,
  "mobileBottomRow": 22,
  "mobileLeftColumn": 31,
  "mobileRightColumn": 47,
  "mobileTopRow": 18,
  "needsErrorInfo": false,
  "onClick": "{{closeModal(Modal_update_questions.name);}}",
  "originalBottomRow": 66,
  "originalTopRow": 62,
  "parentId": "vjupsrg3bc",
  "placement": "CENTER",
  "recaptchaType": "V3",
  "renderMode": "CANVAS",
  "resetFormOnClick": false,
  "responsiveBehavior": "hug",
  "rightColumn": 45,
  "text": "Cerrar",
  "topRow": 62,
  "type": "BUTTON_WIDGET",
  "version": 1,
  "widgetId": "qzxzltc2z9",
  "widgetName": "Button17"
}