{
  "animateLoading": true,
  "borderRadius": "{{appsmith.theme.borderRadius.appBorderRadius}}",
  "bottomRow": 5,
  "dynamicBindingPathList": [
    {
      "key": "truncateButtonColor"
    },
    {
      "key": "fontFamily"
    },
    {
      "key": "borderRadius"
    }
  ],
  "dynamicHeight": "AUTO_HEIGHT",
  "dynamicTriggerPathList": [],
  "fontFamily": "{{appsmith.theme.fontFamily.appFont}}",
  "fontSize": "1rem",
  "fontStyle": "BOLD",
  "isLoading": false,
  "isVisible": true,
  "key": "whxq8d26z9",
  "leftColumn": 26,
  "maxDynamicHeight": 9000,
  "minDynamicHeight": 4,
  "minWidth": 450,
  "mobileBottomRow": 5,
  "mobileLeftColumn": 1.5,
  "mobileRightColumn": 25.5,
  "mobileTopRow": 1,
  "needsErrorInfo": false,
  "originalBottomRow": 7,
  "originalTopRow": 1,
  "overflow": "NONE",
  "parentId": "kcgf9qumb3",
  "renderMode": "CANVAS",
  "responsiveBehavior": "fill",
  "rightColumn": 38,
  "shouldTruncate": false,
  "text": "Instituciones del usuario",
  "textAlign": "LEFT",
  "textColor": "#000066",
  "topRow": 1,
  "truncateButtonColor": "{{appsmith.theme.colors.primaryColor}}",
  "type": "TEXT_WIDGET",
  "version": 1,
  "widgetId": "vhk3wnr81v",
  "widgetName": "Text8Copy"
}