{
  "animateLoading": true,
  "borderRadius": "{{appsmith.theme.borderRadius.appBorderRadius}}",
  "bottomRow": 21,
  "dynamicBindingPathList": [
    {
      "key": "truncateButtonColor"
    },
    {
      "key": "fontFamily"
    },
    {
      "key": "borderRadius"
    },
    {
      "key": "text"
    }
  ],
  "dynamicHeight": "AUTO_HEIGHT",
  "dynamicTriggerPathList": [],
  "fontFamily": "{{appsmith.theme.fontFamily.appFont}}",
  "fontSize": "1rem",
  "fontStyle": "BOLD",
  "isLoading": false,
  "isVisible": true,
  "key": "4mh783jg81",
  "leftColumn": 1,
  "maxDynamicHeight": 9000,
  "minDynamicHeight": 4,
  "minWidth": 450,
  "mobileBottomRow": 11,
  "mobileLeftColumn": 1,
  "mobileRightColumn": 17,
  "mobileTopRow": 7,
  "needsErrorInfo": false,
  "originalBottomRow": 12,
  "originalTopRow": 7,
  "overflow": "NONE",
  "parentColumnSpace": 12.46875,
  "parentId": "6narf6hj7x",
  "parentRowSpace": 10,
  "renderMode": "CANVAS",
  "responsiveBehavior": "fill",
  "rightColumn": 60,
  "shouldTruncate": false,
  "text": "{{`Academia: ${Select_academy.selectedOptionLabel}`}}",
  "textAlign": "LEFT",
  "textColor": "#231F20",
  "topRow": 17,
  "truncateButtonColor": "{{appsmith.theme.colors.primaryColor}}",
  "type": "TEXT_WIDGET",
  "version": 1,
  "widgetId": "crc23me2sl",
  "widgetName": "Text7Copy"
}