{
  "animateLoading": true,
  "borderRadius": "{{appsmith.theme.borderRadius.appBorderRadius}}",
  "bottomRow": 81,
  "boxShadow": "none",
  "buttonColor": "#000066",
  "buttonVariant": "PRIMARY",
  "disabledWhenInvalid": true,
  "dynamicBindingPathList": [
    {
      "key": "borderRadius"
    }
  ],
  "dynamicPropertyPathList": [],
  "dynamicTriggerPathList": [
    {
      "key": "onClick"
    }
  ],
  "isDefaultClickDisabled": true,
  "isDisabled": false,
  "isLoading": false,
  "isVisible": true,
  "key": "jb955q2c27",
  "leftColumn": 45,
  "minWidth": 120,
  "mobileBottomRow": 37,
  "mobileLeftColumn": 46,
  "mobileRightColumn": 62,
  "mobileTopRow": 33,
  "needsErrorInfo": false,
  "onClick": "{{Update_Institution.run().then(() => {\n  showAlert('Institución actualizada', 'success');\n  institutions.run();\n  closeModal(Update_Institution_Modal.name);\n}).catch(() => {\n  showAlert(Update_Institution.data.message.join('\\n'), '');\n});}}",
  "originalBottomRow": 67,
  "originalTopRow": 63,
  "parentId": "lviialbucx",
  "placement": "CENTER",
  "recaptchaType": "V3",
  "renderMode": "CANVAS",
  "resetFormOnClick": true,
  "responsiveBehavior": "hug",
  "rightColumn": 61,
  "text": "Enviar",
  "topRow": 77,
  "type": "BUTTON_WIDGET",
  "version": 1,
  "widgetId": "4nrxt3agr7",
  "widgetName": "Button7"
}