{
  "accentColor": "{{appsmith.theme.colors.primaryColor}}",
  "animateLoading": true,
  "borderRadius": "{{appsmith.theme.borderRadius.appBorderRadius}}",
  "bottomRow": 105,
  "boxShadow": "none",
  "defaultOptionValue": "",
  "displayName": "Select",
  "dynamicBindingPathList": [
    {
      "key": "accentColor"
    },
    {
      "key": "borderRadius"
    },
    {
      "key": "sourceData"
    }
  ],
  "dynamicHeight": "FIXED",
  "dynamicPropertyPathList": [
    {
      "key": "options"
    },
    {
      "key": "sourceData"
    }
  ],
  "dynamicTriggerPathList": [],
  "hideCard": false,
  "iconSVG": "/static/media/icon.bd99caba5853ad71e4b3d8daffacb3a2.svg",
  "isDeprecated": false,
  "isDisabled": false,
  "isFilterable": true,
  "isLoading": false,
  "isRequired": true,
  "isVisible": true,
  "key": "z5gfeab4vc",
  "labelAlignment": "left",
  "labelPosition": "Top",
  "labelText": "Academia",
  "labelTextSize": "0.875rem",
  "labelTooltip": "Seleccionar la academia a la cual va a pertencer el curso.",
  "labelWidth": 5,
  "leftColumn": 1,
  "maxDynamicHeight": 9000,
  "minDynamicHeight": 4,
  "optionLabel": "label",
  "optionValue": "value",
  "originalBottomRow": 105,
  "originalTopRow": 97,
  "parentColumnSpace": 7.2109375,
  "parentId": "6kox5tlu66",
  "parentRowSpace": 10,
  "placeholderText": "Seleccionar la academia (Obligatorio)",
  "renderMode": "CANVAS",
  "rightColumn": 62,
  "searchTags": [
    "dropdown"
  ],
  "serverSideFiltering": false,
  "sourceData": "{{Academies_List.data.data.map((item)=>({\nlabel:item.name,\n\tvalue:item.id\n\t\n}))}}",
  "topRow": 97,
  "type": "SELECT_WIDGET",
  "version": 1,
  "widgetId": "964z84y6iw",
  "widgetName": "academy"
}