{
  "gitSyncId": "63ea774fae191670a1aa51a8_646b953e5434aa4dce87567d",
  "unpublishedPage": {
    "isHidden": false,
    "layouts": [
      {
        "dsl": {
          "backgroundColor": "none",
          "bottomRow": 690,
          "canExtend": true,
          "containerStyle": "none",
          "detachFromLayout": true,
          "dynamicBindingPathList": [],
          "leftColumn": 0,
          "minHeight": 820,
          "parentColumnSpace": 1,
          "parentRowSpace": 1,
          "rightColumn": 1224,
          "snapColumns": 64,
          "snapRows": 80,
          "topRow": 0,
          "type": "CANVAS_WIDGET",
          "version": 91,
          "widgetId": "0",
          "widgetName": "MainContainer"
        }
      }
    ],
    "name": "Crear Curso Correlativo",
    "slug": "crear-curso-correlativo"
  }
}