{
  "animateLoading": true,
  "borderRadius": "{{appsmith.theme.borderRadius.appBorderRadius}}",
  "bottomRow": 37,
  "boxShadow": "none",
  "buttonColor": "{{appsmith.theme.colors.primaryColor}}",
  "buttonStyle": "PRIMARY_BUTTON",
  "buttonVariant": "PRIMARY",
  "disabledWhenInvalid": false,
  "dynamicBindingPathList": [
    {
      "key": "buttonColor"
    },
    {
      "key": "borderRadius"
    }
  ],
  "dynamicPropertyPathList": [],
  "dynamicTriggerPathList": [
    {
      "key": "onClick"
    }
  ],
  "isDefaultClickDisabled": true,
  "isDisabled": false,
  "isLoading": false,
  "isVisible": true,
  "key": "cfitvssd6r",
  "leftColumn": 47,
  "minWidth": 120,
  "mobileBottomRow": 22,
  "mobileLeftColumn": 47,
  "mobileRightColumn": 63,
  "mobileTopRow": 18,
  "needsErrorInfo": false,
  "onClick": "{{showModal(delete_template.name).then(() => {\n  delete_certificate_template.run();\n  showAlert('Template eliminado con exito', 'success');\n  closeModal(delete_template.name);\n  get_templates.run();\n}).catch(() => {\n  showAlert(delete_certificate_template.data.message, 'error');\n});}}",
  "originalBottomRow": 37,
  "originalTopRow": 33,
  "parentId": "xyrvjxlz9l",
  "placement": "CENTER",
  "recaptchaType": "V3",
  "renderMode": "CANVAS",
  "resetFormOnClick": false,
  "responsiveBehavior": "hug",
  "rightColumn": 63,
  "text": "Confirm",
  "topRow": 33,
  "type": "BUTTON_WIDGET",
  "version": 1,
  "widgetId": "ig8ixn7wjp",
  "widgetName": "submit_delete_templates_modal"
}