SELECT * FROM institutions WHERE id = '78034cfb-16f3-4cd0-94de-12547a413ae3'

--SELECT * FROM accounts_institutions WHERE institution_id = '5ba4d856-51d8-4e90-999b-ff0f0c318356';

--SELECT * FROM public.institutions WHERE name ILIKE '%Negro%'