{
  "accentColor": "{{appsmith.theme.colors.primaryColor}}",
  "animateLoading": true,
  "autoFocus": false,
  "borderRadius": "{{appsmith.theme.borderRadius.appBorderRadius}}",
  "bottomRow": 30,
  "boxShadow": "none",
  "defaultText": "",
  "dynamicBindingPathList": [
    {
      "key": "accentColor"
    },
    {
      "key": "borderRadius"
    }
  ],
  "dynamicHeight": "FIXED",
  "dynamicTriggerPathList": [],
  "iconAlign": "left",
  "inputType": "NUMBER",
  "isDisabled": false,
  "isLoading": false,
  "isRequired": true,
  "isVisible": true,
  "key": "f2zu1cnw7w",
  "label": "Porcentaje necesario para pasar el examen",
  "labelAlignment": "left",
  "labelPosition": "Top",
  "labelStyle": "",
  "labelTextSize": "0.875rem",
  "labelWidth": 5,
  "leftColumn": 31,
  "maxDynamicHeight": 9000,
  "maxNum": "100",
  "minDynamicHeight": 4,
  "minNum": "1",
  "minWidth": 450,
  "mobileBottomRow": 13,
  "mobileLeftColumn": 1,
  "mobileRightColumn": 21,
  "mobileTopRow": 6,
  "needsErrorInfo": false,
  "parentColumnSpace": 7.03125,
  "parentId": "snsv5sjfie",
  "parentRowSpace": 10,
  "placeholderText": "Ingrese un número ",
  "renderMode": "CANVAS",
  "resetOnSubmit": true,
  "responsiveBehavior": "fill",
  "rightColumn": 61,
  "shouldAllowAutofill": false,
  "showStepArrows": true,
  "topRow": 23,
  "type": "INPUT_WIDGET_V2",
  "version": 2,
  "widgetId": "4gcznnqlox",
  "widgetName": "v_pass_score"
}