{
  "animateLoading": true,
  "borderRadius": "{{appsmith.theme.borderRadius.appBorderRadius}}",
  "bottomRow": 47,
  "boxShadow": "none",
  "buttonColor": "#000066",
  "buttonStyle": "PRIMARY_BUTTON",
  "buttonVariant": "PRIMARY",
  "disabledWhenInvalid": true,
  "dynamicBindingPathList": [
    {
      "key": "borderRadius"
    }
  ],
  "dynamicPropertyPathList": [],
  "dynamicTriggerPathList": [
    {
      "key": "onClick"
    }
  ],
  "isDefaultClickDisabled": true,
  "isDisabled": false,
  "isLoading": false,
  "isVisible": true,
  "key": "r17dms6zq4",
  "leftColumn": 46,
  "minWidth": 120,
  "mobileBottomRow": 22,
  "mobileLeftColumn": 47,
  "mobileRightColumn": 63,
  "mobileTopRow": 18,
  "needsErrorInfo": false,
  "onClick": "{{exam_versions_post.run().then(() => {\n  showAlert('Se creo una versión del examen', 'success');\n  closeModal(Modal_create_version.name);\n}).catch(() => {\n  showAlert('Hubo un error al crear la versión', 'error');\n});}}",
  "parentId": "snsv5sjfie",
  "placement": "CENTER",
  "recaptchaType": "V3",
  "renderMode": "CANVAS",
  "resetFormOnClick": true,
  "responsiveBehavior": "hug",
  "rightColumn": 62,
  "text": "Enviar",
  "topRow": 43,
  "type": "BUTTON_WIDGET",
  "version": 1,
  "widgetId": "xbykjjgykk",
  "widgetName": "Button5"
}