{
  "accentColor": "{{appsmith.theme.colors.primaryColor}}",
  "alignWidget": "LEFT",
  "animateLoading": true,
  "bottomRow": 25,
  "boxShadow": "none",
  "defaultSwitchState": false,
  "dynamicBindingPathList": [
    {
      "key": "accentColor"
    }
  ],
  "dynamicHeight": "AUTO_HEIGHT",
  "dynamicPropertyPathList": [],
  "dynamicTriggerPathList": [],
  "isDisabled": false,
  "isLoading": false,
  "isVisible": true,
  "key": "o97oacvbxl",
  "label": "¿Respuesta correcta?",
  "labelPosition": "Left",
  "leftColumn": 1,
  "maxDynamicHeight": 9000,
  "minDynamicHeight": 4,
  "mobileBottomRow": 31,
  "mobileLeftColumn": 1,
  "mobileRightColumn": 13,
  "mobileTopRow": 27,
  "needsErrorInfo": false,
  "originalBottomRow": 25,
  "originalTopRow": 21,
  "parentColumnSpace": 6.9375,
  "parentId": "vw3p3rh9qx",
  "parentRowSpace": 10,
  "renderMode": "CANVAS",
  "responsiveBehavior": "fill",
  "rightColumn": 29,
  "topRow": 21,
  "type": "SWITCH_WIDGET",
  "version": 1,
  "widgetId": "bds6prs6wd",
  "widgetName": "c_answer_is_correct"
}