{
  "animateLoading": true,
  "borderRadius": "{{appsmith.theme.borderRadius.appBorderRadius}}",
  "bottomRow": 36,
  "boxShadow": "none",
  "buttonColor": "{{appsmith.theme.colors.primaryColor}}",
  "buttonVariant": "SECONDARY",
  "disabledWhenInvalid": false,
  "displayName": "Button",
  "dynamicBindingPathList": [
    {
      "key": "buttonColor"
    },
    {
      "key": "borderRadius"
    }
  ],
  "dynamicTriggerPathList": [
    {
      "key": "onClick"
    }
  ],
  "hideCard": false,
  "iconSVG": "/static/media/icon.05d209fafeb13a8569e3b4e97069d9ee.svg",
  "isDefaultClickDisabled": true,
  "isDeprecated": false,
  "isDisabled": false,
  "isLoading": false,
  "isVisible": true,
  "key": "bsazo7w316",
  "leftColumn": 0,
  "minWidth": 120,
  "mobileBottomRow": 37,
  "mobileLeftColumn": 30,
  "mobileRightColumn": 46,
  "mobileTopRow": 33,
  "onClick": "{{resetWidget(\"create_association_form\", true);}}",
  "originalBottomRow": 36,
  "originalTopRow": 32,
  "parentId": "98t5dtplxn",
  "placement": "CENTER",
  "recaptchaType": "V3",
  "renderMode": "CANVAS",
  "resetFormOnClick": true,
  "responsiveBehavior": "hug",
  "rightColumn": 16,
  "searchTags": [
    "click",
    "submit"
  ],
  "tags": [
    "Buttons"
  ],
  "text": "Reset",
  "topRow": 32,
  "type": "BUTTON_WIDGET",
  "version": 1,
  "widgetId": "yurg5vkdbb",
  "widgetName": "create_association_reset"
}