{
  "animateLoading": true,
  "borderRadius": "{{appsmith.theme.borderRadius.appBorderRadius}}",
  "bottomRow": 22,
  "boxShadow": "none",
  "buttonColor": "{{appsmith.theme.colors.primaryColor}}",
  "buttonStyle": "PRIMARY",
  "buttonVariant": "SECONDARY",
  "disabledWhenInvalid": false,
  "displayName": "Button",
  "dynamicBindingPathList": [
    {
      "key": "buttonColor"
    },
    {
      "key": "borderRadius"
    }
  ],
  "dynamicTriggerPathList": [
    {
      "key": "onClick"
    }
  ],
  "hideCard": false,
  "iconSVG": "/static/media/icon.7beb9123fb53027d9d6b778cdfe4caed.svg",
  "isDefaultClickDisabled": true,
  "isDeprecated": false,
  "isDisabled": false,
  "isLoading": false,
  "isVisible": true,
  "key": "6a5e3z3evn",
  "leftColumn": 31,
  "minWidth": 120,
  "mobileBottomRow": 22,
  "mobileLeftColumn": 31,
  "mobileRightColumn": 47,
  "mobileTopRow": 18,
  "onClick": "{{closeModal('Modal_eliminar');}}",
  "originalBottomRow": 22,
  "originalTopRow": 18,
  "parentId": "hm8bps7tvn",
  "placement": "CENTER",
  "recaptchaType": "V3",
  "renderMode": "CANVAS",
  "resetFormOnClick": false,
  "responsiveBehavior": "hug",
  "rightColumn": 47,
  "searchTags": [
    "click",
    "submit"
  ],
  "text": "Cancelar",
  "topRow": 18,
  "type": "BUTTON_WIDGET",
  "version": 1,
  "widgetId": "h7lspdq6it",
  "widgetName": "Button3"
}