{
  "accentColor": "{{appsmith.theme.colors.primaryColor}}",
  "animateLoading": true,
  "borderColor": "#E0DEDE",
  "borderRadius": "{{appsmith.theme.borderRadius.appBorderRadius}}",
  "borderWidth": "1",
  "bottomRow": 253,
  "boxShadow": "{{appsmith.theme.boxShadow.appBoxShadow}}",
  "canFreezeColumn": false,
  "childStylesheet": {
    "button": {
      "borderRadius": "{{appsmith.theme.borderRadius.appBorderRadius}}",
      "boxShadow": "none",
      "buttonColor": "{{appsmith.theme.colors.primaryColor}}"
    },
    "editActions": {
      "discardBorderRadius": "{{appsmith.theme.borderRadius.appBorderRadius}}",
      "discardButtonColor": "{{appsmith.theme.colors.primaryColor}}",
      "saveBorderRadius": "{{appsmith.theme.borderRadius.appBorderRadius}}",
      "saveButtonColor": "{{appsmith.theme.colors.primaryColor}}"
    },
    "iconButton": {
      "borderRadius": "{{appsmith.theme.borderRadius.appBorderRadius}}",
      "boxShadow": "none",
      "buttonColor": "{{appsmith.theme.colors.primaryColor}}"
    },
    "menuButton": {
      "borderRadius": "{{appsmith.theme.borderRadius.appBorderRadius}}",
      "boxShadow": "none",
      "menuColor": "{{appsmith.theme.colors.primaryColor}}"
    }
  },
  "columnOrder": [
    "institution_id",
    "assessment_id",
    "title",
    "enrollment_id",
    "tutor_id",
    "assessment_status",
    "enrollment_status"
  ],
  "columnUpdatedAt": 1677597632343,
  "columnWidthMap": {
    "status": 141,
    "step": 62,
    "task": 245,
    "title": 301
  },
  "defaultPageSize": 0,
  "defaultSelectedRowIndex": 0,
  "defaultSelectedRowIndices": "[]",
  "delimiter": ",",
  "displayName": "Table",
  "dynamicBindingPathList": [
    {
      "key": "accentColor"
    },
    {
      "key": "borderRadius"
    },
    {
      "key": "boxShadow"
    },
    {
      "key": "tableData"
    },
    {
      "key": "primaryColumns.institution_id.computedValue"
    },
    {
      "key": "totalRecordsCount"
    },
    {
      "key": "primaryColumns.assessment_id.computedValue"
    },
    {
      "key": "primaryColumns.title.computedValue"
    },
    {
      "key": "primaryColumns.enrollment_id.computedValue"
    },
    {
      "key": "primaryColumns.tutor_id.computedValue"
    },
    {
      "key": "primaryColumns.assessment_status.computedValue"
    },
    {
      "key": "primaryColumns.enrollment_status.computedValue"
    }
  ],
  "dynamicPropertyPathList": [
    {
      "key": "onPageChange"
    },
    {
      "key": "tableData"
    }
  ],
  "dynamicTriggerPathList": [
    {
      "key": "onPageChange"
    },
    {
      "key": "onPageSizeChange"
    }
  ],
  "enableClientSideSearch": true,
  "enableServerSideFiltering": false,
  "hideCard": false,
  "horizontalAlignment": "LEFT",
  "iconSVG": "/static/media/icon.db8a9cbd2acd22a31ea91cc37ea2a46c.svg",
  "inlineEditingSaveOption": "CUSTOM",
  "isDeprecated": false,
  "isLoading": false,
  "isSortable": true,
  "isVisible": true,
  "isVisibleDownload": true,
  "isVisibleFilters": true,
  "isVisiblePagination": true,
  "isVisibleSearch": true,
  "key": "9zf64i5g2g",
  "label": "Data",
  "leftColumn": 0,
  "multiRowSelection": true,
  "onPageChange": "{{handle_get_projects.getProjects()}}",
  "onPageSizeChange": "{{handle_get_projects.getProjects()}}",
  "originalBottomRow": 253,
  "originalTopRow": 44,
  "parentColumnSpace": 20.0625,
  "parentId": "0",
  "parentRowSpace": 10,
  "primaryColumns": {
    "assessment_id": {
      "alias": "assessment_id",
      "allowCellWrapping": false,
      "cellBackground": "",
      "columnType": "text",
      "computedValue": "{{Projects.processedTableData.map((currentRow, currentIndex) => ( currentRow[\"assessment_id\"]))}}",
      "enableFilter": true,
      "enableSort": true,
      "fontStyle": "",
      "horizontalAlignment": "LEFT",
      "id": "assessment_id",
      "index": 0,
      "isCellEditable": false,
      "isCellVisible": true,
      "isDerived": false,
      "isDisabled": false,
      "isDiscardVisible": true,
      "isEditable": false,
      "isSaveVisible": true,
      "isVisible": true,
      "label": "assessment_id",
      "originalId": "assessment_id",
      "sticky": "",
      "textColor": "",
      "textSize": "0.875rem",
      "validation": {},
      "verticalAlignment": "CENTER",
      "width": 150
    },
    "assessment_status": {
      "alias": "assessment_status",
      "allowCellWrapping": false,
      "cellBackground": "",
      "columnType": "text",
      "computedValue": "{{Projects.processedTableData.map((currentRow, currentIndex) => ( currentRow[\"assessment_status\"]))}}",
      "enableFilter": true,
      "enableSort": true,
      "fontStyle": "",
      "horizontalAlignment": "LEFT",
      "id": "assessment_status",
      "index": 4,
      "isCellEditable": false,
      "isCellVisible": true,
      "isDerived": false,
      "isDisabled": false,
      "isDiscardVisible": true,
      "isEditable": false,
      "isSaveVisible": true,
      "isVisible": true,
      "label": "assessment_status",
      "originalId": "assessment_status",
      "sticky": "",
      "textColor": "",
      "textSize": "0.875rem",
      "validation": {},
      "verticalAlignment": "CENTER",
      "width": 150
    },
    "enrollment_id": {
      "alias": "enrollment_id",
      "allowCellWrapping": false,
      "cellBackground": "",
      "columnType": "text",
      "computedValue": "{{Projects.processedTableData.map((currentRow, currentIndex) => ( currentRow[\"enrollment_id\"]))}}",
      "enableFilter": true,
      "enableSort": true,
      "fontStyle": "",
      "horizontalAlignment": "LEFT",
      "id": "enrollment_id",
      "index": 2,
      "isCellEditable": false,
      "isCellVisible": true,
      "isDerived": false,
      "isDisabled": false,
      "isDiscardVisible": true,
      "isEditable": false,
      "isSaveVisible": true,
      "isVisible": true,
      "label": "enrollment_id",
      "originalId": "enrollment_id",
      "sticky": "",
      "textColor": "",
      "textSize": "0.875rem",
      "validation": {},
      "verticalAlignment": "CENTER",
      "width": 150
    },
    "enrollment_status": {
      "alias": "enrollment_status",
      "allowCellWrapping": false,
      "cellBackground": "",
      "columnType": "text",
      "computedValue": "{{Projects.processedTableData.map((currentRow, currentIndex) => ( currentRow[\"enrollment_status\"]))}}",
      "enableFilter": true,
      "enableSort": true,
      "fontStyle": "",
      "horizontalAlignment": "LEFT",
      "id": "enrollment_status",
      "index": 6,
      "isCellEditable": false,
      "isCellVisible": true,
      "isDerived": false,
      "isDisabled": false,
      "isDiscardVisible": true,
      "isEditable": false,
      "isSaveVisible": true,
      "isVisible": true,
      "label": "enrollment_status",
      "originalId": "enrollment_status",
      "sticky": "",
      "textColor": "",
      "textSize": "0.875rem",
      "validation": {},
      "verticalAlignment": "CENTER",
      "width": 150
    },
    "institution_id": {
      "alias": "institution_id",
      "allowCellWrapping": false,
      "cellBackground": "",
      "columnType": "text",
      "computedValue": "{{Projects.processedTableData.map((currentRow, currentIndex) => ( currentRow[\"institution_id\"]))}}",
      "enableFilter": true,
      "enableSort": true,
      "fontStyle": "",
      "horizontalAlignment": "LEFT",
      "id": "institution_id",
      "index": 9,
      "isCellEditable": false,
      "isCellVisible": true,
      "isDerived": false,
      "isDisabled": false,
      "isDiscardVisible": true,
      "isEditable": false,
      "isSaveVisible": true,
      "isVisible": true,
      "label": "institution_id",
      "originalId": "institution_id",
      "sticky": "",
      "textColor": "",
      "textSize": "0.875rem",
      "validation": {},
      "verticalAlignment": "CENTER",
      "width": 150
    },
    "title": {
      "alias": "title",
      "allowCellWrapping": false,
      "cellBackground": "",
      "columnType": "text",
      "computedValue": "{{Projects.processedTableData.map((currentRow, currentIndex) => ( currentRow[\"title\"]))}}",
      "enableFilter": true,
      "enableSort": true,
      "fontStyle": "",
      "horizontalAlignment": "LEFT",
      "id": "title",
      "index": 1,
      "isCellEditable": false,
      "isCellVisible": true,
      "isDerived": false,
      "isDisabled": false,
      "isDiscardVisible": true,
      "isEditable": false,
      "isSaveVisible": true,
      "isVisible": true,
      "label": "title",
      "originalId": "title",
      "sticky": "",
      "textColor": "",
      "textSize": "0.875rem",
      "validation": {},
      "verticalAlignment": "CENTER",
      "width": 150
    },
    "tutor_id": {
      "alias": "tutor_id",
      "allowCellWrapping": false,
      "cellBackground": "",
      "columnType": "text",
      "computedValue": "{{Projects.processedTableData.map((currentRow, currentIndex) => ( currentRow[\"tutor_id\"]))}}",
      "enableFilter": true,
      "enableSort": true,
      "fontStyle": "",
      "horizontalAlignment": "LEFT",
      "id": "tutor_id",
      "index": 3,
      "isCellEditable": false,
      "isCellVisible": true,
      "isDerived": false,
      "isDisabled": false,
      "isDiscardVisible": true,
      "isEditable": false,
      "isSaveVisible": true,
      "isVisible": true,
      "label": "tutor_id",
      "originalId": "tutor_id",
      "sticky": "",
      "textColor": "",
      "textSize": "0.875rem",
      "validation": {},
      "verticalAlignment": "CENTER",
      "width": 150
    }
  },
  "renderMode": "CANVAS",
  "rightColumn": 64,
  "searchKey": "",
  "serverSidePaginationEnabled": true,
  "showInlineEditingOptionDropdown": true,
  "tableData": "{{ handle_get_projects.getProjects.data }}",
  "textSize": "0.875rem",
  "topRow": 44,
  "totalRecordsCount": "{{Total_Projects.data.find(i => i).count}}",
  "type": "TABLE_WIDGET_V2",
  "version": 1,
  "verticalAlignment": "CENTER",
  "widgetId": "w29llgp54d",
  "widgetName": "Projects"
}