{
  "animateLoading": true,
  "borderRadius": "{{appsmith.theme.borderRadius.appBorderRadius}}",
  "bottomRow": 36,
  "boxShadow": "none",
  "buttonColor": "#000066",
  "buttonVariant": "PRIMARY",
  "disabledWhenInvalid": true,
  "displayName": "Button",
  "dynamicBindingPathList": [
    {
      "key": "borderRadius"
    }
  ],
  "dynamicPropertyPathList": [],
  "dynamicTriggerPathList": [
    {
      "key": "onClick"
    }
  ],
  "hideCard": false,
  "iconSVG": "/static/media/icon.05d209fafeb13a8569e3b4e97069d9ee.svg",
  "isDefaultClickDisabled": true,
  "isDeprecated": false,
  "isDisabled": false,
  "isLoading": false,
  "isVisible": true,
  "key": "u3jzyf3h8b",
  "leftColumn": 47,
  "minWidth": 120,
  "mobileBottomRow": 37,
  "mobileLeftColumn": 46,
  "mobileRightColumn": 62,
  "mobileTopRow": 33,
  "onClick": "{{assign_templates.run().then(() => {\n  showAlert('El template se asocio correctamente', 'success');\n  resetWidget(\"templates_table\", true);\n  get_institutions_templates.run();\n}).catch(() => {\n  showAlert('Hubo un error al asociar el template', 'error');\n});}}",
  "originalBottomRow": 36,
  "originalTopRow": 32,
  "parentId": "8njor5cgi1",
  "placement": "CENTER",
  "recaptchaType": "V3",
  "renderMode": "CANVAS",
  "resetFormOnClick": true,
  "responsiveBehavior": "hug",
  "rightColumn": 64,
  "searchTags": [
    "click",
    "submit"
  ],
  "tags": [
    "Buttons"
  ],
  "text": "Asociar",
  "topRow": 32,
  "type": "BUTTON_WIDGET",
  "version": 1,
  "widgetId": "0tj0odxp0b",
  "widgetName": "submit_assign_form"
}