{
  "accentColor": "#000066",
  "alignWidget": "LEFT",
  "animateLoading": true,
  "bottomRow": 56,
  "boxShadow": "none",
  "defaultSwitchState": true,
  "dynamicBindingPathList": [],
  "dynamicHeight": "AUTO_HEIGHT",
  "dynamicTriggerPathList": [],
  "isDisabled": false,
  "isLoading": false,
  "isVisible": true,
  "key": "i083yi924p",
  "label": "Habilitar",
  "labelPosition": "Left",
  "leftColumn": 50,
  "maxDynamicHeight": 9000,
  "minDynamicHeight": 4,
  "mobileBottomRow": 62,
  "mobileLeftColumn": 1,
  "mobileRightColumn": 13,
  "mobileTopRow": 58,
  "needsErrorInfo": false,
  "originalBottomRow": 56,
  "originalTopRow": 52,
  "parentColumnSpace": 15.784423828125,
  "parentId": "kbcs6wj4g7",
  "parentRowSpace": 10,
  "renderMode": "CANVAS",
  "responsiveBehavior": "fill",
  "rightColumn": 62,
  "topRow": 52,
  "type": "SWITCH_WIDGET",
  "version": 1,
  "widgetId": "6wnyz79d67",
  "widgetName": "Switch_Enable_Input"
}