{
  "accentColor": "{{appsmith.theme.colors.primaryColor}}",
  "animateLoading": true,
  "autoFocus": false,
  "borderRadius": "{{appsmith.theme.borderRadius.appBorderRadius}}",
  "bottomRow": 37,
  "boxShadow": "none",
  "defaultText": "{{Table_versions.triggeredRow.pass_score}}",
  "dynamicBindingPathList": [
    {
      "key": "accentColor"
    },
    {
      "key": "borderRadius"
    },
    {
      "key": "defaultText"
    }
  ],
  "dynamicHeight": "FIXED",
  "dynamicTriggerPathList": [],
  "iconAlign": "left",
  "inputType": "NUMBER",
  "isDisabled": false,
  "isLoading": false,
  "isRequired": false,
  "isVisible": true,
  "key": "sgfad9pd3n",
  "label": "Porcentaje necesario para pasar el examen",
  "labelAlignment": "left",
  "labelPosition": "Top",
  "labelStyle": "",
  "labelTextSize": "0.875rem",
  "labelWidth": 5,
  "leftColumn": 1,
  "maxDynamicHeight": 9000,
  "maxNum": "100",
  "minDynamicHeight": 4,
  "minNum": "1",
  "minWidth": 450,
  "mobileBottomRow": 13,
  "mobileLeftColumn": 1,
  "mobileRightColumn": 21,
  "mobileTopRow": 6,
  "needsErrorInfo": false,
  "parentColumnSpace": 6.9375,
  "parentId": "mqzk8u3n3v",
  "parentRowSpace": 10,
  "renderMode": "CANVAS",
  "resetOnSubmit": true,
  "responsiveBehavior": "fill",
  "rightColumn": 62,
  "shouldAllowAutofill": false,
  "showStepArrows": true,
  "topRow": 30,
  "type": "INPUT_WIDGET_V2",
  "version": 2,
  "widgetId": "zt50a64nx3",
  "widgetName": "v_update_pass_score"
}