{
  "accentColor": "{{appsmith.theme.colors.primaryColor}}",
  "animateLoading": true,
  "autoFocus": false,
  "borderRadius": "{{appsmith.theme.borderRadius.appBorderRadius}}",
  "bottomRow": 13,
  "boxShadow": "none",
  "defaultText": "{{Table_versions_QA.triggeredRow.id}}",
  "dynamicBindingPathList": [
    {
      "key": "accentColor"
    },
    {
      "key": "borderRadius"
    },
    {
      "key": "defaultText"
    }
  ],
  "dynamicHeight": "FIXED",
  "dynamicTriggerPathList": [],
  "iconAlign": "left",
  "inputType": "TEXT",
  "isDisabled": true,
  "isLoading": false,
  "isRequired": true,
  "isVisible": true,
  "key": "8ci5lw6cn9",
  "label": "Version Id",
  "labelAlignment": "left",
  "labelPosition": "Top",
  "labelStyle": "",
  "labelTextSize": "0.875rem",
  "labelWidth": 5,
  "leftColumn": 1,
  "maxDynamicHeight": 9000,
  "minDynamicHeight": 4,
  "minWidth": 450,
  "mobileBottomRow": 13,
  "mobileLeftColumn": 1,
  "mobileRightColumn": 21,
  "mobileTopRow": 6,
  "needsErrorInfo": false,
  "parentColumnSpace": 6.9375,
  "parentId": "j8rh8h579f",
  "parentRowSpace": 10,
  "renderMode": "CANVAS",
  "resetOnSubmit": true,
  "responsiveBehavior": "fill",
  "rightColumn": 62,
  "showStepArrows": false,
  "topRow": 6,
  "type": "INPUT_WIDGET_V2",
  "version": 2,
  "widgetId": "f0asg2ts84",
  "widgetName": "c_question_versionId"
}