{
  "animateLoading": true,
  "borderRadius": "{{appsmith.theme.borderRadius.appBorderRadius}}",
  "bottomRow": 17,
  "boxShadow": "none",
  "buttonColor": "{{appsmith.theme.colors.primaryColor}}",
  "buttonVariant": "PRIMARY",
  "disabledWhenInvalid": true,
  "displayName": "Button",
  "dynamicBindingPathList": [
    {
      "key": "buttonColor"
    },
    {
      "key": "borderRadius"
    }
  ],
  "dynamicPropertyPathList": [
    {
      "key": "onClick"
    }
  ],
  "dynamicTriggerPathList": [
    {
      "key": "onClick"
    }
  ],
  "hideCard": false,
  "iconSVG": "/static/media/icon.7beb9123fb53027d9d6b778cdfe4caed.svg",
  "isDefaultClickDisabled": true,
  "isDeprecated": false,
  "isDisabled": false,
  "isLoading": false,
  "isVisible": true,
  "key": "q0fvhpk5b8",
  "leftColumn": 45,
  "minWidth": 120,
  "mobileBottomRow": 37,
  "mobileLeftColumn": 46,
  "mobileRightColumn": 62,
  "mobileTopRow": 33,
  "onClick": "\n{{\n    Create_Credit.run(\n      () => showAlert(\"Token creado correctamente\", \"success\"),\n      () => showAlert(\"No se pudo crear el token\", \"error\")\n    ).then(() => Get_Credits.run());\n}}\n",
  "parentId": "oefkxo2eai",
  "placement": "CENTER",
  "recaptchaType": "V3",
  "renderMode": "CANVAS",
  "resetFormOnClick": true,
  "responsiveBehavior": "hug",
  "rightColumn": 61,
  "searchTags": [
    "click",
    "submit"
  ],
  "text": "Submit",
  "topRow": 13,
  "type": "BUTTON_WIDGET",
  "version": 1,
  "widgetId": "3pw9fw8mat",
  "widgetName": "Button1"
}