{
  "animateLoading": true,
  "borderRadius": "{{appsmith.theme.borderRadius.appBorderRadius}}",
  "bottomRow": 12,
  "dynamicBindingPathList": [
    {
      "key": "truncateButtonColor"
    },
    {
      "key": "fontFamily"
    },
    {
      "key": "borderRadius"
    },
    {
      "key": "text"
    }
  ],
  "dynamicHeight": "AUTO_HEIGHT",
  "dynamicTriggerPathList": [],
  "fontFamily": "{{appsmith.theme.fontFamily.appFont}}",
  "fontSize": "1rem",
  "fontStyle": "BOLD",
  "isLoading": false,
  "isVisible": true,
  "key": "toqvp4f17d",
  "leftColumn": 1,
  "maxDynamicHeight": 9000,
  "minDynamicHeight": 4,
  "minWidth": 450,
  "mobileBottomRow": 12,
  "mobileLeftColumn": 1,
  "mobileRightColumn": 17,
  "mobileTopRow": 8,
  "needsErrorInfo": false,
  "originalBottomRow": 12,
  "originalTopRow": 8,
  "overflow": "NONE",
  "parentColumnSpace": 6.9375,
  "parentId": "6a3gfmuj5h",
  "parentRowSpace": 10,
  "renderMode": "CANVAS",
  "responsiveBehavior": "fill",
  "rightColumn": 62,
  "shouldTruncate": false,
  "text": "{{\n`Curso: ${CbyId.data.data.title}`\n}}",
  "textAlign": "LEFT",
  "textColor": "#000066",
  "topRow": 8,
  "truncateButtonColor": "{{appsmith.theme.colors.primaryColor}}",
  "type": "TEXT_WIDGET",
  "version": 1,
  "widgetId": "uzrrsx3ixw",
  "widgetName": "Text63"
}