{
  "animateLoading": true,
  "borderRadius": "{{appsmith.theme.borderRadius.appBorderRadius}}",
  "bottomRow": 64,
  "boxShadow": "none",
  "buttonColor": "#000066",
  "buttonStyle": "PRIMARY_BUTTON",
  "buttonVariant": "PRIMARY",
  "disabledWhenInvalid": false,
  "dynamicBindingPathList": [
    {
      "key": "borderRadius"
    }
  ],
  "dynamicTriggerPathList": [
    {
      "key": "onClick"
    }
  ],
  "isDefaultClickDisabled": true,
  "isDisabled": false,
  "isLoading": false,
  "isVisible": true,
  "key": "ck270t9f60",
  "leftColumn": 46,
  "minWidth": 120,
  "mobileBottomRow": 22,
  "mobileLeftColumn": 47,
  "mobileRightColumn": 63,
  "mobileTopRow": 18,
  "needsErrorInfo": false,
  "onClick": "{{exams_questions.run().then(() => {\n  showAlert('Pregunta creada', 'success');\n  closeModal(Modal_question.name);\n  exams_by_id_QA.run();\n}).catch(() => {\n  showAlert('No se pudo crear la pregunta', 'error');\n});}}",
  "originalBottomRow": 64,
  "originalTopRow": 60,
  "parentId": "j8rh8h579f",
  "placement": "CENTER",
  "recaptchaType": "V3",
  "renderMode": "CANVAS",
  "resetFormOnClick": true,
  "responsiveBehavior": "hug",
  "rightColumn": 62,
  "text": "Enviar",
  "topRow": 60,
  "type": "BUTTON_WIDGET",
  "version": 1,
  "widgetId": "4w5zyeak9a",
  "widgetName": "Button16"
}