{
  "animateLoading": true,
  "borderRadius": "{{appsmith.theme.borderRadius.appBorderRadius}}",
  "bottomRow": 36,
  "boxShadow": "none",
  "buttonColor": "{{appsmith.theme.colors.primaryColor}}",
  "buttonVariant": "PRIMARY",
  "disabledWhenInvalid": true,
  "displayName": "Button",
  "dynamicBindingPathList": [
    {
      "key": "buttonColor"
    },
    {
      "key": "borderRadius"
    },
    {
      "key": "isDisabled"
    }
  ],
  "dynamicPropertyPathList": [
    {
      "key": "isDisabled"
    }
  ],
  "dynamicTriggerPathList": [
    {
      "key": "onClick"
    }
  ],
  "hideCard": false,
  "iconSVG": "/static/media/icon.05d209fafeb13a8569e3b4e97069d9ee.svg",
  "isDefaultClickDisabled": true,
  "isDeprecated": false,
  "isDisabled": "{{\ncreate_association_module_id.selectedOptionValue === \"\" || \ncreate_association_inst_id.selectedOptionValue === \"\"}}",
  "isLoading": false,
  "isVisible": true,
  "key": "bsazo7w316",
  "leftColumn": 48,
  "minWidth": 120,
  "mobileBottomRow": 37,
  "mobileLeftColumn": 46,
  "mobileRightColumn": 62,
  "mobileTopRow": 33,
  "onClick": "{{put_assign_institution_module.run({}).then(() => {\n  showAlert('Asociacion creada con exito', 'success');\n  get_institutions_modules.run();\n}).catch(() => {\n  showAlert('Hubo un error al asociar el modulo a la institucion', 'error');\n});}}",
  "originalBottomRow": 36,
  "originalTopRow": 32,
  "parentId": "98t5dtplxn",
  "placement": "CENTER",
  "recaptchaType": "V3",
  "renderMode": "CANVAS",
  "resetFormOnClick": true,
  "responsiveBehavior": "hug",
  "rightColumn": 64,
  "searchTags": [
    "click",
    "submit"
  ],
  "tags": [
    "Buttons"
  ],
  "text": "Submit",
  "topRow": 32,
  "type": "BUTTON_WIDGET",
  "version": 1,
  "widgetId": "17hqc18zxd",
  "widgetName": "create_association_submit"
}