{
  "animateLoading": true,
  "backgroundColor": "#FFFFFF",
  "borderColor": "#E0DEDE",
  "borderRadius": "{{appsmith.theme.borderRadius.appBorderRadius}}",
  "borderWidth": "1",
  "bottomRow": 197,
  "boxShadow": "{{appsmith.theme.boxShadow.appBoxShadow}}",
  "children": [
    {
      "bottomRow": 360,
      "canExtend": false,
      "containerStyle": "none",
      "detachFromLayout": true,
      "displayName": "Canvas",
      "dynamicBindingPathList": [],
      "flexLayers": [],
      "hideCard": true,
      "isDeprecated": false,
      "isLoading": false,
      "isVisible": true,
      "key": "lpr4scdzci",
      "leftColumn": 0,
      "minHeight": 400,
      "minWidth": 450,
      "mobileBottomRow": 400,
      "mobileLeftColumn": 0,
      "mobileRightColumn": 391.875,
      "mobileTopRow": 0,
      "parentColumnSpace": 1,
      "parentId": "augphzk5ax",
      "parentRowSpace": 1,
      "renderMode": "CANVAS",
      "responsiveBehavior": "fill",
      "rightColumn": 391.875,
      "topRow": 0,
      "type": "CANVAS_WIDGET",
      "version": 1,
      "widgetId": "bvltgwqvys",
      "widgetName": "Canvas4Copy"
    }
  ],
  "displayName": "Form",
  "dynamicBindingPathList": [
    {
      "key": "borderRadius"
    },
    {
      "key": "boxShadow"
    }
  ],
  "dynamicHeight": "AUTO_HEIGHT",
  "hideCard": false,
  "iconSVG": "/static/media/icon.5d6d2ac5cb1aa68bcd9b14f11c56b44a.svg",
  "isCanvas": true,
  "isDeprecated": false,
  "isLoading": false,
  "isVisible": true,
  "key": "m9ff9wpoyw",
  "leftColumn": 1,
  "maxDynamicHeight": 9000,
  "minDynamicHeight": 10,
  "minWidth": 450,
  "mobileBottomRow": 98,
  "mobileLeftColumn": 1,
  "mobileRightColumn": 25,
  "mobileTopRow": 58,
  "originalBottomRow": 197,
  "originalTopRow": 161,
  "parentColumnSpace": 16.328125,
  "parentId": "0",
  "parentRowSpace": 10,
  "positioning": "fixed",
  "renderMode": "CANVAS",
  "responsiveBehavior": "fill",
  "rightColumn": 62,
  "searchTags": [
    "group"
  ],
  "shouldScrollContents": true,
  "topRow": 161,
  "type": "FORM_WIDGET",
  "widgetId": "augphzk5ax",
  "widgetName": "Form_desasignar"
}