{
  "animateLoading": true,
  "borderRadius": "{{appsmith.theme.borderRadius.appBorderRadius}}",
  "bottomRow": 32,
  "boxShadow": "none",
  "buttonColor": "#000066",
  "buttonVariant": "PRIMARY",
  "disabledWhenInvalid": true,
  "displayName": "Button",
  "dynamicBindingPathList": [
    {
      "key": "borderRadius"
    }
  ],
  "dynamicPropertyPathList": [],
  "dynamicTriggerPathList": [
    {
      "key": "onClick"
    }
  ],
  "hideCard": false,
  "iconSVG": "/static/media/icon.cca026338f1c8eb6df8ba03d084c2fca.svg",
  "isDefaultClickDisabled": true,
  "isDeprecated": false,
  "isDisabled": false,
  "isLoading": false,
  "isVisible": true,
  "key": "07jlypnovn",
  "leftColumn": 53,
  "onClick": "{{associate_academy_institution.run().then(() => {\n  showAlert('Academia asociada correctamente', 'success');\n}).catch(() => {\n  showAlert('No se pudo asociar la academia', 'error');\n});}}",
  "parentId": "phxnzhqsq6",
  "placement": "CENTER",
  "recaptchaType": "V3",
  "renderMode": "CANVAS",
  "resetFormOnClick": true,
  "rightColumn": 62,
  "searchTags": [
    "click",
    "submit"
  ],
  "text": "Asociar",
  "topRow": 28,
  "type": "BUTTON_WIDGET",
  "version": 1,
  "widgetId": "tr23aus3pt",
  "widgetName": "Submit_ButtonCopy"
}