{
  "animateLoading": true,
  "borderRadius": "{{appsmith.theme.borderRadius.appBorderRadius}}",
  "bottomRow": 5,
  "dynamicBindingPathList": [
    {
      "key": "truncateButtonColor"
    },
    {
      "key": "fontFamily"
    },
    {
      "key": "borderRadius"
    }
  ],
  "dynamicHeight": "AUTO_HEIGHT",
  "dynamicTriggerPathList": [],
  "fontFamily": "{{appsmith.theme.fontFamily.appFont}}",
  "fontSize": "1.25rem",
  "fontStyle": "BOLD",
  "isLoading": false,
  "isVisible": true,
  "key": "6xqi35zesm",
  "leftColumn": 1,
  "maxDynamicHeight": 9000,
  "minDynamicHeight": 4,
  "minWidth": 450,
  "mobileBottomRow": 5,
  "mobileLeftColumn": 1,
  "mobileRightColumn": 41,
  "mobileTopRow": 1,
  "needsErrorInfo": false,
  "overflow": "NONE",
  "parentId": "fc6lszks70",
  "renderMode": "CANVAS",
  "responsiveBehavior": "fill",
  "rightColumn": 58,
  "shouldTruncate": false,
  "text": "Versiones del examen",
  "textAlign": "CENTER",
  "textColor": "#000066",
  "topRow": 1,
  "truncateButtonColor": "{{appsmith.theme.colors.primaryColor}}",
  "type": "TEXT_WIDGET",
  "version": 1,
  "widgetId": "i3qtscufdb",
  "widgetName": "Text4"
}