{
  "animateLoading": true,
  "borderRadius": "{{appsmith.theme.borderRadius.appBorderRadius}}",
  "bottomRow": 69,
  "boxShadow": "none",
  "canEscapeKeyClose": true,
  "canOutsideClickClose": false,
  "children": [
    {
      "borderRadius": "{{appsmith.theme.borderRadius.appBorderRadius}}",
      "bottomRow": 690,
      "boxShadow": "{{appsmith.theme.boxShadow.appBoxShadow}}",
      "canExtend": true,
      "detachFromLayout": true,
      "dynamicBindingPathList": [
        {
          "key": "borderRadius"
        },
        {
          "key": "boxShadow"
        }
      ],
      "dynamicHeight": "AUTO_HEIGHT",
      "flexLayers": [],
      "isDisabled": false,
      "isLoading": false,
      "isVisible": true,
      "key": "4s2bmpatvf",
      "leftColumn": 0,
      "maxDynamicHeight": 9000,
      "minDynamicHeight": 4,
      "minHeight": 0,
      "minWidth": 450,
      "mobileBottomRow": 0,
      "mobileLeftColumn": 0,
      "mobileRightColumn": 0,
      "mobileTopRow": 0,
      "needsErrorInfo": false,
      "parentColumnSpace": 1,
      "parentId": "djsowosf1n",
      "parentRowSpace": 1,
      "renderMode": "CANVAS",
      "responsiveBehavior": "fill",
      "rightColumn": 0,
      "shouldScrollContents": false,
      "topRow": 0,
      "type": "CANVAS_WIDGET",
      "version": 1,
      "widgetId": "xj95q3w0jb",
      "widgetName": "Canvas20"
    }
  ],
  "detachFromLayout": true,
  "dynamicBindingPathList": [
    {
      "key": "borderRadius"
    }
  ],
  "dynamicHeight": "AUTO_HEIGHT",
  "dynamicTriggerPathList": [],
  "height": 690,
  "isCanvas": true,
  "isLoading": false,
  "key": "ff3a8mkr2v",
  "leftColumn": 0,
  "maxDynamicHeight": 9000,
  "minDynamicHeight": 24,
  "minHeight": 690,
  "mobileBottomRow": 0,
  "mobileLeftColumn": 0,
  "mobileRightColumn": 0,
  "mobileTopRow": 0,
  "needsErrorInfo": false,
  "parentColumnSpace": 1,
  "parentId": "0",
  "parentRowSpace": 1,
  "renderMode": "CANVAS",
  "rightColumn": 0,
  "shouldScrollContents": true,
  "topRow": 0,
  "type": "MODAL_WIDGET",
  "version": 2,
  "widgetId": "djsowosf1n",
  "widgetName": "Modal_update_template",
  "width": 456
}