{
  "animateLoading": true,
  "borderRadius": "{{appsmith.theme.borderRadius.appBorderRadius}}",
  "bottomRow": 4,
  "boxShadow": "none",
  "buttonColor": "{{appsmith.theme.colors.primaryColor}}",
  "buttonVariant": "TERTIARY",
  "displayName": "Icon Button",
  "dynamicBindingPathList": [
    {
      "key": "buttonColor"
    },
    {
      "key": "borderRadius"
    }
  ],
  "dynamicTriggerPathList": [
    {
      "key": "onClick"
    }
  ],
  "hideCard": false,
  "iconName": "cross",
  "iconSVG": "/static/media/icon.1a0c634ac75f9fa6b6ae7a8df882a3ba.svg",
  "iconSize": 24,
  "isDeprecated": false,
  "isDisabled": false,
  "isLoading": false,
  "isVisible": true,
  "key": "9iwrwm7zsp",
  "leftColumn": 57,
  "onClick": "{{closeModal('Update_Course_Modal')}}",
  "parentId": "qphdgnujqg",
  "renderMode": "CANVAS",
  "rightColumn": 64,
  "searchTags": [
    "click",
    "submit"
  ],
  "topRow": 0,
  "type": "ICON_BUTTON_WIDGET",
  "version": 1,
  "widgetId": "jz03v4qn31",
  "widgetName": "IconButton2"
}