{
  "gitSyncId": "63ea774fae191670a1aa51a8_64ecc5f535ac2e3e350f34ce",
  "unpublishedPage": {
    "isHidden": true,
    "layouts": [
      {
        "dsl": {
          "backgroundColor": "none",
          "bottomRow": 550,
          "canExtend": true,
          "containerStyle": "none",
          "detachFromLayout": true,
          "dynamicBindingPathList": [],
          "leftColumn": 0,
          "minHeight": 780,
          "parentColumnSpace": 1,
          "parentRowSpace": 1,
          "rightColumn": 1224,
          "snapColumns": 64,
          "snapRows": 76,
          "topRow": 0,
          "type": "CANVAS_WIDGET",
          "version": 91,
          "widgetId": "0",
          "widgetName": "MainContainer"
        }
      }
    ],
    "name": "Créditos",
    "slug": "creditos"
  }
}