{
  "animateLoading": true,
  "borderRadius": "{{appsmith.theme.borderRadius.appBorderRadius}}",
  "bottomRow": 971,
  "boxShadow": "none",
  "canEscapeKeyClose": true,
  "canOutsideClickClose": true,
  "children": [
    {
      "bottomRow": 780,
      "canExtend": true,
      "detachFromLayout": true,
      "displayName": "Canvas",
      "dynamicBindingPathList": [],
      "hideCard": true,
      "isDeprecated": false,
      "isDisabled": false,
      "isLoading": false,
      "isVisible": true,
      "key": "1ckxij0gk7",
      "leftColumn": 0,
      "minHeight": 240,
      "parentColumnSpace": 1,
      "parentId": "3qbdca8407",
      "parentRowSpace": 1,
      "renderMode": "CANVAS",
      "rightColumn": 0,
      "shouldScrollContents": false,
      "topRow": 0,
      "type": "CANVAS_WIDGET",
      "version": 1,
      "widgetId": "aszv6hadpl",
      "widgetName": "Canvas3Copy"
    }
  ],
  "detachFromLayout": true,
  "displayName": "Modal",
  "dynamicBindingPathList": [
    {
      "key": "borderRadius"
    }
  ],
  "dynamicHeight": "AUTO_HEIGHT",
  "height": 780,
  "hideCard": false,
  "iconSVG": "/static/media/icon.4975978e9a961fb0bfb4e38de7ecc7c5.svg",
  "isCanvas": true,
  "isDeprecated": false,
  "isLoading": false,
  "key": "tc3p8q5sw2",
  "leftColumn": 0,
  "maxDynamicHeight": 9000,
  "minDynamicHeight": 24,
  "minHeight": 780,
  "parentColumnSpace": 1,
  "parentId": "0",
  "parentRowSpace": 1,
  "renderMode": "CANVAS",
  "rightColumn": 0,
  "searchTags": [
    "dialog",
    "popup",
    "notification"
  ],
  "shouldScrollContents": true,
  "topRow": 191,
  "type": "MODAL_WIDGET",
  "version": 2,
  "widgetId": "3qbdca8407",
  "widgetName": "Modal_actualizar_Video",
  "width": 942
}