{
  "animateLoading": true,
  "autoGenerateForm": true,
  "backgroundColor": "#fff",
  "borderColor": "#E0DEDE",
  "borderRadius": "{{appsmith.theme.borderRadius.appBorderRadius}}",
  "borderWidth": "1",
  "bottomRow": 128,
  "boxShadow": "{{appsmith.theme.boxShadow.appBoxShadow}}",
  "childStylesheet": {
    "ARRAY": {
      "accentColor": "{{appsmith.theme.colors.primaryColor}}",
      "borderRadius": "{{appsmith.theme.borderRadius.appBorderRadius}}",
      "boxShadow": "none",
      "cellBorderRadius": "{{appsmith.theme.borderRadius.appBorderRadius}}",
      "cellBoxShadow": "none"
    },
    "CHECKBOX": {
      "accentColor": "{{appsmith.theme.colors.primaryColor}}",
      "borderRadius": "{{appsmith.theme.borderRadius.appBorderRadius}}"
    },
    "CURRENCY_INPUT": {
      "accentColor": "{{appsmith.theme.colors.primaryColor}}",
      "borderRadius": "{{appsmith.theme.borderRadius.appBorderRadius}}",
      "boxShadow": "none"
    },
    "DATEPICKER": {
      "accentColor": "{{appsmith.theme.colors.primaryColor}}",
      "borderRadius": "{{appsmith.theme.borderRadius.appBorderRadius}}",
      "boxShadow": "none"
    },
    "EMAIL_INPUT": {
      "accentColor": "{{appsmith.theme.colors.primaryColor}}",
      "borderRadius": "{{appsmith.theme.borderRadius.appBorderRadius}}",
      "boxShadow": "none"
    },
    "MULTILINE_TEXT_INPUT": {
      "accentColor": "{{appsmith.theme.colors.primaryColor}}",
      "borderRadius": "{{appsmith.theme.borderRadius.appBorderRadius}}",
      "boxShadow": "none"
    },
    "MULTISELECT": {
      "accentColor": "{{appsmith.theme.colors.primaryColor}}",
      "borderRadius": "{{appsmith.theme.borderRadius.appBorderRadius}}",
      "boxShadow": "none"
    },
    "NUMBER_INPUT": {
      "accentColor": "{{appsmith.theme.colors.primaryColor}}",
      "borderRadius": "{{appsmith.theme.borderRadius.appBorderRadius}}",
      "boxShadow": "none"
    },
    "OBJECT": {
      "borderRadius": "{{appsmith.theme.borderRadius.appBorderRadius}}",
      "boxShadow": "none",
      "cellBorderRadius": "{{appsmith.theme.borderRadius.appBorderRadius}}",
      "cellBoxShadow": "none"
    },
    "PASSWORD_INPUT": {
      "accentColor": "{{appsmith.theme.colors.primaryColor}}",
      "borderRadius": "{{appsmith.theme.borderRadius.appBorderRadius}}",
      "boxShadow": "none"
    },
    "PHONE_NUMBER_INPUT": {
      "accentColor": "{{appsmith.theme.colors.primaryColor}}",
      "borderRadius": "{{appsmith.theme.borderRadius.appBorderRadius}}",
      "boxShadow": "none"
    },
    "RADIO_GROUP": {
      "accentColor": "{{appsmith.theme.colors.primaryColor}}",
      "boxShadow": "none"
    },
    "SELECT": {
      "accentColor": "{{appsmith.theme.colors.primaryColor}}",
      "borderRadius": "{{appsmith.theme.borderRadius.appBorderRadius}}",
      "boxShadow": "none"
    },
    "SWITCH": {
      "accentColor": "{{appsmith.theme.colors.primaryColor}}",
      "boxShadow": "none"
    },
    "TEXT_INPUT": {
      "accentColor": "{{appsmith.theme.colors.primaryColor}}",
      "borderRadius": "{{appsmith.theme.borderRadius.appBorderRadius}}",
      "boxShadow": "none"
    }
  },
  "disabledWhenInvalid": true,
  "displayName": "JSON Form",
  "dynamicBindingPathList": [
    {
      "key": "borderRadius"
    },
    {
      "key": "boxShadow"
    },
    {
      "key": "submitButtonStyles.buttonColor"
    },
    {
      "key": "submitButtonStyles.borderRadius"
    },
    {
      "key": "resetButtonStyles.buttonColor"
    },
    {
      "key": "resetButtonStyles.borderRadius"
    },
    {
      "key": "schema.__root_schema__.defaultValue"
    },
    {
      "key": "schema.__root_schema__.borderRadius"
    },
    {
      "key": "schema.__root_schema__.cellBorderRadius"
    },
    {
      "key": "sourceData"
    },
    {
      "key": "schema.__root_schema__.children.id.defaultValue"
    },
    {
      "key": "schema.__root_schema__.children.id.accentColor"
    },
    {
      "key": "schema.__root_schema__.children.id.borderRadius"
    },
    {
      "key": "schema.__root_schema__.children.created_at.defaultValue"
    },
    {
      "key": "schema.__root_schema__.children.created_at.accentColor"
    },
    {
      "key": "schema.__root_schema__.children.created_at.borderRadius"
    },
    {
      "key": "schema.__root_schema__.children.updated_at.defaultValue"
    },
    {
      "key": "schema.__root_schema__.children.updated_at.accentColor"
    },
    {
      "key": "schema.__root_schema__.children.updated_at.borderRadius"
    },
    {
      "key": "schema.__root_schema__.children.deleted_at.defaultValue"
    },
    {
      "key": "schema.__root_schema__.children.deleted_at.accentColor"
    },
    {
      "key": "schema.__root_schema__.children.deleted_at.borderRadius"
    },
    {
      "key": "schema.__root_schema__.children.link_url.defaultValue"
    },
    {
      "key": "schema.__root_schema__.children.link_url.accentColor"
    },
    {
      "key": "schema.__root_schema__.children.link_url.borderRadius"
    },
    {
      "key": "schema.__root_schema__.children.description.defaultValue"
    },
    {
      "key": "schema.__root_schema__.children.description.accentColor"
    },
    {
      "key": "schema.__root_schema__.children.description.borderRadius"
    },
    {
      "key": "schema.__root_schema__.children.start_date.defaultValue"
    },
    {
      "key": "schema.__root_schema__.children.start_date.accentColor"
    },
    {
      "key": "schema.__root_schema__.children.start_date.borderRadius"
    },
    {
      "key": "schema.__root_schema__.children.end_date.defaultValue"
    },
    {
      "key": "schema.__root_schema__.children.end_date.accentColor"
    },
    {
      "key": "schema.__root_schema__.children.end_date.borderRadius"
    },
    {
      "key": "schema.__root_schema__.children.start_hour.defaultValue"
    },
    {
      "key": "schema.__root_schema__.children.start_hour.accentColor"
    },
    {
      "key": "schema.__root_schema__.children.start_hour.borderRadius"
    },
    {
      "key": "schema.__root_schema__.children.end_hour.defaultValue"
    },
    {
      "key": "schema.__root_schema__.children.end_hour.accentColor"
    },
    {
      "key": "schema.__root_schema__.children.end_hour.borderRadius"
    },
    {
      "key": "schema.__root_schema__.children.course_id.defaultValue"
    },
    {
      "key": "schema.__root_schema__.children.course_id.accentColor"
    },
    {
      "key": "schema.__root_schema__.children.course_id.borderRadius"
    },
    {
      "key": "schema.__root_schema__.children.synchronous_meeting_title.defaultValue"
    },
    {
      "key": "schema.__root_schema__.children.synchronous_meeting_title.accentColor"
    },
    {
      "key": "schema.__root_schema__.children.synchronous_meeting_title.borderRadius"
    },
    {
      "key": "schema.__root_schema__.children.academy_name.defaultValue"
    },
    {
      "key": "schema.__root_schema__.children.academy_name.accentColor"
    },
    {
      "key": "schema.__root_schema__.children.academy_name.borderRadius"
    },
    {
      "key": "schema.__root_schema__.children.course_title.defaultValue"
    },
    {
      "key": "schema.__root_schema__.children.course_title.accentColor"
    },
    {
      "key": "schema.__root_schema__.children.course_title.borderRadius"
    },
    {
      "key": "schema.__root_schema__.children.institution_name.defaultValue"
    },
    {
      "key": "schema.__root_schema__.children.institution_name.accentColor"
    },
    {
      "key": "schema.__root_schema__.children.institution_name.borderRadius"
    },
    {
      "key": "schema.__root_schema__.children.institution_id.defaultValue"
    },
    {
      "key": "schema.__root_schema__.children.institution_id.accentColor"
    },
    {
      "key": "schema.__root_schema__.children.institution_id.borderRadius"
    },
    {
      "key": "schema.__root_schema__.children.academy_id.defaultValue"
    },
    {
      "key": "schema.__root_schema__.children.academy_id.accentColor"
    },
    {
      "key": "schema.__root_schema__.children.academy_id.borderRadius"
    }
  ],
  "dynamicHeight": "AUTO_HEIGHT",
  "dynamicPropertyPathList": [
    {
      "key": "schema.__root_schema__.children.start_date.defaultValue"
    },
    {
      "key": "schema.__root_schema__.children.end_date.defaultValue"
    },
    {
      "key": "onSubmit"
    }
  ],
  "dynamicTriggerPathList": [
    {
      "key": "onSubmit"
    }
  ],
  "fieldLimitExceeded": false,
  "fixedFooter": true,
  "hideCard": false,
  "iconSVG": "/static/media/icon.5b428de12db9ad6a591955ead07f86e9.svg",
  "isDeprecated": false,
  "isLoading": false,
  "isVisible": true,
  "key": "qegq05n7c8",
  "leftColumn": 1,
  "maxDynamicHeight": 9000,
  "minDynamicHeight": 4,
  "onSubmit": "{{\n   put_synchronous_meetings\n      .run(\n        () => showAlert(\"Reunión Actualizada\", \"success\"),\n        () => showAlert(\"No se pudo actualizar la Reunión\", \"error\")\n      )\n      .then(() => closeModal(\"Actualizar_sync\")).then(() => sync_list_query.run());\n}}\n",
  "originalBottomRow": 128,
  "originalTopRow": 6,
  "parentColumnSpace": 14.53125,
  "parentId": "3i550agkn0",
  "parentRowSpace": 10,
  "renderMode": "CANVAS",
  "resetButtonLabel": "Reset",
  "resetButtonStyles": {
    "borderRadius": "{{appsmith.theme.borderRadius.appBorderRadius}}",
    "boxShadow": "none",
    "buttonColor": "{{appsmith.theme.colors.primaryColor}}",
    "buttonVariant": "SECONDARY"
  },
  "rightColumn": 63,
  "schema": {
    "__root_schema__": {
      "accessor": "__root_schema__",
      "borderRadius": "{{((sourceData, formData, fieldState) => (appsmith.theme.borderRadius.appBorderRadius))(JSONForm1.sourceData, JSONForm1.formData, JSONForm1.fieldState)}}",
      "boxShadow": "none",
      "cellBorderRadius": "{{((sourceData, formData, fieldState) => (appsmith.theme.borderRadius.appBorderRadius))(JSONForm1.sourceData, JSONForm1.formData, JSONForm1.fieldState)}}",
      "cellBoxShadow": "none",
      "children": {
        "academy_id": {
          "accentColor": "{{((sourceData, formData, fieldState) => ((appsmith.theme.colors.primaryColor)))(JSONForm1.sourceData, JSONForm1.formData, JSONForm1.fieldState)}}",
          "accessor": "academy_id",
          "borderRadius": "{{((sourceData, formData, fieldState) => ((appsmith.theme.borderRadius.appBorderRadius)))(JSONForm1.sourceData, JSONForm1.formData, JSONForm1.fieldState)}}",
          "boxShadow": "none",
          "children": {},
          "dataType": "string",
          "defaultValue": "{{((sourceData, formData, fieldState) => (sourceData.academy_id))(JSONForm1.sourceData, JSONForm1.formData, JSONForm1.fieldState)}}",
          "fieldType": "Text Input",
          "iconAlign": "left",
          "identifier": "academy_id",
          "isCustomField": false,
          "isDisabled": true,
          "isRequired": false,
          "isSpellCheck": false,
          "isVisible": true,
          "label": "Academy Id",
          "labelTextSize": "0.875rem",
          "originalIdentifier": "academy_id",
          "position": 16,
          "sourceData": "886d4d9d-c771-4f8a-93bd-afea158f46f3"
        },
        "academy_name": {
          "accentColor": "{{((sourceData, formData, fieldState) => ((appsmith.theme.colors.primaryColor)))(JSONForm1.sourceData, JSONForm1.formData, JSONForm1.fieldState)}}",
          "accessor": "academy_name",
          "borderRadius": "{{((sourceData, formData, fieldState) => ((appsmith.theme.borderRadius.appBorderRadius)))(JSONForm1.sourceData, JSONForm1.formData, JSONForm1.fieldState)}}",
          "boxShadow": "none",
          "children": {},
          "dataType": "string",
          "defaultValue": "{{((sourceData, formData, fieldState) => (sourceData.academy_name))(JSONForm1.sourceData, JSONForm1.formData, JSONForm1.fieldState)}}",
          "fieldType": "Text Input",
          "iconAlign": "left",
          "identifier": "academy_name",
          "isCustomField": false,
          "isDisabled": true,
          "isRequired": false,
          "isSpellCheck": false,
          "isVisible": true,
          "label": "Academia",
          "labelTextSize": "0.875rem",
          "originalIdentifier": "academy_name",
          "position": 2,
          "sourceData": "E Commerce"
        },
        "course_id": {
          "accentColor": "{{((sourceData, formData, fieldState) => (appsmith.theme.colors.primaryColor))(JSONForm1.sourceData, JSONForm1.formData, JSONForm1.fieldState)}}",
          "accessor": "course_id",
          "borderRadius": "{{((sourceData, formData, fieldState) => (appsmith.theme.borderRadius.appBorderRadius))(JSONForm1.sourceData, JSONForm1.formData, JSONForm1.fieldState)}}",
          "boxShadow": "none",
          "children": {},
          "dataType": "string",
          "defaultValue": "{{((sourceData, formData, fieldState) => (sourceData.course_id))(JSONForm1.sourceData, JSONForm1.formData, JSONForm1.fieldState)}}",
          "fieldType": "Text Input",
          "iconAlign": "left",
          "identifier": "course_id",
          "isCustomField": false,
          "isDisabled": true,
          "isRequired": false,
          "isSpellCheck": false,
          "isVisible": true,
          "label": "Course_id",
          "labelTextSize": "0.875rem",
          "originalIdentifier": "course_id",
          "position": 14,
          "sourceData": "9afcd7af-c205-4364-ac8b-db38356b01d2"
        },
        "course_title": {
          "accentColor": "{{((sourceData, formData, fieldState) => ((appsmith.theme.colors.primaryColor)))(JSONForm1.sourceData, JSONForm1.formData, JSONForm1.fieldState)}}",
          "accessor": "course_title",
          "borderRadius": "{{((sourceData, formData, fieldState) => ((appsmith.theme.borderRadius.appBorderRadius)))(JSONForm1.sourceData, JSONForm1.formData, JSONForm1.fieldState)}}",
          "boxShadow": "none",
          "children": {},
          "dataType": "string",
          "defaultValue": "{{((sourceData, formData, fieldState) => (sourceData.course_title))(JSONForm1.sourceData, JSONForm1.formData, JSONForm1.fieldState)}}",
          "fieldType": "Text Input",
          "iconAlign": "left",
          "identifier": "course_title",
          "isCustomField": false,
          "isDisabled": true,
          "isRequired": false,
          "isSpellCheck": false,
          "isVisible": true,
          "label": "Curso",
          "labelTextSize": "0.875rem",
          "originalIdentifier": "course_title",
          "position": 3,
          "sourceData": "Redes sociales: uso comercial"
        },
        "created_at": {
          "accentColor": "{{((sourceData, formData, fieldState) => (appsmith.theme.colors.primaryColor))(JSONForm1.sourceData, JSONForm1.formData, JSONForm1.fieldState)}}",
          "accessor": "created_at",
          "borderRadius": "{{((sourceData, formData, fieldState) => (appsmith.theme.borderRadius.appBorderRadius))(JSONForm1.sourceData, JSONForm1.formData, JSONForm1.fieldState)}}",
          "boxShadow": "none",
          "children": {},
          "dataType": "string",
          "defaultValue": "{{((sourceData, formData, fieldState) => (sourceData.created_at))(JSONForm1.sourceData, JSONForm1.formData, JSONForm1.fieldState)}}",
          "fieldType": "Text Input",
          "iconAlign": "left",
          "identifier": "created_at",
          "isCustomField": false,
          "isDisabled": false,
          "isRequired": false,
          "isSpellCheck": false,
          "isVisible": false,
          "label": "Created At",
          "labelTextSize": "0.875rem",
          "originalIdentifier": "created_at",
          "position": 5,
          "sourceData": ""
        },
        "deleted_at": {
          "accentColor": "{{((sourceData, formData, fieldState) => (appsmith.theme.colors.primaryColor))(JSONForm1.sourceData, JSONForm1.formData, JSONForm1.fieldState)}}",
          "accessor": "deleted_at",
          "borderRadius": "{{((sourceData, formData, fieldState) => (appsmith.theme.borderRadius.appBorderRadius))(JSONForm1.sourceData, JSONForm1.formData, JSONForm1.fieldState)}}",
          "boxShadow": "none",
          "children": {},
          "dataType": "string",
          "defaultValue": "{{((sourceData, formData, fieldState) => (sourceData.deleted_at))(JSONForm1.sourceData, JSONForm1.formData, JSONForm1.fieldState)}}",
          "fieldType": "Text Input",
          "iconAlign": "left",
          "identifier": "deleted_at",
          "isCustomField": false,
          "isDisabled": false,
          "isRequired": false,
          "isSpellCheck": false,
          "isVisible": false,
          "label": "Deleted At",
          "labelTextSize": "0.875rem",
          "originalIdentifier": "deleted_at",
          "position": 7,
          "sourceData": ""
        },
        "description": {
          "accentColor": "{{((sourceData, formData, fieldState) => (appsmith.theme.colors.primaryColor))(JSONForm1.sourceData, JSONForm1.formData, JSONForm1.fieldState)}}",
          "accessor": "description",
          "borderRadius": "{{((sourceData, formData, fieldState) => (appsmith.theme.borderRadius.appBorderRadius))(JSONForm1.sourceData, JSONForm1.formData, JSONForm1.fieldState)}}",
          "boxShadow": "none",
          "children": {},
          "dataType": "string",
          "defaultValue": "{{((sourceData, formData, fieldState) => (sourceData.description))(JSONForm1.sourceData, JSONForm1.formData, JSONForm1.fieldState)}}",
          "fieldType": "Text Input",
          "iconAlign": "left",
          "identifier": "description",
          "isCustomField": false,
          "isDisabled": false,
          "isRequired": false,
          "isSpellCheck": false,
          "isVisible": true,
          "label": "Description",
          "labelTextSize": "0.875rem",
          "originalIdentifier": "description",
          "position": 9,
          "sourceData": "es una prueba"
        },
        "end_date": {
          "accentColor": "{{((sourceData, formData, fieldState) => (appsmith.theme.colors.primaryColor))(JSONForm1.sourceData, JSONForm1.formData, JSONForm1.fieldState)}}",
          "accessor": "end_date",
          "borderRadius": "{{((sourceData, formData, fieldState) => (appsmith.theme.borderRadius.appBorderRadius))(JSONForm1.sourceData, JSONForm1.formData, JSONForm1.fieldState)}}",
          "boxShadow": "none",
          "children": {},
          "closeOnSelection": false,
          "convertToISO": false,
          "dataType": "string",
          "dateFormat": "YYYY-MM-DDTHH:mm:ss.sssZ",
          "defaultValue": "{{((sourceData, formData, fieldState) => (moment(sourceData.end_date, \"YYYY-MM-DDTHH:mm:ss.sssZ\").format(\"YYYY-MM-DDTHH:mm:ss.sssZ\")))(JSONForm1.sourceData, JSONForm1.formData, JSONForm1.fieldState)}}",
          "fieldType": "Datepicker",
          "identifier": "end_date",
          "isCustomField": false,
          "isDisabled": false,
          "isRequired": false,
          "isVisible": true,
          "label": "End Date",
          "labelTextSize": "0.875rem",
          "maxDate": "2121-12-31T18:29:00.000Z",
          "minDate": "1920-12-31T18:30:00.000Z",
          "originalIdentifier": "end_date",
          "position": 11,
          "shortcuts": false,
          "sourceData": "2023-03-22T00:00:00.000Z",
          "timePrecision": "minute"
        },
        "end_hour": {
          "accentColor": "{{((sourceData, formData, fieldState) => ((appsmith.theme.colors.primaryColor)))(JSONForm1.sourceData, JSONForm1.formData, JSONForm1.fieldState)}}",
          "accessor": "end_hour",
          "borderRadius": "{{((sourceData, formData, fieldState) => ((appsmith.theme.borderRadius.appBorderRadius)))(JSONForm1.sourceData, JSONForm1.formData, JSONForm1.fieldState)}}",
          "boxShadow": "none",
          "children": {},
          "dataType": "string",
          "defaultValue": "{{((sourceData, formData, fieldState) => (sourceData.end_hour))(JSONForm1.sourceData, JSONForm1.formData, JSONForm1.fieldState)}}",
          "fieldType": "Text Input",
          "iconAlign": "left",
          "identifier": "end_hour",
          "isCustomField": false,
          "isDisabled": false,
          "isRequired": false,
          "isSpellCheck": false,
          "isVisible": true,
          "label": "End Hour",
          "labelTextSize": "0.875rem",
          "originalIdentifier": "end_hour",
          "position": 13,
          "sourceData": ""
        },
        "id": {
          "accentColor": "{{((sourceData, formData, fieldState) => (appsmith.theme.colors.primaryColor))(JSONForm1.sourceData, JSONForm1.formData, JSONForm1.fieldState)}}",
          "accessor": "id",
          "borderRadius": "{{((sourceData, formData, fieldState) => (appsmith.theme.borderRadius.appBorderRadius))(JSONForm1.sourceData, JSONForm1.formData, JSONForm1.fieldState)}}",
          "boxShadow": "none",
          "children": {},
          "dataType": "string",
          "defaultValue": "{{((sourceData, formData, fieldState) => (sourceData.id))(JSONForm1.sourceData, JSONForm1.formData, JSONForm1.fieldState)}}",
          "fieldType": "Text Input",
          "iconAlign": "left",
          "identifier": "id",
          "isCustomField": false,
          "isDisabled": true,
          "isRequired": false,
          "isSpellCheck": false,
          "isVisible": true,
          "label": "Id",
          "labelTextSize": "0.875rem",
          "originalIdentifier": "id",
          "position": 0,
          "sourceData": ""
        },
        "institution_id": {
          "accentColor": "{{((sourceData, formData, fieldState) => ((appsmith.theme.colors.primaryColor)))(JSONForm1.sourceData, JSONForm1.formData, JSONForm1.fieldState)}}",
          "accessor": "institution_id",
          "borderRadius": "{{((sourceData, formData, fieldState) => ((appsmith.theme.borderRadius.appBorderRadius)))(JSONForm1.sourceData, JSONForm1.formData, JSONForm1.fieldState)}}",
          "boxShadow": "none",
          "children": {},
          "dataType": "string",
          "defaultValue": "{{((sourceData, formData, fieldState) => (sourceData.institution_id))(JSONForm1.sourceData, JSONForm1.formData, JSONForm1.fieldState)}}",
          "fieldType": "Text Input",
          "iconAlign": "left",
          "identifier": "institution_id",
          "isCustomField": false,
          "isDisabled": true,
          "isRequired": false,
          "isSpellCheck": false,
          "isVisible": true,
          "label": "Institution Id",
          "labelTextSize": "0.875rem",
          "originalIdentifier": "institution_id",
          "position": 16,
          "sourceData": "096fd9a0-f024-473e-9a32-3ba53cd14e1c"
        },
        "institution_name": {
          "accentColor": "{{((sourceData, formData, fieldState) => ((appsmith.theme.colors.primaryColor)))(JSONForm1.sourceData, JSONForm1.formData, JSONForm1.fieldState)}}",
          "accessor": "institution_name",
          "borderRadius": "{{((sourceData, formData, fieldState) => ((appsmith.theme.borderRadius.appBorderRadius)))(JSONForm1.sourceData, JSONForm1.formData, JSONForm1.fieldState)}}",
          "boxShadow": "none",
          "children": {},
          "dataType": "string",
          "defaultValue": "{{((sourceData, formData, fieldState) => (sourceData.institution_name))(JSONForm1.sourceData, JSONForm1.formData, JSONForm1.fieldState)}}",
          "fieldType": "Text Input",
          "iconAlign": "left",
          "identifier": "institution_name",
          "isCustomField": false,
          "isDisabled": true,
          "isRequired": false,
          "isSpellCheck": false,
          "isVisible": true,
          "label": "Institución",
          "labelTextSize": "0.875rem",
          "originalIdentifier": "institution_name",
          "position": 1,
          "sourceData": "ticmas"
        },
        "link_url": {
          "accentColor": "{{((sourceData, formData, fieldState) => (appsmith.theme.colors.primaryColor))(JSONForm1.sourceData, JSONForm1.formData, JSONForm1.fieldState)}}",
          "accessor": "link_url",
          "borderRadius": "{{((sourceData, formData, fieldState) => (appsmith.theme.borderRadius.appBorderRadius))(JSONForm1.sourceData, JSONForm1.formData, JSONForm1.fieldState)}}",
          "boxShadow": "none",
          "children": {},
          "dataType": "string",
          "defaultValue": "{{((sourceData, formData, fieldState) => (sourceData.link_url))(JSONForm1.sourceData, JSONForm1.formData, JSONForm1.fieldState)}}",
          "fieldType": "Text Input",
          "iconAlign": "left",
          "identifier": "link_url",
          "isCustomField": false,
          "isDisabled": false,
          "isRequired": false,
          "isSpellCheck": false,
          "isVisible": true,
          "label": "Link Url",
          "labelTextSize": "0.875rem",
          "originalIdentifier": "link_url",
          "position": 8,
          "sourceData": "http://link-prueba2.com"
        },
        "start_date": {
          "accentColor": "{{((sourceData, formData, fieldState) => (appsmith.theme.colors.primaryColor))(JSONForm1.sourceData, JSONForm1.formData, JSONForm1.fieldState)}}",
          "accessor": "start_date",
          "borderRadius": "{{((sourceData, formData, fieldState) => (appsmith.theme.borderRadius.appBorderRadius))(JSONForm1.sourceData, JSONForm1.formData, JSONForm1.fieldState)}}",
          "boxShadow": "none",
          "children": {},
          "closeOnSelection": false,
          "convertToISO": false,
          "dataType": "string",
          "dateFormat": "YYYY-MM-DDTHH:mm:ss.sssZ",
          "defaultValue": "{{((sourceData, formData, fieldState) => (moment(sourceData.start_date, \"YYYY-MM-DDTHH:mm:ss.sssZ\").format(\"YYYY-MM-DDTHH:mm:ss.sssZ\")))(JSONForm1.sourceData, JSONForm1.formData, JSONForm1.fieldState)}}",
          "fieldType": "Datepicker",
          "identifier": "start_date",
          "isCustomField": false,
          "isDisabled": false,
          "isRequired": false,
          "isVisible": true,
          "label": "Start Date",
          "labelTextSize": "0.875rem",
          "maxDate": "2121-12-31T18:29:00.000Z",
          "minDate": "1920-12-31T18:30:00.000Z",
          "originalIdentifier": "start_date",
          "position": 10,
          "shortcuts": false,
          "sourceData": "2023-03-15T00:00:00.000Z",
          "timePrecision": "minute"
        },
        "start_hour": {
          "accentColor": "{{((sourceData, formData, fieldState) => ((appsmith.theme.colors.primaryColor)))(JSONForm1.sourceData, JSONForm1.formData, JSONForm1.fieldState)}}",
          "accessor": "start_hour",
          "borderRadius": "{{((sourceData, formData, fieldState) => ((appsmith.theme.borderRadius.appBorderRadius)))(JSONForm1.sourceData, JSONForm1.formData, JSONForm1.fieldState)}}",
          "boxShadow": "none",
          "children": {},
          "dataType": "string",
          "defaultValue": "{{((sourceData, formData, fieldState) => (sourceData.start_hour))(JSONForm1.sourceData, JSONForm1.formData, JSONForm1.fieldState)}}",
          "fieldType": "Text Input",
          "iconAlign": "left",
          "identifier": "start_hour",
          "isCustomField": false,
          "isDisabled": false,
          "isRequired": false,
          "isSpellCheck": false,
          "isVisible": true,
          "label": "Start Hour",
          "labelTextSize": "0.875rem",
          "originalIdentifier": "start_hour",
          "position": 12,
          "sourceData": ""
        },
        "synchronous_meeting_title": {
          "accentColor": "{{((sourceData, formData, fieldState) => ((appsmith.theme.colors.primaryColor)))(JSONForm1.sourceData, JSONForm1.formData, JSONForm1.fieldState)}}",
          "accessor": "synchronous_meeting_title",
          "borderRadius": "{{((sourceData, formData, fieldState) => ((appsmith.theme.borderRadius.appBorderRadius)))(JSONForm1.sourceData, JSONForm1.formData, JSONForm1.fieldState)}}",
          "boxShadow": "none",
          "children": {},
          "dataType": "string",
          "defaultValue": "{{((sourceData, formData, fieldState) => (sourceData.synchronous_meeting_title))(JSONForm1.sourceData, JSONForm1.formData, JSONForm1.fieldState)}}",
          "fieldType": "Text Input",
          "iconAlign": "left",
          "identifier": "synchronous_meeting_title",
          "isCustomField": false,
          "isDisabled": false,
          "isRequired": false,
          "isSpellCheck": false,
          "isVisible": true,
          "label": "Título",
          "labelTextSize": "0.875rem",
          "originalIdentifier": "synchronous_meeting_title",
          "position": 4,
          "sourceData": "Reunion de prueba"
        },
        "updated_at": {
          "accentColor": "{{((sourceData, formData, fieldState) => (appsmith.theme.colors.primaryColor))(JSONForm1.sourceData, JSONForm1.formData, JSONForm1.fieldState)}}",
          "accessor": "updated_at",
          "borderRadius": "{{((sourceData, formData, fieldState) => (appsmith.theme.borderRadius.appBorderRadius))(JSONForm1.sourceData, JSONForm1.formData, JSONForm1.fieldState)}}",
          "boxShadow": "none",
          "children": {},
          "dataType": "string",
          "defaultValue": "{{((sourceData, formData, fieldState) => (sourceData.updated_at))(JSONForm1.sourceData, JSONForm1.formData, JSONForm1.fieldState)}}",
          "fieldType": "Text Input",
          "iconAlign": "left",
          "identifier": "updated_at",
          "isCustomField": false,
          "isDisabled": false,
          "isRequired": false,
          "isSpellCheck": false,
          "isVisible": false,
          "label": "Updated At",
          "labelTextSize": "0.875rem",
          "originalIdentifier": "updated_at",
          "position": 6,
          "sourceData": ""
        }
      },
      "dataType": "object",
      "defaultValue": "{{((sourceData, formData, fieldState) => (sourceData))(JSONForm1.sourceData, JSONForm1.formData, JSONForm1.fieldState)}}",
      "fieldType": "Object",
      "identifier": "__root_schema__",
      "isCustomField": false,
      "isDisabled": false,
      "isRequired": false,
      "isVisible": true,
      "label": "",
      "labelTextSize": "0.875rem",
      "originalIdentifier": "__root_schema__",
      "position": -1,
      "sourceData": {
        "date_of_birth": "20/02/1990",
        "employee_id": 1001,
        "name": "John"
      }
    }
  },
  "scrollContents": true,
  "showReset": false,
  "sourceData": "{{RS_list.triggeredRow}}",
  "submitButtonLabel": "Submit",
  "submitButtonStyles": {
    "borderRadius": "{{appsmith.theme.borderRadius.appBorderRadius}}",
    "boxShadow": "none",
    "buttonColor": "{{appsmith.theme.colors.primaryColor}}",
    "buttonVariant": "PRIMARY"
  },
  "title": "Form",
  "topRow": 6,
  "type": "JSON_FORM_WIDGET",
  "useSourceData": false,
  "version": 1,
  "widgetId": "j5gjm5u6ol",
  "widgetName": "JSONForm1"
}