{
  "animateLoading": true,
  "borderRadius": "{{appsmith.theme.borderRadius.appBorderRadius}}",
  "bottomRow": 98,
  "boxShadow": "none",
  "buttonColor": "{{appsmith.theme.colors.primaryColor}}",
  "buttonStyle": "PRIMARY",
  "buttonVariant": "SECONDARY",
  "disabledWhenInvalid": false,
  "displayName": "Button",
  "dynamicBindingPathList": [
    {
      "key": "buttonColor"
    },
    {
      "key": "borderRadius"
    }
  ],
  "dynamicPropertyPathList": [
    {
      "key": "onClick"
    }
  ],
  "dynamicTriggerPathList": [
    {
      "key": "onClick"
    }
  ],
  "hideCard": false,
  "iconSVG": "/static/media/icon.cca026338f1c8eb6df8ba03d084c2fca.svg",
  "isDefaultClickDisabled": true,
  "isDeprecated": false,
  "isDisabled": false,
  "isLoading": false,
  "isVisible": true,
  "key": "43fw7z856d",
  "leftColumn": 47,
  "onClick": "{{closeModal('Modal_actualizar_FAQ').then(() => faq_list_query.run())}}",
  "originalBottomRow": 98,
  "originalTopRow": 94,
  "parentId": "ccdaraxakm",
  "placement": "CENTER",
  "recaptchaType": "V3",
  "renderMode": "CANVAS",
  "resetFormOnClick": false,
  "rightColumn": 63,
  "searchTags": [
    "click",
    "submit"
  ],
  "text": "Close",
  "topRow": 94,
  "type": "BUTTON_WIDGET",
  "version": 1,
  "widgetId": "xiz92odb3q",
  "widgetName": "Button5"
}