{
  "accentColor": "{{appsmith.theme.colors.primaryColor}}",
  "animateLoading": true,
  "borderColor": "#E0DEDE",
  "borderRadius": "{{appsmith.theme.borderRadius.appBorderRadius}}",
  "borderWidth": "1",
  "bottomRow": 55,
  "boxShadow": "{{appsmith.theme.boxShadow.appBoxShadow}}",
  "canFreezeColumn": true,
  "childStylesheet": {
    "button": {
      "borderRadius": "{{appsmith.theme.borderRadius.appBorderRadius}}",
      "boxShadow": "none",
      "buttonColor": "{{appsmith.theme.colors.primaryColor}}"
    },
    "editActions": {
      "discardBorderRadius": "{{appsmith.theme.borderRadius.appBorderRadius}}",
      "discardButtonColor": "{{appsmith.theme.colors.primaryColor}}",
      "saveBorderRadius": "{{appsmith.theme.borderRadius.appBorderRadius}}",
      "saveButtonColor": "{{appsmith.theme.colors.primaryColor}}"
    },
    "iconButton": {
      "borderRadius": "{{appsmith.theme.borderRadius.appBorderRadius}}",
      "boxShadow": "none",
      "buttonColor": "{{appsmith.theme.colors.primaryColor}}"
    },
    "menuButton": {
      "borderRadius": "{{appsmith.theme.borderRadius.appBorderRadius}}",
      "boxShadow": "none",
      "menuColor": "{{appsmith.theme.colors.primaryColor}}"
    }
  },
  "columnOrder": [
    "name",
    "id",
    "created_at",
    "updated_at",
    "deleted_at",
    "logo_url",
    "url",
    "video_url",
    "assessment_disable",
    "credits_id",
    "disable_certificate",
    "help_center_enabled"
  ],
  "columnUpdatedAt": 1713806678893,
  "columnWidthMap": {
    "id": 353,
    "status": 85,
    "step": 70,
    "task": 245
  },
  "defaultPageSize": 0,
  "defaultSelectedRowIndex": 0,
  "defaultSelectedRowIndices": [
    0
  ],
  "delimiter": ",",
  "displayName": "Table",
  "dynamicBindingPathList": [
    {
      "key": "accentColor"
    },
    {
      "key": "borderRadius"
    },
    {
      "key": "boxShadow"
    },
    {
      "key": "tableData"
    },
    {
      "key": "primaryColumns.id.computedValue"
    },
    {
      "key": "primaryColumns.created_at.computedValue"
    },
    {
      "key": "primaryColumns.updated_at.computedValue"
    },
    {
      "key": "primaryColumns.deleted_at.computedValue"
    },
    {
      "key": "primaryColumns.name.computedValue"
    },
    {
      "key": "primaryColumns.logo_url.computedValue"
    },
    {
      "key": "primaryColumns.url.computedValue"
    },
    {
      "key": "primaryColumns.video_url.computedValue"
    },
    {
      "key": "primaryColumns.assessment_disable.computedValue"
    },
    {
      "key": "primaryColumns.credits_id.computedValue"
    },
    {
      "key": "primaryColumns.disable_certificate.computedValue"
    },
    {
      "key": "primaryColumns.help_center_enabled.computedValue"
    }
  ],
  "dynamicPropertyPathList": [
    {
      "key": "tableData"
    }
  ],
  "dynamicTriggerPathList": [],
  "enableClientSideSearch": true,
  "enableServerSideFiltering": false,
  "hideCard": false,
  "horizontalAlignment": "LEFT",
  "iconSVG": "/static/media/icon.db8a9cbd2acd22a31ea91cc37ea2a46c.svg",
  "inlineEditingSaveOption": "ROW_LEVEL",
  "isDeprecated": false,
  "isLoading": false,
  "isSortable": true,
  "isVisible": true,
  "isVisibleDownload": true,
  "isVisibleFilters": true,
  "isVisiblePagination": true,
  "isVisibleSearch": true,
  "key": "6djv27vwiz",
  "label": "Data",
  "leftColumn": 2,
  "needsHeightForContent": true,
  "parentColumnSpace": 19,
  "parentId": "0",
  "parentRowSpace": 10,
  "primaryColumns": {
    "assessment_disable": {
      "alias": "assessment_disable",
      "allowCellWrapping": false,
      "cellBackground": "",
      "columnType": "checkbox",
      "computedValue": "{{institutions_table.processedTableData.map((currentRow, currentIndex) => ( currentRow[\"assessment_disable\"]))}}",
      "enableFilter": true,
      "enableSort": true,
      "fontStyle": "",
      "horizontalAlignment": "LEFT",
      "id": "assessment_disable",
      "index": 8,
      "isCellEditable": false,
      "isCellVisible": true,
      "isDerived": false,
      "isDisabled": false,
      "isDiscardVisible": true,
      "isEditable": false,
      "isSaveVisible": true,
      "isVisible": false,
      "label": "assessment_disable",
      "originalId": "assessment_disable",
      "sticky": "",
      "textColor": "",
      "textSize": "0.875rem",
      "validation": {},
      "verticalAlignment": "CENTER",
      "width": 150
    },
    "created_at": {
      "alias": "created_at",
      "allowCellWrapping": false,
      "cellBackground": "",
      "columnType": "date",
      "computedValue": "{{institutions_table.processedTableData.map((currentRow, currentIndex) => ( currentRow[\"created_at\"]))}}",
      "enableFilter": true,
      "enableSort": true,
      "fontStyle": "",
      "horizontalAlignment": "LEFT",
      "id": "created_at",
      "index": 1,
      "isCellEditable": false,
      "isCellVisible": true,
      "isDerived": false,
      "isDisabled": false,
      "isDiscardVisible": true,
      "isEditable": false,
      "isSaveVisible": true,
      "isVisible": false,
      "label": "created_at",
      "originalId": "created_at",
      "sticky": "",
      "textColor": "",
      "textSize": "0.875rem",
      "validation": {},
      "verticalAlignment": "CENTER",
      "width": 150
    },
    "credits_id": {
      "alias": "credits_id",
      "allowCellWrapping": false,
      "allowSameOptionsInNewRow": true,
      "cellBackground": "",
      "columnType": "text",
      "computedValue": "{{institutions_table.processedTableData.map((currentRow, currentIndex) => ( currentRow[\"credits_id\"]))}}",
      "currencyCode": "USD",
      "decimals": 0,
      "enableFilter": true,
      "enableSort": true,
      "fontStyle": "",
      "horizontalAlignment": "LEFT",
      "id": "credits_id",
      "index": 9,
      "isCellEditable": false,
      "isCellVisible": true,
      "isDerived": false,
      "isDisabled": false,
      "isDiscardVisible": true,
      "isEditable": false,
      "isSaveVisible": true,
      "isVisible": true,
      "label": "credits_id",
      "notation": "standard",
      "originalId": "credits_id",
      "sticky": "",
      "textColor": "",
      "textSize": "0.875rem",
      "thousandSeparator": true,
      "validation": {},
      "verticalAlignment": "CENTER",
      "width": 150
    },
    "deleted_at": {
      "alias": "deleted_at",
      "allowCellWrapping": false,
      "cellBackground": "",
      "columnType": "text",
      "computedValue": "{{institutions_table.processedTableData.map((currentRow, currentIndex) => ( currentRow[\"deleted_at\"]))}}",
      "enableFilter": true,
      "enableSort": true,
      "fontStyle": "",
      "horizontalAlignment": "LEFT",
      "id": "deleted_at",
      "index": 3,
      "isCellEditable": false,
      "isCellVisible": true,
      "isDerived": false,
      "isDisabled": false,
      "isDiscardVisible": true,
      "isEditable": false,
      "isSaveVisible": true,
      "isVisible": false,
      "label": "deleted_at",
      "originalId": "deleted_at",
      "sticky": "",
      "textColor": "",
      "textSize": "0.875rem",
      "validation": {},
      "verticalAlignment": "CENTER",
      "width": 150
    },
    "disable_certificate": {
      "alias": "disable_certificate",
      "allowCellWrapping": false,
      "allowSameOptionsInNewRow": true,
      "cellBackground": "",
      "columnType": "text",
      "computedValue": "{{institutions_table.processedTableData.map((currentRow, currentIndex) => ( currentRow[\"disable_certificate\"]))}}",
      "currencyCode": "USD",
      "decimals": 0,
      "enableFilter": true,
      "enableSort": true,
      "fontStyle": "",
      "horizontalAlignment": "LEFT",
      "id": "disable_certificate",
      "index": 10,
      "isCellEditable": false,
      "isCellVisible": true,
      "isDerived": false,
      "isDisabled": false,
      "isDiscardVisible": true,
      "isEditable": false,
      "isSaveVisible": true,
      "isVisible": true,
      "label": "disable_certificate",
      "notation": "standard",
      "originalId": "disable_certificate",
      "sticky": "",
      "textColor": "",
      "textSize": "0.875rem",
      "thousandSeparator": true,
      "validation": {},
      "verticalAlignment": "CENTER",
      "width": 150
    },
    "help_center_enabled": {
      "alias": "help_center_enabled",
      "allowCellWrapping": false,
      "allowSameOptionsInNewRow": true,
      "cellBackground": "",
      "columnType": "checkbox",
      "computedValue": "{{institutions_table.processedTableData.map((currentRow, currentIndex) => ( currentRow[\"help_center_enabled\"]))}}",
      "currencyCode": "USD",
      "decimals": 0,
      "enableFilter": true,
      "enableSort": true,
      "fontStyle": "",
      "horizontalAlignment": "LEFT",
      "id": "help_center_enabled",
      "index": 11,
      "isCellEditable": false,
      "isCellVisible": true,
      "isDerived": false,
      "isDisabled": false,
      "isDiscardVisible": true,
      "isEditable": false,
      "isSaveVisible": true,
      "isVisible": true,
      "label": "help_center_enabled",
      "notation": "standard",
      "originalId": "help_center_enabled",
      "sticky": "",
      "textColor": "",
      "textSize": "0.875rem",
      "thousandSeparator": true,
      "validation": {},
      "verticalAlignment": "CENTER",
      "width": 150
    },
    "id": {
      "alias": "id",
      "allowCellWrapping": false,
      "cellBackground": "",
      "columnType": "text",
      "computedValue": "{{institutions_table.processedTableData.map((currentRow, currentIndex) => ( currentRow[\"id\"]))}}",
      "enableFilter": true,
      "enableSort": true,
      "fontStyle": "",
      "horizontalAlignment": "LEFT",
      "id": "id",
      "index": 0,
      "isCellEditable": false,
      "isCellVisible": true,
      "isDerived": false,
      "isDisabled": false,
      "isDiscardVisible": true,
      "isEditable": false,
      "isSaveVisible": true,
      "isVisible": false,
      "label": "id",
      "originalId": "id",
      "sticky": "",
      "textColor": "",
      "textSize": "0.875rem",
      "validation": {},
      "verticalAlignment": "CENTER",
      "width": 150
    },
    "logo_url": {
      "alias": "logo_url",
      "allowCellWrapping": false,
      "cellBackground": "",
      "columnType": "text",
      "computedValue": "{{institutions_table.processedTableData.map((currentRow, currentIndex) => ( currentRow[\"logo_url\"]))}}",
      "enableFilter": true,
      "enableSort": true,
      "fontStyle": "",
      "horizontalAlignment": "LEFT",
      "id": "logo_url",
      "index": 5,
      "isCellEditable": false,
      "isCellVisible": true,
      "isDerived": false,
      "isDisabled": false,
      "isDiscardVisible": true,
      "isEditable": false,
      "isSaveVisible": true,
      "isVisible": false,
      "label": "logo_url",
      "originalId": "logo_url",
      "sticky": "",
      "textColor": "",
      "textSize": "0.875rem",
      "validation": {},
      "verticalAlignment": "CENTER",
      "width": 150
    },
    "name": {
      "alias": "name",
      "allowCellWrapping": false,
      "cellBackground": "",
      "columnType": "text",
      "computedValue": "{{institutions_table.processedTableData.map((currentRow, currentIndex) => ( currentRow[\"name\"]))}}",
      "enableFilter": true,
      "enableSort": true,
      "fontStyle": "",
      "horizontalAlignment": "LEFT",
      "id": "name",
      "index": 4,
      "isCellEditable": false,
      "isCellVisible": true,
      "isDerived": false,
      "isDisabled": false,
      "isDiscardVisible": true,
      "isEditable": false,
      "isSaveVisible": true,
      "isVisible": true,
      "label": "Nombre",
      "originalId": "name",
      "sticky": "",
      "textColor": "",
      "textSize": "0.875rem",
      "validation": {},
      "verticalAlignment": "CENTER",
      "width": 150
    },
    "updated_at": {
      "alias": "updated_at",
      "allowCellWrapping": false,
      "cellBackground": "",
      "columnType": "date",
      "computedValue": "{{institutions_table.processedTableData.map((currentRow, currentIndex) => ( currentRow[\"updated_at\"]))}}",
      "enableFilter": true,
      "enableSort": true,
      "fontStyle": "",
      "horizontalAlignment": "LEFT",
      "id": "updated_at",
      "index": 2,
      "isCellEditable": false,
      "isCellVisible": true,
      "isDerived": false,
      "isDisabled": false,
      "isDiscardVisible": true,
      "isEditable": false,
      "isSaveVisible": true,
      "isVisible": false,
      "label": "updated_at",
      "originalId": "updated_at",
      "sticky": "",
      "textColor": "",
      "textSize": "0.875rem",
      "validation": {},
      "verticalAlignment": "CENTER",
      "width": 150
    },
    "url": {
      "alias": "url",
      "allowCellWrapping": false,
      "cellBackground": "",
      "columnType": "text",
      "computedValue": "{{institutions_table.processedTableData.map((currentRow, currentIndex) => ( currentRow[\"url\"]))}}",
      "enableFilter": true,
      "enableSort": true,
      "fontStyle": "",
      "horizontalAlignment": "LEFT",
      "id": "url",
      "index": 6,
      "isCellEditable": false,
      "isCellVisible": true,
      "isDerived": false,
      "isDisabled": false,
      "isDiscardVisible": true,
      "isEditable": false,
      "isSaveVisible": true,
      "isVisible": false,
      "label": "url",
      "originalId": "url",
      "sticky": "",
      "textColor": "",
      "textSize": "0.875rem",
      "validation": {},
      "verticalAlignment": "CENTER",
      "width": 150
    },
    "video_url": {
      "alias": "video_url",
      "allowCellWrapping": false,
      "cellBackground": "",
      "columnType": "text",
      "computedValue": "{{institutions_table.processedTableData.map((currentRow, currentIndex) => ( currentRow[\"video_url\"]))}}",
      "enableFilter": true,
      "enableSort": true,
      "fontStyle": "",
      "horizontalAlignment": "LEFT",
      "id": "video_url",
      "index": 7,
      "isCellEditable": false,
      "isCellVisible": true,
      "isDerived": false,
      "isDisabled": false,
      "isDiscardVisible": true,
      "isEditable": false,
      "isSaveVisible": true,
      "isVisible": false,
      "label": "video_url",
      "originalId": "video_url",
      "sticky": "",
      "textColor": "",
      "textSize": "0.875rem",
      "validation": {},
      "verticalAlignment": "CENTER",
      "width": 150
    }
  },
  "renderMode": "CANVAS",
  "rightColumn": 41,
  "searchKey": "",
  "tableData": "{{institution_list.data.data}}",
  "textSize": "0.875rem",
  "topRow": 6,
  "totalRecordsCount": 0,
  "type": "TABLE_WIDGET_V2",
  "version": 1,
  "verticalAlignment": "CENTER",
  "widgetId": "sihkxsd0my",
  "widgetName": "institutions_table"
}