{
  "appIsExample": false,
  "appLayout": {
    "type": "FLUID"
  },
  "applicationDetail": {
    "themeSetting": {
      "appMaxWidth": "LARGE",
      "density": 1.0,
      "sizing": 1.0
    }
  },
  "applicationVersion": 2,
  "color": "#C7F3E3",
  "evaluationVersion": 2,
  "icon": "help",
  "pages": [
    {
      "id": "Crear Help Center",
      "isDefault": true
    },
    {
      "id": "Help Center Sections",
      "isDefault": false
    },
    {
      "id": "Help Center FAQs",
      "isDefault": false
    },
    {
      "id": "Crear Help Center Videos",
      "isDefault": false
    },
    {
      "id": "Reuniones sincrónicas ",
      "isDefault": false
    }
  ],
  "unpublishedAppLayout": {
    "type": "FLUID"
  },
  "unpublishedApplicationDetail": {
    "themeSetting": {
      "appMaxWidth": "LARGE",
      "density": 1.0,
      "sizing": 1.0
    }
  }
}