{
  "animateLoading": true,
  "autoGenerateForm": true,
  "backgroundColor": "#fff",
  "borderColor": "#E0DEDE",
  "borderRadius": "{{appsmith.theme.borderRadius.appBorderRadius}}",
  "borderWidth": "1",
  "bottomRow": 91,
  "boxShadow": "{{appsmith.theme.boxShadow.appBoxShadow}}",
  "childStylesheet": {
    "ARRAY": {
      "accentColor": "{{appsmith.theme.colors.primaryColor}}",
      "borderRadius": "{{appsmith.theme.borderRadius.appBorderRadius}}",
      "boxShadow": "none",
      "cellBorderRadius": "{{appsmith.theme.borderRadius.appBorderRadius}}",
      "cellBoxShadow": "none"
    },
    "CHECKBOX": {
      "accentColor": "{{appsmith.theme.colors.primaryColor}}",
      "borderRadius": "{{appsmith.theme.borderRadius.appBorderRadius}}"
    },
    "CURRENCY_INPUT": {
      "accentColor": "{{appsmith.theme.colors.primaryColor}}",
      "borderRadius": "{{appsmith.theme.borderRadius.appBorderRadius}}",
      "boxShadow": "none"
    },
    "DATEPICKER": {
      "accentColor": "{{appsmith.theme.colors.primaryColor}}",
      "borderRadius": "{{appsmith.theme.borderRadius.appBorderRadius}}",
      "boxShadow": "none"
    },
    "EMAIL_INPUT": {
      "accentColor": "{{appsmith.theme.colors.primaryColor}}",
      "borderRadius": "{{appsmith.theme.borderRadius.appBorderRadius}}",
      "boxShadow": "none"
    },
    "MULTILINE_TEXT_INPUT": {
      "accentColor": "{{appsmith.theme.colors.primaryColor}}",
      "borderRadius": "{{appsmith.theme.borderRadius.appBorderRadius}}",
      "boxShadow": "none"
    },
    "MULTISELECT": {
      "accentColor": "{{appsmith.theme.colors.primaryColor}}",
      "borderRadius": "{{appsmith.theme.borderRadius.appBorderRadius}}",
      "boxShadow": "none"
    },
    "NUMBER_INPUT": {
      "accentColor": "{{appsmith.theme.colors.primaryColor}}",
      "borderRadius": "{{appsmith.theme.borderRadius.appBorderRadius}}",
      "boxShadow": "none"
    },
    "OBJECT": {
      "borderRadius": "{{appsmith.theme.borderRadius.appBorderRadius}}",
      "boxShadow": "none",
      "cellBorderRadius": "{{appsmith.theme.borderRadius.appBorderRadius}}",
      "cellBoxShadow": "none"
    },
    "PASSWORD_INPUT": {
      "accentColor": "{{appsmith.theme.colors.primaryColor}}",
      "borderRadius": "{{appsmith.theme.borderRadius.appBorderRadius}}",
      "boxShadow": "none"
    },
    "PHONE_NUMBER_INPUT": {
      "accentColor": "{{appsmith.theme.colors.primaryColor}}",
      "borderRadius": "{{appsmith.theme.borderRadius.appBorderRadius}}",
      "boxShadow": "none"
    },
    "RADIO_GROUP": {
      "accentColor": "{{appsmith.theme.colors.primaryColor}}",
      "boxShadow": "none"
    },
    "SELECT": {
      "accentColor": "{{appsmith.theme.colors.primaryColor}}",
      "borderRadius": "{{appsmith.theme.borderRadius.appBorderRadius}}",
      "boxShadow": "none"
    },
    "SWITCH": {
      "accentColor": "{{appsmith.theme.colors.primaryColor}}",
      "boxShadow": "none"
    },
    "TEXT_INPUT": {
      "accentColor": "{{appsmith.theme.colors.primaryColor}}",
      "borderRadius": "{{appsmith.theme.borderRadius.appBorderRadius}}",
      "boxShadow": "none"
    }
  },
  "disabledWhenInvalid": true,
  "displayName": "JSON Form",
  "dynamicBindingPathList": [
    {
      "key": "borderRadius"
    },
    {
      "key": "boxShadow"
    },
    {
      "key": "submitButtonStyles.buttonColor"
    },
    {
      "key": "submitButtonStyles.borderRadius"
    },
    {
      "key": "resetButtonStyles.buttonColor"
    },
    {
      "key": "resetButtonStyles.borderRadius"
    },
    {
      "key": "schema.__root_schema__.defaultValue"
    },
    {
      "key": "schema.__root_schema__.borderRadius"
    },
    {
      "key": "schema.__root_schema__.cellBorderRadius"
    },
    {
      "key": "sourceData"
    },
    {
      "key": "schema.__root_schema__.children.help_center_id.accentColor"
    },
    {
      "key": "schema.__root_schema__.children.help_center_id.borderRadius"
    },
    {
      "key": "schema.__root_schema__.children.order.defaultValue"
    },
    {
      "key": "schema.__root_schema__.children.order.accentColor"
    },
    {
      "key": "schema.__root_schema__.children.order.borderRadius"
    },
    {
      "key": "schema.__root_schema__.children.institution_name.defaultValue"
    },
    {
      "key": "schema.__root_schema__.children.institution_name.accentColor"
    },
    {
      "key": "schema.__root_schema__.children.institution_name.borderRadius"
    },
    {
      "key": "schema.__root_schema__.children.role.defaultValue"
    },
    {
      "key": "schema.__root_schema__.children.role.accentColor"
    },
    {
      "key": "schema.__root_schema__.children.role.borderRadius"
    },
    {
      "key": "schema.__root_schema__.children.help_center_id.defaultValue"
    },
    {
      "key": "schema.__root_schema__.children.id.defaultValue"
    },
    {
      "key": "schema.__root_schema__.children.id.accentColor"
    },
    {
      "key": "schema.__root_schema__.children.id.borderRadius"
    },
    {
      "key": "schema.__root_schema__.children.ask.defaultValue"
    },
    {
      "key": "schema.__root_schema__.children.ask.accentColor"
    },
    {
      "key": "schema.__root_schema__.children.ask.borderRadius"
    },
    {
      "key": "schema.__root_schema__.children.answer.defaultValue"
    },
    {
      "key": "schema.__root_schema__.children.answer.accentColor"
    },
    {
      "key": "schema.__root_schema__.children.answer.borderRadius"
    },
    {
      "key": "schema.__root_schema__.children.help_center_section_id.defaultValue"
    },
    {
      "key": "schema.__root_schema__.children.help_center_section_id.accentColor"
    },
    {
      "key": "schema.__root_schema__.children.help_center_section_id.borderRadius"
    },
    {
      "key": "schema.__root_schema__.children.help_center_section_title.defaultValue"
    },
    {
      "key": "schema.__root_schema__.children.help_center_section_title.accentColor"
    },
    {
      "key": "schema.__root_schema__.children.help_center_section_title.borderRadius"
    },
    {
      "key": "schema.__root_schema__.children.help_center_section_title.options"
    }
  ],
  "dynamicHeight": "AUTO_HEIGHT",
  "dynamicPropertyPathList": [
    {
      "key": "onSubmit"
    }
  ],
  "dynamicTriggerPathList": [
    {
      "key": "onSubmit"
    }
  ],
  "fieldLimitExceeded": false,
  "fixedFooter": true,
  "hideCard": false,
  "iconSVG": "/static/media/icon.5b428de12db9ad6a591955ead07f86e9.svg",
  "isDeprecated": false,
  "isLoading": false,
  "isVisible": true,
  "key": "qegq05n7c8",
  "leftColumn": 1,
  "maxDynamicHeight": 9000,
  "minDynamicHeight": 4,
  "onSubmit": "{{\nhelp_center_FAQS_update.run().then(() => {\n  showAlert('FAQ actualizada', 'success');\nreturn closeModal('Modal_actualizar_FAQ');\t\n}).then(()=>{faq_list_query.run()}).catch(() => {\n  showAlert('No se pudo actualizar la FAQ', 'error');\n});\n}}",
  "originalBottomRow": 91,
  "originalTopRow": 6,
  "parentColumnSpace": 14.53125,
  "parentId": "ccdaraxakm",
  "parentRowSpace": 10,
  "renderMode": "CANVAS",
  "resetButtonLabel": "Reset",
  "resetButtonStyles": {
    "borderRadius": "{{appsmith.theme.borderRadius.appBorderRadius}}",
    "boxShadow": "none",
    "buttonColor": "{{appsmith.theme.colors.primaryColor}}",
    "buttonVariant": "SECONDARY"
  },
  "rightColumn": 63,
  "schema": {
    "__root_schema__": {
      "accessor": "__root_schema__",
      "borderRadius": "{{((sourceData, formData, fieldState) => (appsmith.theme.borderRadius.appBorderRadius))(JSONForm1.sourceData, JSONForm1.formData, JSONForm1.fieldState)}}",
      "boxShadow": "none",
      "cellBorderRadius": "{{((sourceData, formData, fieldState) => (appsmith.theme.borderRadius.appBorderRadius))(JSONForm1.sourceData, JSONForm1.formData, JSONForm1.fieldState)}}",
      "cellBoxShadow": "none",
      "children": {
        "answer": {
          "accentColor": "{{((sourceData, formData, fieldState) => ((appsmith.theme.colors.primaryColor)))(JSONForm1.sourceData, JSONForm1.formData, JSONForm1.fieldState)}}",
          "accessor": "answer",
          "borderRadius": "{{((sourceData, formData, fieldState) => ((appsmith.theme.borderRadius.appBorderRadius)))(JSONForm1.sourceData, JSONForm1.formData, JSONForm1.fieldState)}}",
          "boxShadow": "none",
          "children": {},
          "dataType": "string",
          "defaultValue": "{{((sourceData, formData, fieldState) => (sourceData.answer))(JSONForm1.sourceData, JSONForm1.formData, JSONForm1.fieldState)}}",
          "fieldType": "Text Input",
          "iconAlign": "left",
          "identifier": "answer",
          "isCustomField": false,
          "isDisabled": false,
          "isRequired": true,
          "isSpellCheck": false,
          "isVisible": true,
          "label": "Respuesta",
          "labelTextSize": "0.875rem",
          "originalIdentifier": "answer",
          "position": 7,
          "sourceData": ""
        },
        "ask": {
          "accentColor": "{{((sourceData, formData, fieldState) => ((appsmith.theme.colors.primaryColor)))(JSONForm1.sourceData, JSONForm1.formData, JSONForm1.fieldState)}}",
          "accessor": "ask",
          "borderRadius": "{{((sourceData, formData, fieldState) => ((appsmith.theme.borderRadius.appBorderRadius)))(JSONForm1.sourceData, JSONForm1.formData, JSONForm1.fieldState)}}",
          "boxShadow": "none",
          "children": {},
          "dataType": "string",
          "defaultValue": "{{((sourceData, formData, fieldState) => (sourceData.ask))(JSONForm1.sourceData, JSONForm1.formData, JSONForm1.fieldState)}}",
          "fieldType": "Text Input",
          "iconAlign": "left",
          "identifier": "ask",
          "isCustomField": false,
          "isDisabled": false,
          "isRequired": true,
          "isSpellCheck": false,
          "isVisible": true,
          "label": "Pregunta",
          "labelTextSize": "0.875rem",
          "originalIdentifier": "ask",
          "position": 6,
          "sourceData": ""
        },
        "help_center_id": {
          "accentColor": "{{((sourceData, formData, fieldState) => ((appsmith.theme.colors.primaryColor)))(JSONForm1.sourceData, JSONForm1.formData, JSONForm1.fieldState)}}",
          "accessor": "help_center_id",
          "borderRadius": "{{((sourceData, formData, fieldState) => ((appsmith.theme.borderRadius.appBorderRadius)))(JSONForm1.sourceData, JSONForm1.formData, JSONForm1.fieldState)}}",
          "boxShadow": "none",
          "children": {},
          "dataType": "string",
          "defaultValue": "{{((sourceData, formData, fieldState) => (sourceData.help_center_id))(JSONForm1.sourceData, JSONForm1.formData, JSONForm1.fieldState)}}",
          "fieldType": "Text Input",
          "iconAlign": "left",
          "identifier": "help_center_id",
          "isCustomField": false,
          "isDisabled": true,
          "isRequired": false,
          "isSpellCheck": false,
          "isVisible": true,
          "label": "Help Center ID",
          "labelTextSize": "0.875rem",
          "originalIdentifier": "help_center_id",
          "position": 1,
          "sourceData": ""
        },
        "help_center_section_id": {
          "accentColor": "{{((sourceData, formData, fieldState) => ((appsmith.theme.colors.primaryColor)))(JSONForm1.sourceData, JSONForm1.formData, JSONForm1.fieldState)}}",
          "accessor": "help_center_section_id",
          "borderRadius": "{{((sourceData, formData, fieldState) => ((appsmith.theme.borderRadius.appBorderRadius)))(JSONForm1.sourceData, JSONForm1.formData, JSONForm1.fieldState)}}",
          "boxShadow": "none",
          "children": {},
          "dataType": "string",
          "defaultValue": "{{((sourceData, formData, fieldState) => (sourceData.help_center_section_id))(JSONForm1.sourceData, JSONForm1.formData, JSONForm1.fieldState)}}",
          "fieldType": "Text Input",
          "iconAlign": "left",
          "identifier": "help_center_section_id",
          "isCustomField": false,
          "isDisabled": true,
          "isRequired": false,
          "isSpellCheck": false,
          "isVisible": true,
          "label": "Help Center Section Id",
          "labelTextSize": "0.875rem",
          "originalIdentifier": "help_center_section_id",
          "position": 4,
          "sourceData": ""
        },
        "help_center_section_title": {
          "accentColor": "{{((sourceData, formData, fieldState) => ((appsmith.theme.colors.primaryColor)))(JSONForm1.sourceData, JSONForm1.formData, JSONForm1.fieldState)}}",
          "accessor": "help_center_section_title",
          "borderRadius": "{{((sourceData, formData, fieldState) => ((appsmith.theme.borderRadius.appBorderRadius)))(JSONForm1.sourceData, JSONForm1.formData, JSONForm1.fieldState)}}",
          "boxShadow": "none",
          "children": {},
          "dataType": "string",
          "defaultValue": "{{((sourceData, formData, fieldState) => (sourceData.help_center_section_title))(JSONForm1.sourceData, JSONForm1.formData, JSONForm1.fieldState)}}",
          "fieldType": "Select",
          "identifier": "help_center_section_title",
          "isCustomField": false,
          "isDisabled": false,
          "isFilterable": false,
          "isRequired": false,
          "isVisible": true,
          "label": "Título de sección",
          "labelTextSize": "0.875rem",
          "options": "{{\nGet_Sections.data.data.filter(({ help_center_id }) => help_center_id === FAQ_Form.formData.help_center_id).map(({ title, id }) => ({\n\tlabel: title,\n\tvalue: id\n}))\n}}",
          "originalIdentifier": "help_center_section_title",
          "position": 5,
          "serverSideFiltering": false,
          "sourceData": "prueba seccion"
        },
        "id": {
          "accentColor": "{{((sourceData, formData, fieldState) => ((appsmith.theme.colors.primaryColor)))(JSONForm1.sourceData, JSONForm1.formData, JSONForm1.fieldState)}}",
          "accessor": "id",
          "borderRadius": "{{((sourceData, formData, fieldState) => ((appsmith.theme.borderRadius.appBorderRadius)))(JSONForm1.sourceData, JSONForm1.formData, JSONForm1.fieldState)}}",
          "boxShadow": "none",
          "children": {},
          "dataType": "string",
          "defaultValue": "{{((sourceData, formData, fieldState) => (sourceData.id))(JSONForm1.sourceData, JSONForm1.formData, JSONForm1.fieldState)}}",
          "fieldType": "Text Input",
          "iconAlign": "left",
          "identifier": "id",
          "isCustomField": false,
          "isDisabled": true,
          "isRequired": false,
          "isSpellCheck": false,
          "isVisible": true,
          "label": "Id",
          "labelTextSize": "0.875rem",
          "originalIdentifier": "id",
          "position": 3,
          "sourceData": ""
        },
        "institution_name": {
          "accentColor": "{{((sourceData, formData, fieldState) => ((appsmith.theme.colors.primaryColor)))(JSONForm1.sourceData, JSONForm1.formData, JSONForm1.fieldState)}}",
          "accessor": "institution_name",
          "borderRadius": "{{((sourceData, formData, fieldState) => ((appsmith.theme.borderRadius.appBorderRadius)))(JSONForm1.sourceData, JSONForm1.formData, JSONForm1.fieldState)}}",
          "boxShadow": "none",
          "children": {},
          "dataType": "string",
          "defaultValue": "{{((sourceData, formData, fieldState) => (sourceData.institution_name))(JSONForm1.sourceData, JSONForm1.formData, JSONForm1.fieldState)}}",
          "fieldType": "Text Input",
          "iconAlign": "left",
          "identifier": "institution_name",
          "isCustomField": false,
          "isDisabled": true,
          "isRequired": false,
          "isSpellCheck": false,
          "isVisible": true,
          "label": "Institución",
          "labelTextSize": "0.875rem",
          "originalIdentifier": "institution_name",
          "position": 0,
          "sourceData": "Prueba"
        },
        "order": {
          "accentColor": "{{((sourceData, formData, fieldState) => ((appsmith.theme.colors.primaryColor)))(JSONForm1.sourceData, JSONForm1.formData, JSONForm1.fieldState)}}",
          "accessor": "order",
          "borderRadius": "{{((sourceData, formData, fieldState) => ((appsmith.theme.borderRadius.appBorderRadius)))(JSONForm1.sourceData, JSONForm1.formData, JSONForm1.fieldState)}}",
          "boxShadow": "none",
          "children": {},
          "dataType": "null",
          "defaultValue": "{{((sourceData, formData, fieldState) => (sourceData.order))(JSONForm1.sourceData, JSONForm1.formData, JSONForm1.fieldState)}}",
          "fieldType": "Number Input",
          "iconAlign": "left",
          "identifier": "order",
          "isCustomField": false,
          "isDisabled": false,
          "isRequired": true,
          "isSpellCheck": false,
          "isVisible": true,
          "label": "Orden",
          "labelTextSize": "0.875rem",
          "maxNum": "1000",
          "minNum": "0",
          "originalIdentifier": "order",
          "position": 8
        },
        "role": {
          "accentColor": "{{((sourceData, formData, fieldState) => ((appsmith.theme.colors.primaryColor)))(JSONForm1.sourceData, JSONForm1.formData, JSONForm1.fieldState)}}",
          "accessor": "role",
          "borderRadius": "{{((sourceData, formData, fieldState) => ((appsmith.theme.borderRadius.appBorderRadius)))(JSONForm1.sourceData, JSONForm1.formData, JSONForm1.fieldState)}}",
          "boxShadow": "none",
          "children": {},
          "dataType": "string",
          "defaultValue": "{{((sourceData, formData, fieldState) => (sourceData.role))(JSONForm1.sourceData, JSONForm1.formData, JSONForm1.fieldState)}}",
          "fieldType": "Text Input",
          "iconAlign": "left",
          "identifier": "role",
          "isCustomField": false,
          "isDisabled": true,
          "isRequired": false,
          "isSpellCheck": false,
          "isVisible": true,
          "label": "Rol",
          "labelTextSize": "0.875rem",
          "originalIdentifier": "role",
          "position": 2,
          "sourceData": "STUDENT"
        }
      },
      "dataType": "object",
      "defaultValue": "{{((sourceData, formData, fieldState) => (sourceData))(JSONForm1.sourceData, JSONForm1.formData, JSONForm1.fieldState)}}",
      "fieldType": "Object",
      "identifier": "__root_schema__",
      "isCustomField": false,
      "isDisabled": false,
      "isRequired": false,
      "isVisible": true,
      "label": "",
      "labelTextSize": "0.875rem",
      "originalIdentifier": "__root_schema__",
      "position": -1,
      "sourceData": {
        "date_of_birth": "20/02/1990",
        "employee_id": 1001,
        "name": "John"
      }
    }
  },
  "scrollContents": true,
  "showReset": false,
  "sourceData": "{{Table_FAQ_list.triggeredRow}}",
  "submitButtonLabel": "Submit",
  "submitButtonStyles": {
    "borderRadius": "{{appsmith.theme.borderRadius.appBorderRadius}}",
    "boxShadow": "none",
    "buttonColor": "{{appsmith.theme.colors.primaryColor}}",
    "buttonVariant": "PRIMARY"
  },
  "title": "Formulario",
  "topRow": 6,
  "type": "JSON_FORM_WIDGET",
  "useSourceData": false,
  "version": 1,
  "widgetId": "snsoizco1g",
  "widgetName": "JSONForm1"
}