{
  "animateLoading": true,
  "borderRadius": "{{appsmith.theme.borderRadius.appBorderRadius}}",
  "bottomRow": 21,
  "boxShadow": "none",
  "buttonColor": "{{appsmith.theme.colors.primaryColor}}",
  "buttonStyle": "PRIMARY_BUTTON",
  "buttonVariant": "PRIMARY",
  "disabledWhenInvalid": false,
  "displayName": "Button",
  "dynamicBindingPathList": [
    {
      "key": "buttonColor"
    },
    {
      "key": "borderRadius"
    }
  ],
  "dynamicPropertyPathList": [
    {
      "key": "onClick"
    }
  ],
  "dynamicTriggerPathList": [
    {
      "key": "onClick"
    }
  ],
  "hideCard": false,
  "iconSVG": "/static/media/icon.cca026338f1c8eb6df8ba03d084c2fca.svg",
  "isDefaultClickDisabled": true,
  "isDeprecated": false,
  "isDisabled": false,
  "isLoading": false,
  "isVisible": true,
  "key": "zepbm78sly",
  "leftColumn": 47,
  "onClick": "{{\n    delete_synchronous_meetings\n      .run(\n        () => showAlert(\"Reunión eliminada\", \"success\"),\n        () => showAlert(\"No se pudo eliminar la Reunión\", \"error\")\n      )\n      .then(() => closeModal(\"Eliminar_sync\")).then(() => sync_list_query.run());\n}}",
  "originalBottomRow": 21,
  "originalTopRow": 17,
  "parentId": "7sb5tty2rj",
  "placement": "CENTER",
  "recaptchaType": "V3",
  "renderMode": "CANVAS",
  "resetFormOnClick": false,
  "rightColumn": 63,
  "searchTags": [
    "click",
    "submit"
  ],
  "text": "Confirm",
  "topRow": 17,
  "type": "BUTTON_WIDGET",
  "version": 1,
  "widgetId": "sw58a1mka1",
  "widgetName": "Button4"
}