{
  "animateLoading": true,
  "borderRadius": "{{appsmith.theme.borderRadius.appBorderRadius}}",
  "bottomRow": 31,
  "boxShadow": "none",
  "buttonColor": "{{appsmith.theme.colors.primaryColor}}",
  "buttonVariant": "PRIMARY",
  "disabledWhenInvalid": true,
  "displayName": "Button",
  "dynamicBindingPathList": [
    {
      "key": "buttonColor"
    },
    {
      "key": "borderRadius"
    }
  ],
  "dynamicPropertyPathList": [
    {
      "key": "onClick"
    }
  ],
  "dynamicTriggerPathList": [
    {
      "key": "onClick"
    }
  ],
  "hideCard": false,
  "iconSVG": "/static/media/icon.cca026338f1c8eb6df8ba03d084c2fca.svg",
  "isDefaultClickDisabled": true,
  "isDeprecated": false,
  "isDisabled": false,
  "isLoading": false,
  "isVisible": true,
  "key": "e5fbz6epx4",
  "leftColumn": 43,
  "onClick": "{{\n    help_center_add.run(\n      () => showAlert(\"Help Center creado\", \"success\"),\n      () => showAlert(\"No se pudo crear el Help Center\", \"error\")\n    ).then(() => help_center_list.run());\n}}",
  "originalBottomRow": 37,
  "originalTopRow": 33,
  "parentId": "bm9bsmerj7",
  "placement": "CENTER",
  "recaptchaType": "V3",
  "renderMode": "CANVAS",
  "resetFormOnClick": true,
  "rightColumn": 59,
  "searchTags": [
    "click",
    "submit"
  ],
  "text": "Submit",
  "topRow": 27,
  "type": "BUTTON_WIDGET",
  "version": 1,
  "widgetId": "4smq48whuq",
  "widgetName": "help_center_submit_reset"
}