{
  "gitSyncId": "65ce76beb9c9626798e244a6_65ce76beb9c9626798e244a8",
  "unpublishedPage": {
    "isHidden": false,
    "layouts": [
      {
        "dsl": {
          "backgroundColor": "none",
          "bottomRow": 1000,
          "canExtend": true,
          "containerStyle": "none",
          "detachFromLayout": true,
          "dynamicBindingPathList": [],
          "dynamicTriggerPathList": [],
          "leftColumn": 0,
          "minHeight": 1292,
          "parentColumnSpace": 1,
          "parentRowSpace": 1,
          "rightColumn": 4896,
          "snapColumns": 64,
          "snapRows": 124,
          "topRow": 0,
          "type": "CANVAS_WIDGET",
          "version": 91,
          "widgetId": "0",
          "widgetName": "MainContainer"
        }
      }
    ],
    "name": "Catálogos",
    "slug": "catalogos"
  }
}