{
  "accentColor": "{{appsmith.theme.colors.primaryColor}}",
  "animateLoading": true,
  "autoFocus": false,
  "borderRadius": "{{appsmith.theme.borderRadius.appBorderRadius}}",
  "bottomRow": 26,
  "boxShadow": "none",
  "defaultText": "{{catalog_book_by_Cid_Bid.data.data.license.loan_time}}",
  "displayName": "Input",
  "dynamicBindingPathList": [
    {
      "key": "accentColor"
    },
    {
      "key": "borderRadius"
    },
    {
      "key": "defaultText"
    }
  ],
  "dynamicHeight": "FIXED",
  "dynamicTriggerPathList": [],
  "hideCard": false,
  "iconAlign": "left",
  "iconSVG": "/static/media/icon.f4dd498ee72f01127e5bfe3a1a8ad671.svg",
  "inputType": "NUMBER",
  "isDeprecated": false,
  "isDisabled": false,
  "isLoading": false,
  "isRequired": true,
  "isVisible": true,
  "key": "hjo9b08n2p",
  "label": "Tiempo del préstamo",
  "labelAlignment": "left",
  "labelPosition": "Top",
  "labelStyle": "",
  "labelTextSize": "0.875rem",
  "labelWidth": 5,
  "leftColumn": 2,
  "maxDynamicHeight": 9000,
  "minDynamicHeight": 4,
  "minNum": "1",
  "minWidth": 450,
  "mobileBottomRow": 13,
  "mobileLeftColumn": 2,
  "mobileRightColumn": 22,
  "mobileTopRow": 6,
  "needsErrorInfo": false,
  "onCanvasUI": {
    "disableParentSelection": false,
    "focusBGCSSVar": "--on-canvas-ui-widget-focus",
    "focusColorCSSVar": "--on-canvas-ui-widget-selection",
    "selectionBGCSSVar": "--on-canvas-ui-widget-selection",
    "selectionColorCSSVar": "--on-canvas-ui-widget-focus"
  },
  "originalBottomRow": 23,
  "originalTopRow": 16,
  "parentColumnSpace": 5.25390625,
  "parentId": "mtf7q8ca5x",
  "parentRowSpace": 10,
  "renderMode": "CANVAS",
  "resetOnSubmit": true,
  "responsiveBehavior": "fill",
  "rightColumn": 61,
  "searchTags": [
    "form",
    "text input",
    "number",
    "textarea"
  ],
  "shouldAllowAutofill": false,
  "showStepArrows": false,
  "tags": [
    "Suggested",
    "Inputs"
  ],
  "thumbnailSVG": "/static/media/thumbnail.a4eac1a16753ea7fc54cac7731f9ea6a.svg",
  "topRow": 19,
  "type": "INPUT_WIDGET_V2",
  "validation": "",
  "version": 2,
  "widgetId": "p7swd735av",
  "widgetName": "Input2_update_license"
}