{
  "accentColor": "{{appsmith.theme.colors.primaryColor}}",
  "animateLoading": true,
  "autoFocus": false,
  "borderRadius": "{{appsmith.theme.borderRadius.appBorderRadius}}",
  "bottomRow": 23,
  "boxShadow": "none",
  "defaultText": "",
  "dynamicBindingPathList": [
    {
      "key": "accentColor"
    },
    {
      "key": "borderRadius"
    }
  ],
  "dynamicHeight": "AUTO_HEIGHT",
  "dynamicTriggerPathList": [],
  "iconAlign": "left",
  "inputType": "MULTI_LINE_TEXT",
  "isDisabled": false,
  "isLoading": false,
  "isRequired": false,
  "isVisible": true,
  "key": "6fidej9uuw",
  "label": "Descripción",
  "labelAlignment": "left",
  "labelPosition": "Top",
  "labelStyle": "",
  "labelTextSize": "0.875rem",
  "labelWidth": 5,
  "leftColumn": 1,
  "maxDynamicHeight": 9000,
  "minDynamicHeight": 4,
  "minWidth": 450,
  "mobileBottomRow": 23,
  "mobileLeftColumn": 0,
  "mobileRightColumn": 14,
  "mobileTopRow": 16,
  "needsErrorInfo": false,
  "originalBottomRow": 23,
  "originalTopRow": 13,
  "parentColumnSpace": 9.771842956542969,
  "parentId": "9k9xkqtf9n",
  "parentRowSpace": 10,
  "renderMode": "CANVAS",
  "resetOnSubmit": true,
  "responsiveBehavior": "fill",
  "rightColumn": 41,
  "shouldAllowAutofill": false,
  "showStepArrows": false,
  "topRow": 13,
  "type": "INPUT_WIDGET_V2",
  "version": 2,
  "widgetId": "8p7fodwlek",
  "widgetName": "InputDescription"
}