{
  "animateLoading": true,
  "borderRadius": "{{appsmith.theme.borderRadius.appBorderRadius}}",
  "bottomRow": 27,
  "displayName": "Text",
  "dynamicBindingPathList": [
    {
      "key": "truncateButtonColor"
    },
    {
      "key": "borderRadius"
    },
    {
      "key": "text"
    },
    {
      "key": "textColor"
    }
  ],
  "dynamicHeight": "AUTO_HEIGHT",
  "dynamicTriggerPathList": [],
  "fontFamily": "Nunito Sans",
  "fontSize": "1rem",
  "fontStyle": "BOLD",
  "hideCard": false,
  "iconSVG": "/static/media/icon.a55b701a2ae86aa2c6718ecb7b4083f0.svg",
  "isDeprecated": false,
  "isLoading": false,
  "isVisible": true,
  "key": "xk3py06l1j",
  "leftColumn": 1,
  "maxDynamicHeight": 9000,
  "minDynamicHeight": 4,
  "minWidth": 450,
  "mobileBottomRow": 10,
  "mobileLeftColumn": 1,
  "mobileRightColumn": 17,
  "mobileTopRow": 6,
  "needsErrorInfo": false,
  "onCanvasUI": {
    "disableParentSelection": false,
    "focusBGCSSVar": "--on-canvas-ui-widget-focus",
    "focusColorCSSVar": "--on-canvas-ui-widget-selection",
    "selectionBGCSSVar": "--on-canvas-ui-widget-selection",
    "selectionColorCSSVar": "--on-canvas-ui-widget-focus"
  },
  "originalBottomRow": 20,
  "originalTopRow": 15,
  "overflow": "NONE",
  "parentColumnSpace": 12.28125,
  "parentId": "dzmspd5m8x",
  "parentRowSpace": 10,
  "renderMode": "CANVAS",
  "responsiveBehavior": "fill",
  "rightColumn": 20,
  "searchTags": [
    "typography",
    "paragraph",
    "label"
  ],
  "shouldTruncate": false,
  "tags": [
    "Suggested",
    "Content"
  ],
  "text": "{{`Cantidad máxima de licencias:  ${catalog_book_by_Cid_Bid.data.data.license.max_license_quantity}`}}",
  "textAlign": "LEFT",
  "textColor": "{{appsmith.theme.colors.primaryColor}}",
  "thumbnailSVG": "/static/media/thumbnail.0c129b82c9b3e4cd4920563b289659ab.svg",
  "topRow": 22,
  "truncateButtonColor": "{{appsmith.theme.colors.primaryColor}}",
  "type": "TEXT_WIDGET",
  "version": 1,
  "widgetId": "r3dk7ou4p4",
  "widgetName": "Text7"
}