{
  "accentColor": "{{appsmith.theme.colors.primaryColor}}",
  "animateLoading": true,
  "autoFocus": false,
  "borderRadius": "{{appsmith.theme.borderRadius.appBorderRadius}}",
  "bottomRow": 13,
  "boxShadow": "none",
  "defaultText": "{{TableCollections.triggeredRow.title}}",
  "dynamicBindingPathList": [
    {
      "key": "accentColor"
    },
    {
      "key": "borderRadius"
    },
    {
      "key": "defaultText"
    }
  ],
  "dynamicHeight": "FIXED",
  "dynamicTriggerPathList": [],
  "iconAlign": "left",
  "inputType": "TEXT",
  "isDisabled": false,
  "isLoading": false,
  "isRequired": false,
  "isVisible": true,
  "key": "0dwkn2od2x",
  "label": "Título",
  "labelAlignment": "left",
  "labelPosition": "Top",
  "labelStyle": "",
  "labelTextSize": "0.875rem",
  "labelWidth": 5,
  "leftColumn": 1,
  "maxDynamicHeight": 9000,
  "minDynamicHeight": 4,
  "minWidth": 450,
  "mobileBottomRow": 14,
  "mobileLeftColumn": 2,
  "mobileRightColumn": 22,
  "mobileTopRow": 7,
  "needsErrorInfo": false,
  "parentColumnSpace": 9.90625,
  "parentId": "xpd6yp9yaq",
  "parentRowSpace": 10,
  "renderMode": "CANVAS",
  "resetOnSubmit": true,
  "responsiveBehavior": "fill",
  "rightColumn": 54,
  "showStepArrows": false,
  "topRow": 6,
  "type": "INPUT_WIDGET_V2",
  "version": 2,
  "widgetId": "bsvlj4p5w2",
  "widgetName": "ModalInputTitle"
}