{
  "animateLoading": true,
  "borderRadius": "{{appsmith.theme.borderRadius.appBorderRadius}}",
  "bottomRow": 26,
  "boxShadow": "none",
  "buttonColor": "{{appsmith.theme.colors.primaryColor}}",
  "buttonVariant": "SECONDARY",
  "disabledWhenInvalid": false,
  "displayName": "Button",
  "dynamicBindingPathList": [
    {
      "key": "buttonColor"
    },
    {
      "key": "borderRadius"
    }
  ],
  "hideCard": false,
  "iconSVG": "/static/media/icon.05d209fafeb13a8569e3b4e97069d9ee.svg",
  "isDefaultClickDisabled": true,
  "isDeprecated": false,
  "isDisabled": false,
  "isLoading": false,
  "isVisible": true,
  "key": "o9lq280e0f",
  "leftColumn": 1,
  "minWidth": 120,
  "mobileBottomRow": 37,
  "mobileLeftColumn": 30,
  "mobileRightColumn": 46,
  "mobileTopRow": 33,
  "originalBottomRow": 28,
  "originalTopRow": 24,
  "parentId": "llsqzp4aok",
  "placement": "CENTER",
  "recaptchaType": "V3",
  "renderMode": "CANVAS",
  "resetFormOnClick": true,
  "responsiveBehavior": "hug",
  "rightColumn": 17,
  "searchTags": [
    "click",
    "submit"
  ],
  "tags": [
    "Buttons"
  ],
  "text": "Reset",
  "topRow": 22,
  "type": "BUTTON_WIDGET",
  "version": 1,
  "widgetId": "dmqhbus1jv",
  "widgetName": "Button2Copy1"
}