{
  "accentColor": "{{appsmith.theme.colors.primaryColor}}",
  "animateLoading": true,
  "autoFocus": false,
  "borderRadius": "{{appsmith.theme.borderRadius.appBorderRadius}}",
  "bottomRow": 26,
  "boxShadow": "none",
  "defaultText": "",
  "displayName": "Input",
  "dynamicBindingPathList": [
    {
      "key": "accentColor"
    },
    {
      "key": "borderRadius"
    }
  ],
  "dynamicHeight": "FIXED",
  "dynamicTriggerPathList": [],
  "hideCard": false,
  "iconAlign": "left",
  "iconSVG": "/static/media/icon.f2c34197dbcf03595098986de898928f.svg",
  "inputType": "NUMBER",
  "isDeprecated": false,
  "isDisabled": false,
  "isLoading": false,
  "isRequired": true,
  "isVisible": true,
  "key": "o5hfrw28tv",
  "label": "Cantidad máxima de licencias",
  "labelAlignment": "left",
  "labelPosition": "Top",
  "labelStyle": "",
  "labelTextSize": "0.875rem",
  "labelWidth": 5,
  "leftColumn": 2,
  "maxDynamicHeight": 9000,
  "maxNum": "1000000",
  "minDynamicHeight": 4,
  "minNum": "1",
  "minWidth": 450,
  "mobileBottomRow": 37,
  "mobileLeftColumn": 2,
  "mobileRightColumn": 22,
  "mobileTopRow": 30,
  "originalBottomRow": 43,
  "originalTopRow": 36,
  "parentColumnSpace": 6.888671875,
  "parentId": "5cgxh41lzi",
  "parentRowSpace": 10,
  "renderMode": "CANVAS",
  "resetOnSubmit": true,
  "responsiveBehavior": "fill",
  "rightColumn": 62,
  "searchTags": [
    "form",
    "text input",
    "number",
    "textarea"
  ],
  "shouldAllowAutofill": false,
  "showStepArrows": false,
  "tags": [
    "Suggested",
    "Inputs"
  ],
  "topRow": 19,
  "type": "INPUT_WIDGET_V2",
  "validation": "",
  "version": 2,
  "widgetId": "wm9lh2wlb2",
  "widgetName": "max_license_input"
}