{
  "accentColor": "{{appsmith.theme.colors.primaryColor}}",
  "animateLoading": true,
  "borderColor": "#E0DEDE",
  "borderRadius": "{{appsmith.theme.borderRadius.appBorderRadius}}",
  "borderWidth": "1",
  "bottomRow": 221,
  "boxShadow": "{{appsmith.theme.boxShadow.appBoxShadow}}",
  "canFreezeColumn": false,
  "childStylesheet": {
    "button": {
      "borderRadius": "{{appsmith.theme.borderRadius.appBorderRadius}}",
      "boxShadow": "none",
      "buttonColor": "{{appsmith.theme.colors.primaryColor}}"
    },
    "editActions": {
      "discardBorderRadius": "{{appsmith.theme.borderRadius.appBorderRadius}}",
      "discardButtonColor": "{{appsmith.theme.colors.primaryColor}}",
      "saveBorderRadius": "{{appsmith.theme.borderRadius.appBorderRadius}}",
      "saveButtonColor": "{{appsmith.theme.colors.primaryColor}}"
    },
    "iconButton": {
      "borderRadius": "{{appsmith.theme.borderRadius.appBorderRadius}}",
      "boxShadow": "none",
      "buttonColor": "{{appsmith.theme.colors.primaryColor}}"
    },
    "menuButton": {
      "borderRadius": "{{appsmith.theme.borderRadius.appBorderRadius}}",
      "boxShadow": "none",
      "menuColor": "{{appsmith.theme.colors.primaryColor}}"
    }
  },
  "columnOrder": [
    "id",
    "created_at",
    "updated_at",
    "deleted_at",
    "customColumn1",
    "customColumn2",
    "EditActions1",
    "assessment_id",
    "account_id",
    "message",
    "assessment_path",
    "rubric_path",
    "interaction",
    "rubric_result_id"
  ],
  "columnUpdatedAt": 1683827631415,
  "columnWidthMap": {
    "assessment_path": 209,
    "created_at": 216,
    "customColumn1": 79,
    "customColumn2": 86,
    "message": 199,
    "status": 75,
    "step": 62,
    "task": 245,
    "updated_at": 209
  },
  "defaultPageSize": 0,
  "defaultSelectedRowIndex": 0,
  "defaultSelectedRowIndices": [
    0
  ],
  "delimiter": ",",
  "displayName": "Table",
  "dynamicBindingPathList": [
    {
      "key": "accentColor"
    },
    {
      "key": "borderRadius"
    },
    {
      "key": "boxShadow"
    },
    {
      "key": "tableData"
    },
    {
      "key": "primaryColumns.id.computedValue"
    },
    {
      "key": "primaryColumns.created_at.computedValue"
    },
    {
      "key": "primaryColumns.updated_at.computedValue"
    },
    {
      "key": "primaryColumns.deleted_at.computedValue"
    },
    {
      "key": "primaryColumns.customColumn1.buttonColor"
    },
    {
      "key": "primaryColumns.customColumn1.borderRadius"
    },
    {
      "key": "primaryColumns.customColumn1.boxShadow"
    },
    {
      "key": "primaryColumns.customColumn2.buttonColor"
    },
    {
      "key": "primaryColumns.customColumn2.borderRadius"
    },
    {
      "key": "primaryColumns.customColumn2.boxShadow"
    },
    {
      "key": "primaryColumns.EditActions1.saveButtonColor"
    },
    {
      "key": "primaryColumns.EditActions1.saveBorderRadius"
    },
    {
      "key": "primaryColumns.EditActions1.discardBorderRadius"
    },
    {
      "key": "primaryColumns.EditActions1.isSaveDisabled"
    },
    {
      "key": "primaryColumns.EditActions1.isDiscardDisabled"
    },
    {
      "key": "primaryColumns.assessment_id.computedValue"
    },
    {
      "key": "primaryColumns.account_id.computedValue"
    },
    {
      "key": "primaryColumns.message.computedValue"
    },
    {
      "key": "primaryColumns.assessment_path.computedValue"
    },
    {
      "key": "primaryColumns.rubric_path.computedValue"
    },
    {
      "key": "primaryColumns.interaction.computedValue"
    },
    {
      "key": "primaryColumns.rubric_result_id.computedValue"
    }
  ],
  "dynamicPropertyPathList": [
    {
      "key": "primaryColumns.EditActions1.isSaveDisabled"
    },
    {
      "key": "primaryColumns.EditActions1.isDiscardDisabled"
    },
    {
      "key": "tableData"
    }
  ],
  "dynamicTriggerPathList": [
    {
      "key": "primaryColumns.customColumn1.onClick"
    },
    {
      "key": "primaryColumns.customColumn2.onClick"
    }
  ],
  "enableClientSideSearch": true,
  "enableServerSideFiltering": false,
  "hideCard": false,
  "horizontalAlignment": "LEFT",
  "iconSVG": "/static/media/icon.db8a9cbd2acd22a31ea91cc37ea2a46c.svg",
  "inlineEditingSaveOption": "ROW_LEVEL",
  "isDeprecated": false,
  "isLoading": false,
  "isSortable": true,
  "isVisible": true,
  "isVisibleDownload": true,
  "isVisibleFilters": true,
  "isVisiblePagination": true,
  "isVisibleSearch": true,
  "key": "unfg2p897i",
  "label": "Data",
  "leftColumn": 0,
  "originalBottomRow": 222,
  "originalTopRow": 167,
  "parentColumnSpace": 16.734375,
  "parentId": "0",
  "parentRowSpace": 10,
  "primaryColumns": {
    "EditActions1": {
      "alias": "EditActions1",
      "allowCellWrapping": false,
      "buttonStyle": "rgb(3, 179, 101)",
      "columnType": "editActions",
      "computedValue": "",
      "discardActionLabel": "Discard",
      "discardBorderRadius": "{{AssessmentsInteractionsTable.processedTableData.map((currentRow, currentIndex) => ( appsmith.theme.borderRadius.appBorderRadius))}}",
      "discardButtonColor": "#F22B2B",
      "discardButtonVariant": "TERTIARY",
      "discardIconAlign": "left",
      "enableFilter": true,
      "enableSort": true,
      "horizontalAlignment": "LEFT",
      "id": "EditActions1",
      "index": 10,
      "isCellEditable": false,
      "isCellVisible": true,
      "isDerived": true,
      "isDisabled": false,
      "isDiscardDisabled": "{{AssessmentsInteractionsTable.processedTableData.map((currentRow, currentIndex) => ( !AssessmentsInteractionsTable.updatedRowIndices.includes(currentIndex)))}}",
      "isDiscardVisible": true,
      "isEditable": false,
      "isSaveDisabled": "{{AssessmentsInteractionsTable.processedTableData.map((currentRow, currentIndex) => ( !AssessmentsInteractionsTable.updatedRowIndices.includes(currentIndex)))}}",
      "isSaveVisible": true,
      "isVisible": true,
      "label": "Save / Discard",
      "originalId": "EditActions1",
      "saveActionLabel": "Save",
      "saveBorderRadius": "{{AssessmentsInteractionsTable.processedTableData.map((currentRow, currentIndex) => ( appsmith.theme.borderRadius.appBorderRadius))}}",
      "saveButtonColor": "{{AssessmentsInteractionsTable.processedTableData.map((currentRow, currentIndex) => ( appsmith.theme.colors.primaryColor))}}",
      "saveIconAlign": "left",
      "sticky": "",
      "textSize": "0.875rem",
      "validation": {},
      "verticalAlignment": "CENTER",
      "width": 150
    },
    "account_id": {
      "alias": "account_id",
      "allowCellWrapping": false,
      "cellBackground": "",
      "columnType": "text",
      "computedValue": "{{AssessmentsInteractionsTable.processedTableData.map((currentRow, currentIndex) => ( currentRow[\"account_id\"]))}}",
      "enableFilter": true,
      "enableSort": true,
      "fontStyle": "",
      "horizontalAlignment": "LEFT",
      "id": "account_id",
      "index": 5,
      "isCellEditable": false,
      "isCellVisible": true,
      "isDerived": false,
      "isDisabled": false,
      "isDiscardVisible": true,
      "isEditable": false,
      "isSaveVisible": true,
      "isVisible": true,
      "label": "account_id",
      "originalId": "account_id",
      "sticky": "",
      "textColor": "",
      "textSize": "0.875rem",
      "validation": {},
      "verticalAlignment": "CENTER",
      "width": 150
    },
    "assessment_id": {
      "alias": "assessment_id",
      "allowCellWrapping": false,
      "cellBackground": "",
      "columnType": "text",
      "computedValue": "{{AssessmentsInteractionsTable.processedTableData.map((currentRow, currentIndex) => ( currentRow[\"assessment_id\"]))}}",
      "enableFilter": true,
      "enableSort": true,
      "fontStyle": "",
      "horizontalAlignment": "LEFT",
      "id": "assessment_id",
      "index": 4,
      "isCellEditable": false,
      "isCellVisible": true,
      "isDerived": false,
      "isDisabled": false,
      "isDiscardVisible": true,
      "isEditable": false,
      "isSaveVisible": true,
      "isVisible": true,
      "label": "assessment_id",
      "originalId": "assessment_id",
      "sticky": "",
      "textColor": "",
      "textSize": "0.875rem",
      "validation": {},
      "verticalAlignment": "CENTER",
      "width": 150
    },
    "assessment_path": {
      "alias": "assessment_path",
      "allowCellWrapping": false,
      "cellBackground": "",
      "columnType": "text",
      "computedValue": "{{AssessmentsInteractionsTable.processedTableData.map((currentRow, currentIndex) => ( currentRow[\"assessment_path\"]))}}",
      "enableFilter": true,
      "enableSort": true,
      "fontStyle": "",
      "horizontalAlignment": "LEFT",
      "id": "assessment_path",
      "index": 7,
      "isCellEditable": false,
      "isCellVisible": true,
      "isDerived": false,
      "isDisabled": false,
      "isDiscardVisible": true,
      "isEditable": false,
      "isSaveVisible": true,
      "isVisible": true,
      "label": "assessment_path",
      "originalId": "assessment_path",
      "sticky": "",
      "textColor": "",
      "textSize": "0.875rem",
      "validation": {},
      "verticalAlignment": "CENTER",
      "width": 150
    },
    "created_at": {
      "alias": "created_at",
      "allowCellWrapping": false,
      "cellBackground": "",
      "columnType": "date",
      "computedValue": "{{AssessmentsInteractionsTable.processedTableData.map((currentRow, currentIndex) => ( currentRow[\"created_at\"]))}}",
      "enableFilter": true,
      "enableSort": true,
      "fontStyle": "",
      "horizontalAlignment": "LEFT",
      "id": "created_at",
      "index": 1,
      "isCellEditable": true,
      "isCellVisible": true,
      "isDerived": false,
      "isDisabled": false,
      "isDiscardVisible": true,
      "isEditable": true,
      "isSaveVisible": true,
      "isVisible": true,
      "label": "created_at",
      "originalId": "created_at",
      "sticky": "",
      "textColor": "",
      "textSize": "0.875rem",
      "validation": {},
      "verticalAlignment": "CENTER",
      "width": 150
    },
    "customColumn1": {
      "alias": "delete",
      "allowCellWrapping": false,
      "borderRadius": "{{AssessmentsInteractionsTable.processedTableData.map((currentRow, currentIndex) => ( appsmith.theme.borderRadius.appBorderRadius))}}",
      "boxShadow": "{{AssessmentsInteractionsTable.processedTableData.map((currentRow, currentIndex) => ( 'none'))}}",
      "buttonColor": "{{AssessmentsInteractionsTable.processedTableData.map((currentRow, currentIndex) => ( appsmith.theme.colors.primaryColor))}}",
      "buttonLabel": "Delete",
      "buttonStyle": "rgb(3, 179, 101)",
      "columnType": "button",
      "computedValue": "",
      "customAlias": "",
      "enableFilter": true,
      "enableSort": true,
      "horizontalAlignment": "LEFT",
      "id": "customColumn1",
      "index": 10,
      "isCellEditable": false,
      "isCellVisible": true,
      "isDerived": true,
      "isDisabled": false,
      "isDiscardVisible": true,
      "isEditable": false,
      "isSaveVisible": true,
      "isVisible": true,
      "label": "delete",
      "labelColor": "#FFFFFF",
      "onClick": "{{showModal('DeleteInteractionModal')}}",
      "originalId": "customColumn1",
      "sticky": "",
      "textSize": "0.875rem",
      "validation": {},
      "verticalAlignment": "CENTER",
      "width": 150
    },
    "customColumn2": {
      "alias": "update",
      "allowCellWrapping": false,
      "borderRadius": "{{AssessmentsInteractionsTable.processedTableData.map((currentRow, currentIndex) => ( appsmith.theme.borderRadius.appBorderRadius))}}",
      "boxShadow": "{{AssessmentsInteractionsTable.processedTableData.map((currentRow, currentIndex) => ( 'none'))}}",
      "buttonColor": "{{AssessmentsInteractionsTable.processedTableData.map((currentRow, currentIndex) => ( appsmith.theme.colors.primaryColor))}}",
      "buttonStyle": "rgb(3, 179, 101)",
      "columnType": "button",
      "computedValue": "",
      "customAlias": "",
      "enableFilter": true,
      "enableSort": true,
      "horizontalAlignment": "LEFT",
      "id": "customColumn2",
      "index": 10,
      "isCellEditable": false,
      "isCellVisible": true,
      "isDerived": true,
      "isDisabled": false,
      "isDiscardVisible": true,
      "isEditable": false,
      "isSaveVisible": true,
      "isVisible": true,
      "label": "update",
      "labelColor": "#FFFFFF",
      "onClick": "{{showModal('UpdateInteractionModal')}}",
      "originalId": "customColumn2",
      "sticky": "",
      "textSize": "0.875rem",
      "validation": {},
      "verticalAlignment": "CENTER",
      "width": 150
    },
    "deleted_at": {
      "alias": "deleted_at",
      "allowCellWrapping": false,
      "cellBackground": "",
      "columnType": "text",
      "computedValue": "{{AssessmentsInteractionsTable.processedTableData.map((currentRow, currentIndex) => ( currentRow[\"deleted_at\"]))}}",
      "enableFilter": true,
      "enableSort": true,
      "fontStyle": "",
      "horizontalAlignment": "LEFT",
      "id": "deleted_at",
      "index": 3,
      "isCellEditable": true,
      "isCellVisible": true,
      "isDerived": false,
      "isDisabled": false,
      "isDiscardVisible": true,
      "isEditable": true,
      "isSaveVisible": true,
      "isVisible": true,
      "label": "deleted_at",
      "originalId": "deleted_at",
      "sticky": "",
      "textColor": "",
      "textSize": "0.875rem",
      "validation": {},
      "verticalAlignment": "CENTER",
      "width": 150
    },
    "id": {
      "alias": "id",
      "allowCellWrapping": false,
      "cellBackground": "",
      "columnType": "text",
      "computedValue": "{{AssessmentsInteractionsTable.processedTableData.map((currentRow, currentIndex) => ( currentRow[\"id\"]))}}",
      "enableFilter": true,
      "enableSort": true,
      "fontStyle": "",
      "horizontalAlignment": "LEFT",
      "id": "id",
      "index": 0,
      "isCellEditable": true,
      "isCellVisible": true,
      "isDerived": false,
      "isDisabled": false,
      "isDiscardVisible": true,
      "isEditable": true,
      "isSaveVisible": true,
      "isVisible": true,
      "label": "id",
      "originalId": "id",
      "sticky": "",
      "textColor": "",
      "textSize": "0.875rem",
      "validation": {},
      "verticalAlignment": "CENTER",
      "width": 150
    },
    "interaction": {
      "alias": "interaction",
      "allowCellWrapping": false,
      "cellBackground": "",
      "columnType": "text",
      "computedValue": "{{AssessmentsInteractionsTable.processedTableData.map((currentRow, currentIndex) => ( currentRow[\"interaction\"]))}}",
      "enableFilter": true,
      "enableSort": true,
      "fontStyle": "",
      "horizontalAlignment": "LEFT",
      "id": "interaction",
      "index": 9,
      "isCellEditable": false,
      "isCellVisible": true,
      "isDerived": false,
      "isDisabled": false,
      "isDiscardVisible": true,
      "isEditable": false,
      "isSaveVisible": true,
      "isVisible": true,
      "label": "interaction",
      "originalId": "interaction",
      "sticky": "",
      "textColor": "",
      "textSize": "0.875rem",
      "validation": {},
      "verticalAlignment": "CENTER",
      "width": 150
    },
    "message": {
      "alias": "message",
      "allowCellWrapping": false,
      "cellBackground": "",
      "columnType": "text",
      "computedValue": "{{AssessmentsInteractionsTable.processedTableData.map((currentRow, currentIndex) => ( currentRow[\"message\"]))}}",
      "enableFilter": true,
      "enableSort": true,
      "fontStyle": "",
      "horizontalAlignment": "LEFT",
      "id": "message",
      "index": 6,
      "isCellEditable": false,
      "isCellVisible": true,
      "isDerived": false,
      "isDisabled": false,
      "isDiscardVisible": true,
      "isEditable": false,
      "isSaveVisible": true,
      "isVisible": true,
      "label": "message",
      "originalId": "message",
      "sticky": "",
      "textColor": "",
      "textSize": "0.875rem",
      "validation": {},
      "verticalAlignment": "CENTER",
      "width": 150
    },
    "rubric_path": {
      "alias": "rubric_path",
      "allowCellWrapping": false,
      "cellBackground": "",
      "columnType": "text",
      "computedValue": "{{AssessmentsInteractionsTable.processedTableData.map((currentRow, currentIndex) => ( currentRow[\"rubric_path\"]))}}",
      "enableFilter": true,
      "enableSort": true,
      "fontStyle": "",
      "horizontalAlignment": "LEFT",
      "id": "rubric_path",
      "index": 8,
      "isCellEditable": false,
      "isCellVisible": true,
      "isDerived": false,
      "isDisabled": false,
      "isDiscardVisible": true,
      "isEditable": false,
      "isSaveVisible": true,
      "isVisible": true,
      "label": "rubric_path",
      "originalId": "rubric_path",
      "sticky": "",
      "textColor": "",
      "textSize": "0.875rem",
      "validation": {},
      "verticalAlignment": "CENTER",
      "width": 150
    },
    "rubric_result_id": {
      "alias": "rubric_result_id",
      "allowCellWrapping": false,
      "allowSameOptionsInNewRow": true,
      "cellBackground": "",
      "columnType": "text",
      "computedValue": "{{AssessmentsInteractionsTable.processedTableData.map((currentRow, currentIndex) => ( currentRow[\"rubric_result_id\"]))}}",
      "enableFilter": true,
      "enableSort": true,
      "fontStyle": "",
      "horizontalAlignment": "LEFT",
      "id": "rubric_result_id",
      "index": 10,
      "isCellEditable": false,
      "isCellVisible": true,
      "isDerived": false,
      "isDisabled": false,
      "isDiscardVisible": true,
      "isEditable": false,
      "isSaveVisible": true,
      "isVisible": true,
      "label": "rubric_result_id",
      "originalId": "rubric_result_id",
      "sticky": "",
      "textColor": "",
      "textSize": "0.875rem",
      "validation": {},
      "verticalAlignment": "CENTER",
      "width": 150
    },
    "updated_at": {
      "alias": "updated_at",
      "allowCellWrapping": false,
      "cellBackground": "",
      "columnType": "date",
      "computedValue": "{{AssessmentsInteractionsTable.processedTableData.map((currentRow, currentIndex) => ( currentRow[\"updated_at\"]))}}",
      "enableFilter": true,
      "enableSort": true,
      "fontStyle": "",
      "horizontalAlignment": "LEFT",
      "id": "updated_at",
      "index": 2,
      "isCellEditable": true,
      "isCellVisible": true,
      "isDerived": false,
      "isDisabled": false,
      "isDiscardVisible": true,
      "isEditable": true,
      "isSaveVisible": true,
      "isVisible": true,
      "label": "updated_at",
      "originalId": "updated_at",
      "sticky": "",
      "textColor": "",
      "textSize": "0.875rem",
      "validation": {},
      "verticalAlignment": "CENTER",
      "width": 150
    }
  },
  "renderMode": "CANVAS",
  "rightColumn": 61,
  "searchKey": "",
  "serverSidePaginationEnabled": false,
  "showInlineEditingOptionDropdown": true,
  "tableData": "{{get_assessments_interactions.data.data}}",
  "textSize": "0.875rem",
  "topRow": 166,
  "totalRecordsCount": 0,
  "type": "TABLE_WIDGET_V2",
  "version": 1,
  "verticalAlignment": "CENTER",
  "widgetId": "a7m71i7mdc",
  "widgetName": "AssessmentsInteractionsTable"
}