{
  "animateLoading": true,
  "borderRadius": "{{appsmith.theme.borderRadius.appBorderRadius}}",
  "bottomRow": 7,
  "boxShadow": "none",
  "buttonColor": "{{appsmith.theme.colors.primaryColor}}",
  "buttonVariant": "PRIMARY",
  "disabledWhenInvalid": false,
  "displayName": "Button",
  "dynamicBindingPathList": [
    {
      "key": "buttonColor"
    },
    {
      "key": "borderRadius"
    }
  ],
  "dynamicTriggerPathList": [
    {
      "key": "onClick"
    }
  ],
  "hideCard": false,
  "iconSVG": "/static/media/icon.cca026338f1c8eb6df8ba03d084c2fca.svg",
  "isDefaultClickDisabled": true,
  "isDeprecated": false,
  "isDisabled": false,
  "isLoading": false,
  "isVisible": true,
  "key": "a2500u4bq3",
  "leftColumn": 20,
  "onClick": "{{get_assessment_by_id.run()}}",
  "parentColumnSpace": 16.734375,
  "parentId": "0",
  "parentRowSpace": 10,
  "placement": "CENTER",
  "recaptchaType": "V3",
  "renderMode": "CANVAS",
  "resetFormOnClick": false,
  "rightColumn": 28,
  "searchTags": [
    "click",
    "submit"
  ],
  "text": "Submit",
  "topRow": 3,
  "type": "BUTTON_WIDGET",
  "version": 1,
  "widgetId": "rvnclo73co",
  "widgetName": "Search_Button"
}