{
  "animateLoading": true,
  "borderRadius": "{{appsmith.theme.borderRadius.appBorderRadius}}",
  "bottomRow": 340,
  "boxShadow": "none",
  "canEscapeKeyClose": true,
  "canOutsideClickClose": true,
  "children": [
    {
      "bottomRow": 320,
      "canExtend": true,
      "detachFromLayout": true,
      "displayName": "Canvas",
      "dynamicBindingPathList": [],
      "hideCard": true,
      "isDeprecated": false,
      "isDisabled": false,
      "isLoading": false,
      "isVisible": true,
      "key": "4dbhvxx3p6",
      "leftColumn": 0,
      "minHeight": 320,
      "parentColumnSpace": 1,
      "parentId": "uxfkhabh0t",
      "parentRowSpace": 1,
      "renderMode": "CANVAS",
      "rightColumn": 271.125,
      "shouldScrollContents": false,
      "topRow": 0,
      "type": "CANVAS_WIDGET",
      "version": 1,
      "widgetId": "1tpnpbf27w",
      "widgetName": "Canvas2"
    }
  ],
  "detachFromLayout": true,
  "displayName": "Modal",
  "dynamicBindingPathList": [
    {
      "key": "borderRadius"
    }
  ],
  "dynamicHeight": "AUTO_HEIGHT",
  "height": 320,
  "hideCard": false,
  "iconSVG": "/static/media/icon.4975978e9a961fb0bfb4e38de7ecc7c5.svg",
  "isCanvas": true,
  "isDeprecated": false,
  "isLoading": false,
  "key": "q1raj18y7u",
  "leftColumn": 19,
  "maxDynamicHeight": 9000,
  "minDynamicHeight": 24,
  "parentColumnSpace": 11.296875,
  "parentId": "0",
  "parentRowSpace": 10,
  "renderMode": "CANVAS",
  "rightColumn": 43,
  "searchTags": [
    "dialog",
    "popup",
    "notification"
  ],
  "shouldScrollContents": true,
  "topRow": 20,
  "type": "MODAL_WIDGET",
  "version": 2,
  "widgetId": "uxfkhabh0t",
  "widgetName": "AddCourseModal",
  "width": 452
}