{
  "allowedFileTypes": [],
  "animateLoading": true,
  "borderRadius": "{{appsmith.theme.borderRadius.appBorderRadius}}",
  "bottomRow": 15,
  "boxShadow": "none",
  "buttonColor": "{{appsmith.theme.colors.primaryColor}}",
  "displayName": "FilePicker",
  "dynamicBindingPathList": [
    {
      "key": "buttonColor"
    },
    {
      "key": "borderRadius"
    }
  ],
  "dynamicTriggerPathList": [],
  "dynamicTyping": true,
  "fileDataType": "Base64",
  "files": [],
  "hideCard": false,
  "iconSVG": "/static/media/icon.7c5ad9c357928c6ff5701bf51a56c2e5.svg",
  "isDefaultClickDisabled": true,
  "isDeprecated": false,
  "isDisabled": false,
  "isLoading": false,
  "isRequired": false,
  "isVisible": true,
  "key": "3mvyek5qg3",
  "label": "Select Files",
  "leftColumn": 2,
  "maxFileSize": 5,
  "maxNumFiles": "1",
  "parentColumnSpace": 6.9375,
  "parentId": "cpge95mudr",
  "parentRowSpace": 10,
  "renderMode": "CANVAS",
  "rightColumn": 34,
  "searchTags": [
    "upload"
  ],
  "selectedFiles": [],
  "topRow": 11,
  "type": "FILE_PICKER_WIDGET_V2",
  "version": 1,
  "widgetId": "64nz09xzlz",
  "widgetName": "FilePicker1"
}