{
  "products": [
    {
      "id": 1,
      "name": "Caneta BIC Preta",
      "price": 5.89
    },
    {
      "id": 2,
      "name": "Notebook Mac Pro",
      "price": 12000.89
    },
    {
      "id": 3,
      "name": "Samsung S20+ Ultra Foda ",
      "price": "9500.00"
    },
    {
      "name": "Lapis Preto Básico",
      "price": "1.50",
      "id": 4
    },
    {
      "name": "Veio do formulário",
      "price": "9.99",
      "id": 5
    },
    {
      "name": "Geladeria",
      "price": "1890.44",
      "id": 6
    },
    {
      "name": "Notebook",
      "price": "450.00",
      "id": 7
    }
  ]
}