<svg width="33" height="33" viewBox="0 0 33 33" fill="none" xmlns="http://www.w3.org/2000/svg">
<path fill-rule="evenodd" clip-rule="evenodd" d="M3.25028 1.25443C3.25028 1.04353 3.42852 0.872559 3.64838 0.872559H32.3115C32.5313 0.872559 32.7096 1.04353 32.7096 1.25443V28.8765C32.7096 29.0874 32.5313 29.2584 32.3115 29.2584C32.0916 29.2584 31.9134 29.0874 31.9134 28.8765V1.6363H3.64838C3.42852 1.6363 3.25028 1.46533 3.25028 1.25443Z" fill="white" stroke="white" stroke-width="0.5" stroke-linecap="round" stroke-linejoin="round"/>
<path d="M3.66808 29.4348L3.79308 29.4348L3.79308 29.3098L3.79308 5.55112L5.41895 7.17699C5.62201 7.38005 5.95123 7.38005 6.15428 7.17699C6.35734 6.97394 6.35734 6.64472 6.15428 6.44166L3.64079 3.92816C3.43773 3.72511 3.10851 3.72511 2.90546 3.92816L0.391961 6.44166C0.188904 6.64472 0.188905 6.97394 0.391961 7.17699C0.595017 7.38005 0.924236 7.38005 1.12729 7.17699L2.75316 5.55112L2.75317 29.3098L2.75317 29.4348L2.87817 29.4348L3.66808 29.4348Z" fill="white" stroke="white" stroke-width="0.25"/>
<path d="M2.75219 29.704V29.829H2.87719L26.7603 29.829L25.1262 31.4547C24.922 31.6578 24.922 31.9874 25.1262 32.1905C25.33 32.3932 25.6601 32.3932 25.864 32.1905L28.3906 29.677C28.5947 29.4739 28.5947 29.1443 28.3906 28.9412L25.864 26.4277C25.6601 26.2249 25.33 26.2249 25.1262 26.4277C24.922 26.6308 24.922 26.9604 25.1262 27.1635L26.7603 28.7891L2.87719 28.7891H2.75219V28.9141V29.704Z" fill="white" stroke="white" stroke-width="0.25"/>
<path fill-rule="evenodd" clip-rule="evenodd" d="M14.1625 0.988239C14.3167 1.14248 14.3167 1.39255 14.1625 1.54679L9.42298 6.28629C9.26874 6.44053 9.01866 6.44053 8.86442 6.28629C8.71018 6.13205 8.71018 5.88197 8.86442 5.72773L13.6039 0.988239C13.7582 0.833998 14.0082 0.833998 14.1625 0.988239Z" fill="white" stroke="white" stroke-width="0.5" stroke-linecap="round" stroke-linejoin="round"/>
<path fill-rule="evenodd" clip-rule="evenodd" d="M32.4622 19.8149C32.6165 19.9691 32.6165 20.2192 32.4622 20.3735L28.1177 24.718C27.9635 24.8722 27.7134 24.8722 27.5592 24.718C27.4049 24.5637 27.4049 24.3137 27.5592 24.1594L31.9037 19.8149C32.0579 19.6607 32.308 19.6607 32.4622 19.8149Z" fill="white" stroke="white" stroke-width="0.5" stroke-linecap="round" stroke-linejoin="round"/>
<path fill-rule="evenodd" clip-rule="evenodd" d="M20.0851 0.986466C20.2403 1.13972 20.2419 1.38979 20.0886 1.54501L9.81975 11.9456C9.66649 12.1008 9.41642 12.1024 9.2612 11.9491C9.10598 11.7959 9.10439 11.5458 9.25765 11.3906L19.5265 0.990024C19.6798 0.834804 19.9299 0.833211 20.0851 0.986466Z" fill="white" stroke="white" stroke-width="0.5" stroke-linecap="round" stroke-linejoin="round"/>
<path fill-rule="evenodd" clip-rule="evenodd" d="M32.5938 13.2316C32.7481 13.3859 32.7481 13.636 32.5938 13.7902L22.5882 23.7958C22.434 23.95 22.1839 23.95 22.0297 23.7958C21.8755 23.6416 21.8755 23.3915 22.0297 23.2372L32.0353 13.2316C32.1895 13.0774 32.4396 13.0774 32.5938 13.2316Z" fill="white" stroke="white" stroke-width="0.5" stroke-linecap="round" stroke-linejoin="round"/>
<path fill-rule="evenodd" clip-rule="evenodd" d="M26.4084 1.12209C26.5614 1.27757 26.5594 1.52764 26.4039 1.68063L9.94737 17.8739C9.79189 18.0269 9.54183 18.0249 9.38884 17.8694C9.23584 17.7139 9.23786 17.4638 9.39334 17.3109L25.8499 1.11759C26.0054 0.964596 26.2555 0.966613 26.4084 1.12209Z" fill="white" stroke="white" stroke-width="0.5" stroke-linecap="round" stroke-linejoin="round"/>
<path fill-rule="evenodd" clip-rule="evenodd" d="M32.5939 7.04439C32.7482 7.19863 32.7482 7.44871 32.5939 7.60295L16.0057 24.1912C15.8515 24.3454 15.6014 24.3454 15.4471 24.1912C15.2929 24.0369 15.2929 23.7869 15.4471 23.6326L32.0354 7.04439C32.1896 6.89015 32.4397 6.89015 32.5939 7.04439Z" fill="white" stroke="white" stroke-width="0.5" stroke-linecap="round" stroke-linejoin="round"/>
<path fill-rule="evenodd" clip-rule="evenodd" d="M32.3306 1.11983C32.4848 1.27407 32.4848 1.52414 32.3306 1.67839L9.68636 24.3226C9.53212 24.4769 9.28204 24.4769 9.1278 24.3226C8.97356 24.1684 8.97356 23.9183 9.1278 23.7641L31.772 1.11983C31.9263 0.96559 32.1764 0.96559 32.3306 1.11983Z" fill="white" stroke="white" stroke-width="0.5" stroke-linecap="round" stroke-linejoin="round"/>
</svg>
