<svg width="8" height="8" viewBox="0 0 8 8" fill="none" xmlns="http://www.w3.org/2000/svg">
<path d="M1 1L7.36396 7.36396" stroke="#3898CD"/>
<line x1="0.999962" y1="7.36398" x2="7.36392" y2="1.00002" stroke="#3898CD"/>
</svg>
