%YAML 1.1
%TAG !u! tag:unity3d.com,2011:
--- !u!1045 &1
EditorBuildSettings:
  m_ObjectHideFlags: 0
  serializedVersion: 2
  m_Scenes:
  - enabled: 1
    path: Assets/Scenes/MainMenu.unity
    guid: b2b3cad2c4023ad47ba775e81377ee58
  - enabled: 1
    path: Assets/Scenes/NightDemo.unity
    guid: 69f5c3ee8b0de6e48b09ff0713012ae1
  m_configObjects: {}
