:1080000018F09FE518F09FE518F09FE518F09FE540
:1080100018F09FE518F09FE518F09FE518F09FE530
:1080200040800000B0800000B0800000B080000000
:10803000B0800000B0800000F480000014810000D7
:108040000209A0E30010A0E3FC03B0E8FC03A1E8F0
:10805000FC03B0E8FC03A1E8D200A0E300F021E1BA
:1080600002D9A0E3D100A0E300F021E101D9A0E30F
:10807000D300A0E300F021E102D3A0E3100F11EE42
:10808000040080E3020B80E3010A80E3100F01EE9D
:10809000501F11EE0F1681E3501F01EE0010A0E3F8
:1080A000951F07EE0101A0E3100AE8EE180200EBAD
:1080B000FEFFFFEA001080E51EFF2FE1B010C0E1D7
:1080C0001EFF2FE10010C0E51EFF2FE1000090E52C
:1080D0001EFF2FE10E00A0E11EFF2FE110FF2FE198
:1080E0001EFF2FE100000FE18000C0E300F021E15E
:1080F0001EFF2FE104E02DE5010200EB04E09DE40A
:1081000004F05EE200000FE14000C0E300F021E176
:108110001EFF2FE10F402DE9760100EB0F40BDE877
:1081200004F05EE210402DE918409FE5F918A0E345
:108130000400A0E1DEFFFFEB0400A0E11040BDE879
:1081400004109FE5DAFFFFEA08B400200002F900FE
:1081500000009FE5DCFFFFEA20B4002001C052E2EE
:108160001EFF2F01043081E2F0402DE904E080E29F
:108170000E0051E1030050310130A0230030A03344
:108180000B005CE30030A09301300382000053E356
:108190003600000A003061E2033013E22F00000ACB
:1081A00000E0D1E5010053E300E0C0E5014080E2DA
:1081B000015081E2026042E20B00000A01E0D1E5D9
:1081C000030053E301E0C0E5024080E2025081E297
:1081D000036042E20400001A02E0D1E5046042E2DA
:1081E00002E0C0E5034080E2035081E20070A0E3BA
:1081F00003C04CE004204CE22221A0E101E082E235
:10820000031081E0030080E00E21A0E1017087E20D
:10821000043091E407005EE1043080E4FAFFFF8A55
:1082200002005CE1023046E0021084E0022085E0BA
:10823000F080BD080E01D5E7010053E30E01C4E74D
:10824000F080BD080100D2E5020053E30100C1E562
:108250000D00000A0230D2E50230C1E5F080BDE831
:108260000C60A0E10150A0E10040A0E1DEFFFFEAC8
:10827000010040E20C3081E00120D1E4030051E133
:108280000120E0E5FBFFFF1AF080BDE8F080BDE8CB
:1082900070402DE90060A0E10150A0E120409FE581
:1082A0000400A0E188FFFFEB000050E3FBFFFFBAF2
:1082B000051086E00C009FE57DFFFFEB0000A0E3CA
:1082C0007080BDE898B80020A0B8002070402DE96B
:1082D0000060A0E128409FE528509FE50400A0E150
:1082E00079FFFFEB010110E3FBFFFF1A0500A0E19E
:1082F00075FFFFEB0F3000E2060053E1F6FFFF1AB7
:108300007080BDE898B8002080B8002014309FE548
:10831000011181E0003093E5010380E0030080E07B
:108320000210A0E166FFFFEAE0E3020070402DE9E1
:10833000C010A0E394029FE55DFFFFEB0010A0E3F7
:108340008C029FE55AFFFFEB88129FE588029FE5AC
:1083500057FFFFEB0810A0E380029FE554FFFFEBFF
:108360000810A0E378029FE551FFFFEB051DA0E395
:1083700070029FE54EFFFFEBF010A0E368029FE55F
:108380004BFFFFEB64129FE564029FE548FFFFEBA4
:108390000810A0E35C029FE545FFFFEB0810A0E397
:1083A00054029FE542FFFFEB051DA0E34C029FE551
:1083B0003FFFFFEBF010A0E344029FE53CFFFFEB23
:1083C00040129FE540029FE539FFFFEB0410A0E358
:1083D00038029FE536FFFFEB0410A0E330029FE573
:1083E00033FFFFEB0810A0E328029FE530FFFFEB0F
:1083F00024129FE524029FE52DFFFFEB0810A0E368
:108400001C029FE52AFFFFEB0810A0E314029FE582
:1084100027FFFFEB0010A0E30C029FE524FFFFEB1A
:108420000010A0E304029FE521FFFFEB00129FE58F
:1084300000029FE51EFFFFEB4810A0E3F8019FE557
:108440001BFFFFEB4810A0E3F0019FE518FFFFEBD7
:108450000010A0E3E8019FE515FFFFEB1010A0E37B
:10846000E0019FE512FFFFEBFF14A0E3D8019FE5B9
:108470000FFFFFEBD4119FE5D4019FE50CFFFFEB4D
:10848000D0119FE5D0019FE509FFFFEBCC119FE5DF
:10849000CC019FE506FFFFEBC8119FE5C8019FE5F2
:1084A00003FFFFEBC4119FE5C4019FE500FFFFEB55
:1084B000C0119FE5C0019FE5FDFEFFEBBC119FE5EC
:1084C000BC019FE5FAFEFFEBFF14A0E3B4019FE5BA
:1084D000F7FEFFEBB0119FE5B0019FE5F4FEFFEB67
:1084E000AC119FE5AC019FE5F1FEFFEBFF1CE0E363
:1084F000A4019FE5EEFEFFEBA0119FE5A0019FE523
:10850000EBFEFFEBFF10E0E398019FE5E8FEFFEBD9
:10851000FF18E0E390019FE5E5FEFFEB0010E0E3CC
:1085200088019FE5E2FEFFEB84119FE584019FE552
:10853000DFFEFFEB0810A0E37C019FE5DCFEFFEB14
:108540000810A0E374019FE5D9FEFFEB0010A0E343
:108550006C019FE5D6FEFFEB0010A0E364019FE5F0
:10856000D3FEFFEB0010A0E35C019FE5D0FEFFEB24
:1085700058419FE50400A0E1D3FEFFEB000050E36B
:10858000FBFFFFBA50109FE544019FE5C8FEFFEBDB
:1085900038419FE53C519FE50400A0E1CAFEFFEB96
:1085A000010110E3FBFFFF1A0500A0E1C6FEFFEB8F
:1085B0000F0000E2080050E3F6FFFF1A00019FE5FC
:1085C000C1FEFFEB10319FE5000083E57080BDE840
:1085D000000004400400044003800400080004403C
:1085E0000C00044010000440140004401800044033
:1085F000048004001C0004402000044024000440C7
:10860000280004402C000440058004003000044091
:1086100034000440380004403C0004400980040059
:108620004000044044000440480004404C00044022
:10863000500004400B8004005400044058000440E3
:108640005C00044060000440640004406800044092
:108650000000A0FF6C000440A00000FF7000044078
:10866000A000A0FF7400044000A000FF78000440B8
:1086700000A0A0FF7C000440A0A000FF80000440F8
:10868000A0A0A0FF84000440880004400000FFFF79
:108690008C000440FF0000FF900004409400044060
:1086A00000FF00FF980004409C000440A00004402C
:1086B000A400044001000400A8000440AC000440F1
:1086C000B0000440B4000440B8000440BC000440C2
:1086D00098B80020A0B8002080B80020E0E3020095
:1086E0000130A0E3000052E3130180117000EF1687
:1086F000130100001EFF2FE170402DE9D4419FE5DA
:10870000D4519FE5003094E5003093E5231CA0E1AF
:10871000041011E2003085E52D00000A0114A0E3E9
:10872000B8019FE562FEFFEBB4119FE5B4019FE540
:108730005FFEFFEB0130D5E5A90053E30100000A1D
:10874000C00053E33400000A0030E0E398619FE585
:108750000030C6E5FF10A0E380019FE554FEFFEB6B
:108760000010D6E584019FE551FEFFEB0114A0E364
:1087700078019FE54EFEFFEB0114A0E35C019FE54D
:108780004BFEFFEB68019FE54FFEFFEB64319FE579
:10879000000085E5000093E5041094E5FA0C80E202
:1087A000C80080E246FEFFEB043094E5013083E22E
:1087B000030053E3043084E50130A0030430840552
:1087C000082094E5003092E5023383E3003082E52F
:1087D0007080BDE80C019FE535FEFFEB0130D5E56B
:1087E000AB0053E31100000AC00053E31B00000A72
:1087F000AA0053E3F1FFFF1AF8309FE50020D5E50A
:10880000000093E5F0309FE5FA0C80E2CB0080E2B7
:10881000041094E50020C3E5E1FFFFEADC309FE5AA
:10882000C4609FE50030D3E50030C6E5C8FFFFEA2D
:108830000030D5E5A323B0E1E0FFFF0AA320A0E1CB
:10884000072002E2030052E302F19F97DBFFFFEAF9
:10885000C0880000A888000090880000748800008C
:108860000030D5E594209FE5A330A0E10030C2E5BB
:10887000D2FFFFEA80209FE5010013E30030D2E53C
:1088800008308313083003020030C2E5CBFFFFEA53
:1088900064209FE5010013E30030D2E50430831328
:1088A00004300302F7FFFFEA4C209FE5010013E3C9
:1088B0000030D2E50230831302300302F1FFFFEAF9
:1088C00034209FE5010013E30030D2E5013083132B
:1088D00001300302EBFFFFEABC8B0000D8E302008B
:1088E000280020204992240000002020DDE302001F
:1088F0001C00202034002020E0E30200D4E302002A
:10890000DCE302000010A0E300009FE5E8FDFFEAC1
:108910000CB40020F84F2DE983FEFFEB0210A0E31A
:1089200054029FE5E2FDFFEB0010A0E34C029FE53F
:10893000DFFDFFEB0010A0E344029FE5DCFDFFEB51
:10894000011AA0E33C029FE5D9FDFFEB0114A0E36F
:1089500034029FE5D6FDFFEB0114A0E32C029FE556
:10896000D3FDFFEB0114A0E31C029FE5D0FDFFEB5C
:108970001C029FE5D4FDFFEB3F10C0E310029FE512
:10898000CBFDFFEB0213A0E308029FE5C8FDFFEB60
:1089900004029FE5CCFDFFEB021380E3F8019FE5A5
:1089A000C3FDFFEBB410A0E3F0019FE5C0FDFFEBBA
:1089B0000270A0E3D2FDFFEB0460A0E3E0919FE52D
:1089C000E0419FE5E0B19FE5E0519FE5E0819FE553
:1089D0000020A0E31FA0A0E3000000EA00209BE528
:1089E000003099E5000095E5333AA0E1010013E37A
:1089F0000830CAE304C0A01302C0A0030610A011EF
:108A00000710A00117005AE307005313033082E256
:108A100000308BE50630820200308B057D3C83E21E
:108A2000643083E201A04AE2000083E00CC084E5E8
:108A3000A3FDFFEB01007AE3E7FFFF1A0020A0E3AC
:108A40001FA0A0E3000000EA00209BE50030D8E56D
:108A5000000095E5533AA0E1010013E30830CAE3B2
:108A600004C0A01302C0A0030610A0110710A001AB
:108A700017005AE307005313033082E200308BE5FE
:108A80000630820200308B05823C83E2643083E250
:108A900001A04AE2000083E00CC084E588FDFFEB02
:108AA00001007AE3E7FFFF1A0020A0E31FA0A0E384
:108AB00000208BE5000000EA00209BE5003094E5F3
:108AC000000095E5003093E5333AA0E1010013E39F
:108AD0000830CAE304C0A01302C0A0030610A0110E
:108AE0000710A00117005AE307005313033082E276
:108AF00000308BE50630820200308B05873C83E234
:108B0000643083E201A04AE2000083E00CC084E507
:108B10006BFDFFEB01007AE3E6FFFF1A0030A0E3F4
:108B200007A0A0E3000000EA00309BE584209FE559
:108B3000000095E50020D2E5522AA0E1010012E3F1
:108B400004C0A01302C0A003232B83E2672082E2AB
:108B50000610A0110710A001033083E201A04AE231
:108B6000000082E00CC084E500308BE554FDFFEB93
:108B700001007AE3EBFFFF1A94FFFFEA9400202044
:108B800000002020040020200800202028002020B1
:108B90001C0020200C0020208800202040002020E5
:108BA0000CB20020D8E30200BC8B0000CC8B00008C
:0C8BB000E0E30200DDE30200D4E3020079
:108BBC0034002020010000004000202001000000B3
:040000030000800079
:00000001FF
