:020000040000FA
:2000000031B973C36E00FFFFC30C8011E8001803C30F80D3C0001803C31280DBFC47180363
:20002000C31580DBFFA01803C31880E6402804C9C31B80E1000000C9C31E802AC873CB7C48
:200040002806CB4428061807CB442803371801B7CB15CB1422C8737DC9FFFFFFFFFFFFFF7A
:20006000FFFFFFFFFFFFC321803CAB1623162A00807DFE55C281007CFEAAC281002A0A8014
:20008000E9CDD61F21330022C873CD05113E0032C67332C773C31913E1E3E50A6F030A03EB
:2000A00067E3D55E235623E57BB2C2B700E15E235623E5EB5E2356030A07D2DA0003E1E393
:2000C00073237223D1E32BAFBCC2D000BDCAD600E3E5EBC3A300E1EBE3E9E1E3E50F670BE1
:2000E0000A6FE303031A772313E32BAFBDC2F400BCCAF800E3C3E500E1C3C400DD7E07FED6
:20010000002009DD7E053DC8DD7705C9DDE5E11E06160019CD90012015CDA6012B7E3DC884
:20012000772B2BDD7E07CDB10123CB96F6FFC9DD7E08FE00C8DDE5E116001E0919CD90014F
:200140002021CDA6012BCD900128167EE6F05F2B2B2B2B7EE6F0835F7EE60FB377F6FF18E4
:20016000023600C9DD7E04CB6128040F0F0F0FE60FB1D3FFC9DD7E03E60FB2D3FFDD7E0315
:20018000E6F057DD7E04E60FB20F0F0F0FD3FFC93E00ED67D601F5ED6FF1C93E00ED6FD671
:2001A00001F5ED67F1C97EE6F0470F0F0F0FB077C90600CB7F280206FF8677237E88772B2D
:2001C000C92A20702B2B480600CB01CB01095E2356D5DDE1C9DD7501DD74021AE63F47DD1B
:2001E0007E00E6C0B0DD7700C9DD7E00FEFFC8E63FFE3EC0DDE5E1235E2356EBC902000179
:2002000000020001FD0111BA73CD98003ABA73472ABB7322207023235E2356EB1E0A16003C
:2002200036FF1910FB3600214C022222702224702226702228703EFF322A703E9FD3FF3EEE
:20024000BFD3FF3EDFD3FF3EFFD3FFC9FF01000100014D0211BA73CD98003ABA7347C5CD12
:20026000C101DD7E00E63FC1B8C8DD70002B2B562B5EDD7301DD7202CD5F03CD9502C90675
:2002800001CDC1013E00DDBE00C8CDD6021E0A1600DD1918EFDDE5214C02222270222470B2
:2002A0002226702228700601CDC101DD7E00FE002821FEFF2815DD7E00E6C00707075F16CF
:2002C0000021227019DDE5D17323721E0A1600DD1918D8DDE1C9CDE901FEFFC8FE3E20062E
:2002E0001E07160019E9CD2F01CDFC002011DD7E00F5CD5F03C1DD7E00B82803CD9502C91F
:200300003E9F0E901680DD2A2470CD4E033EBF0EB016A0DD2A2670CD4E033EDF0ED016C016
:20032000DD2A2870CD4E033EFF0EF0DD2A2270DD5E001C2004D3FF1814CD6401DD7E04E63C
:200340000F212A70BE2806770EE0CD6401C9DD5E001C2004D3FF1806CD6401CD7501C9DD01
:200360007E00E63FF5DD3600FFDD6E01DD66027E47CB6F281CC5E61F23DD7501DD7402DD8F
:200380003604F0DD7705DD360700DD360800C36104CB67280FCB5F2805C1CD5E02C93EFFC9
:2003A000F5C36104E63CFE042028FDE1FDE5C5235EDD73012356DD720223FDE5F1D5FDE1EA
:2003C00011C603D5FDE916001E07FD19116104D5FDE9C578E603FE00202023232323DD75C4
:2003E00001DD74022B110500CD7804010300EDB8DD360700DD3608001867FE01201B1E0664
:20040000160019DD7501DD74022B1CCD7804010500EDB8DD3608001848FE0220281E0616CF
:200420000019F1F5E6C020012BDD7501DD74022B1E09CD7804010200EDB83E00121B1B0E4E
:2004400003EDB8181C1E08160019DD7501DD74022BDDE5FDE11E09FD19FDE5D1010700ED15
:20046000B8DDE5E1F1C1FEFFC857E63FFE042002063E7AE6C0B077C9DDE5FDE1FD19FDE51E
:20048000D1C90200FEFF010001820411BA73CD98002ABA735E2356EB3ABC73FE00280337B6
:2004A0001801B75E2356234E2346233E00021AF5E60FCAE7043DCAF1053DCA00063DCA008E
:2004C000063D2802F1C91A1F1F1F1FE60F475E235623B72810F1F5E5C5EBCDA304C1E15E4B
:2004E00023562310F0F1C9CD72051A6F131A85FD77052600F13038F53AC373CB4F2831EB6C
:20050000444D6E2600E5292929E5030A6F030A67C1FDE1F1CB7F2803CD9405CDE805CB771A
:200520002803CD9405CDE805CB6F2803CD9405C9EB4E0600C5FDE1237E23666FE5C5D5FDE5
:20054000E53E03CD271CC1E15D54092BCB3CCB1DCB3CCB1DCB3CCB1DCB2BCB2BCB2BB7ED8B
:200560005223E5FDE1E1292929C1093E04CD271CF1C9C5FDE1D55E2356CB7A20147AFE7061
:2005800038063E8012180A80218705010100CD011DD113C9F5C5FDE5D5E53E03CD271CE1DC
:2005A000D1FDE1C1F1F5C5FDE5D5E5CB67200D093E04CD271CE1D1FDE1C1F1C9094D44FD28
:2005C000E5E1E50AC50108002A06800906082B7710FCD5FD2101003E04CD271CD1C1130335
:2005E000E12B7CB520DC18CDC5010001EB09EBC1C9CD7205131AFD7705131AFD7706F1C962
:200600000303030303EB237E5F1600D5235E23562386024E0600C5FDE1EBD1F1D03E01CDD0
:20062000271CC9DDE52ACD73D1732372237023EB3ACB733C21CA73BE200D3E0032CB732A33
:20064000D17322CD73180732CB73ED53CD73C902000100FEFF014F0611BA73CD98003ABA2F
:20066000732ABB7332CA733E0032CB7332CC7322D17322CD7322CF73C93AC673F53E003254
:20068000C6733ACC7321CB73BE28312ACF735E2356234623D5DDE1E5CDE3063ACC733C215F
:2006A000CA73BE200E3E0032CC732AD17322CF73E1180732CC73E122CF7318C6F132C673A0
:2006C000C902000200010001C10611BA73CD9800DD2ABA733ABC73473AC673FE012004CD9A
:2006E0002306C9DD6601DD6E007E4FE60FCAFF063DCA870A3DCADF083DCA5509C3A20EDDAD
:200700005603DD5E02D5FDE1FD5602FD5E01CDE8074BFD5604FD5E03CDE80743FD5E0016B3
:200720000019191E05195E2356EBC5D14E234623DD7E05CB7F2804CD0B08C9C5D5E5FE70AD
:200740002802380767DD6E047E18352A0680DD5605DD5E04E5D5E5010400CD3E1DE17EFE5F
:20076000802003D11819232346235E160023EB18012910FDE5C1EBD113131313CD3E1DE19D
:200780007EFE80280F5E2356234E234623DDE5CD0B08DDE1E1D1C1C5D5E5DD6605DD6E0469
:2007A0003E70BC38032A06807323722371237023DDE5CD9808DDE1E1D1C1DDE5CD0B08DDB3
:2007C000E1DD56053E70BA281E381CDD5E04D92A0680E523235E16002346EB18012910FDF4
:2007E000E5D9C1E1CD011DC9E5CB2ACB1BCB2ACB1BCB2ACB1BCB7A20092180FF19E1D01E79
:200800007FC921800019E1D81E80C9C5D5E5D9E1D1C1CDC008D97BCB7F2003FE20D081CB5B
:200820007FC0B7C8CB7B28207983D5FE2138023E205F1600D5FDE1D17BD9C5ED444F06004C
:2008400009EB09EBC1D9181C7B81FE1F280F380D3E2093D55F1600D5FDE1D11807C50600A4
:20086000C5FDE1C11E007A83CB7F2019FE183015C5D5D9C5D5E5FDE53E02CD271CFDE1E138
:20088000D1C1D9D1C1D9C5060009EB01200009EBC1D91C7BB820CFC9CDC008C50600C5FDEB
:2008A000E1C1C5D5E5FDE53E02CDA31BFDE1E1D1C1C5060009012000EB09EBC10520E3C9B3
:2008C000E5CB7A280426FF180226006A2929292929CB7B280416FF1802160019EBE1C9FDC4
:2008E0002A0680DD6E02DD6603110100194E234678FE00280BFEFFC2540A79FEF9FA540A45
:20090000234E234678FE00280BFEFFC2540A79FEF9FA540A2B2B7EFE00CACA092B4E23461E
:20092000210800097DFD7701DD6E00DD660111050019EB1A6F131A67E5DD6E02DD66031144
:200940000000197ECB270100004FE1097EF680FD7703C3000AFD2A0680DD6E02DD6603114B
:200960000100194E234678FE00280BFEFFC2540A79FEE1FA540A234E234678FE00280BFEAF
:20098000FFC2540A79FEE1FA540A2B2B7EFE00CACA092B4E2346212000097DFD7701DD6EB0
:2009A00000DD660111050019EB1A6F131A67E5DD6E02DD6603110000197ECB270100004F5A
:2009C000E1097EF680FD77031836DD6E02DD6603110100197EFD7701DD6E00DD660111051E
:2009E0000019EB1A6F131A67E5DD6E02DD6603110000197ECB270100004FE1097EFD770395
:200A0000DD6E02DD6603110300197EFD7700DD6E00DD660111050019EB1A6F131A67E5DD9C
:200A20006E02DD6603110000197ECB270100004FE109237EDD6E00DD66011101001986FD4E
:200A40007702AF1600DD5E04FDE5E1FD210100CDBE1F1832FDE5DDE5FDE5FDE5AF1600DD39
:200A60005E04E1FD210100CDBB1F3E00FDE1FD77013E80FD7703AF1600DDE1DD5E04E1FD07
:200A8000210100CDBE1FC9FD2A06803AC373CB4F2004CBB81802CBF8FD7003E5DD6603DD8E
:200AA0006E027EFD7704EE8077235E7BE607ED44C608FD77012356CDE807FD7311235E7BDC
:200AC000E607FD77002356CDE807FD73122A068011130019FD5612FD5E11010303CD9808CC
:200AE000DD5605DD5E04DD7E06DDE1FD2A0680FD7705D52A068001060009010B007AFE70B1
:200B00003005CDE21F1803EBEDB02A068011130019D9ED5B068021080019EBD9FD2A0680E8
:200B2000FD4E0506097E91FE12300EFE093802D609D96F2600197ED9772310E9D12A0680E7
:200B400001110009010B007AFE703005CDDF1F1802EDB0DDE5ED5B068021130019EB0114F2
:200B6000000906091A13D511080019E55F16004FC53E09900600D60338030418F978FD2A16
:200B80000680FD8612FDCB037EFD21010020293E03CDBB1FC12A0680C51184001959CB3B5E
:200BA000CB3BCB3B16003E09904F060009FD2101003E04CDBB1F1821CB2FCB2FCB2FFE03AE
:200BC000301757D5E53E03CDBB1FE111680019D1FD2101003E04CDBB1FC1E1D11086DDE1C2
:200BE000D9DD5603DD5E02DD4605DD4E04D9DDE5E1FD2A0680FD7E04874F0600110600199E
:200C0000095E23562A0680017C0009E5C50105007AFE703005CDE21F1803EBEDB0FD2A0653
:200C200080C1FD09FD7E04FD2A0680FD7702D12A06800164000906041ADDBE01D53016D928
:200C40008787876F260009E5D9D1EBC5010800EDB0C1EB1830DD9601D98787876F260019F8
:200C6000E5D9D17AFE703014C5E5D5010800CDE21F010800E109EBE109C11809EBC5010800
:200C800000EDB0C1EBD11310AFFD2A0680ED5B0680211C0019FD4E00060009E5DDE1216415
:200CA0000019E53E1008E15623E5010F00095EEBFD4601AF05FABC0C291718F85FCD2F0ECC
:200CC000FD7E003CFD7700FE082804FE102005011000DD09DD23083D28030818C9E1FDCB8B
:200CE000037E201F2A068001840009FD5602FDCB034E20040E0F18020E0006097EA1B277C8
:200D00002310F9FD7E05FDCB047E2802C6094F2A0680111300190609773C2310FBFDCB03ED
:200D20007E20735916002A0680011C0009FD2109003E03CDBE1FFD2A06802A068001840069
:200D400009DD2A0680011300DD090609DD7E00DD23CB3FCB3FCB3F5F1600C53E0990060064
:200D6000FE033805D6030418F7FD8611FE20301778FD8612FE18300FDDE5E53E04FD2101E6
:200D800000CDBE1FE1DDE1C123130578FE0020BCFD2A068018540600C5798080804F21006F
:200DA00000111800783DFAAC0D1918F9FD2A0680FD7E1280FE18302BCB3FCB3FCB3F57597F
:200DC000D5011C0009ED4B068009E5FD2103003E03CDBE1FE111680019D1FD2103003E04B9
:200DE000CDBE1FC10478FE0320AEFD2A0680FD460678FE802821FD4E07FD6611FD6E12B70E
:200E0000ED4228132A068011080019FD5E06FD5607010303CD0B08FD2A06802A0680111363
:200E20000019FD5E11FD5612010303CD0B08C9FDCB03462016DDB600DD77007CDDB608DDF6
:200E400077087DDDB610DD77101814B72803DD77007CB72803DD77087DB72803DD7710FDB3
:200E6000CB037E283CDDE5016800DD09FD4602FDCB034E20040E0F18020E007BB72808DDAB
:200E80007E00A1B0DD77007CB72808DD7E08A1B0DD77087DB72808DD7E10A1B0DD7710DD5B
:200EA000E1C9C5D9DD6603DD6E027E234E2346235E2356D987875F160023194E2346235E35
:200EC00023566069C17948CB3FCB3FCB3FCB3F47C5DDE5E5D5DD6E04DD6605DD23DD2323E4
:200EE000235E2356D5FDE1D1E17EFDCB007E2802CBFFFD7700231AD96F260009FD7501FD43
:200F00007402D9131AD96F260019FD7503FD7404D91310BFFDE1010400FD09D1FD6E00FD07
:200F20006601FD23FD23E5DDE1FDE5D543CDFA1FD1FDE11520E6C92AD373CB6ECC490FCB5C
:200F400066200523232318F2C9E5CB5E282BCB76200D235E23561B7BB22034E1E5182C2338
:200F60005E2356EB5E23561B7BB22023235E23562B2B722B73E1E5181223352010E1E5CBE4
:200F800076280823237E2B772BE1E5CBFEE1C9722B7318F902000200020001940F11BA73D8
:200FA000CD98002ABA73ED5BBC7322D3733630EB22D573C90100010001B40F11BE73CD98A5
:200FC000003ABE734F2AD37347110300B72808CB66206A190D20F8CB6E2062CBEECB7628CF
:200FE0005CCB5E2858235E2356D52AD373E5CB66202ECB6E20237EE648FE48201C23237EDB
:20100000BA381620082B7EBB380F283123562B5E1B1B1B1B7323721800E1232323E518CEF9
:201020000600B7E1D1E52AD573ED524D6B6223232323EDB0010800ED4222D573E1C902001A
:2010400001000200013E1011BF73CD98002AC0733ABF734FEB2AD373AF47CB6E283EE57E2B
:20106000E610F62077AFB2200BB12802CBF6237323731842CBDE79B7281BD5EB2AD573EB06
:20108000CBF623732372EBD1732372237323722322D57318212373237223181ACB662006D8
:2010A0002323230418B4D5E5232323043630EBE1CBA6EBD118A4E1CBAE78C9010001000117
:2010C000BB1011C273CD98003AC2734F2AD37347110300B72808CB66200C190D20F8CB6E56
:2010E0002004CB7E2003AF180ACB762002CBEECBBE3E01B7C90F06010309000A0F020B07DC
:201100000F0504080FD3C0AFDD2A0880DD23DD23FD21D773060ADD7700DD23FD7700FD236F
:20112000FD7700FD230520EE32EB7332EC7332EE7332EF7332F07332F173C900C97CFE0089
:201140002004DBFC1802DBFF2FC9DBFC2F32EE73DBFF2F32EF73D380CD3B11DBFC2F32F0DE
:2011600073DBFF2F32F173D3C0C9DBFC21EB73CB672008CB6F200335180134DBFFCB672046
:201180000923CB6F200335180134C97DFE01281A01EB737CFE002801030A5FAF02CD3D1183
:2011A00057E60F6F7AE640671816D380CD3D1157D3C0E60F21F51006004F096E7AE64067F9
:2011C000C9CD4A11FD21D773DD2A0880DDE5DD7E00CB7F281E47110200DD19E60728093AD2
:2011E000EE7321EB73CD201278E61828063AF073CD3F12DDE1DD7E01CB7F282347110A00A0
:20120000FD19110700DD19E60728093AEF7321EC73CD201278E61828063AF173CD3F12C948
:201220004FCB482804CDB91279CB402804CD891279CB5028097EDD8602DD7702AF77C94F34
:20124000CB582804CDE91279CB602803CD5012C9C5D5E5E60F5FFD4608FD7E09FE00201AD6
:201260007BB82805FD7308181C3E01FD770921F5101600197EDD7704180B7BB82807FD7386
:2012800008AFFD7709E1D1C1C9C5D5E6405FFD4600FD7E01FE0020137BB82805FD730018E7
:2012A000153E01FD7701DD7300180B7BB82807FD7300AFFD7701D1C1C9C5D5E60F5FFD4670
:2012C00002FD7E03FE0020137BB82805FD730218153E01FD7703DD7301180B7BB82807FDD5
:2012E0007302AFFD7703D1C1C9C5D5E6405FFD4606FD7E07FE0020137BB82805FD730618EF
:20130000153E01FD7707DD7303180B7BB82807FD7306AFFD7707D1C1C92100001100403E7B
:2013200000CDD418CDE918CD271921A318116000E5D57EFEFF281B470421C31411080010E8
:2013400015D1D5FD2101003E03CDBE1FD1E1132318DED1E118031918E6214D14118500FDF1
:201360002116003E02CDBE1F21631411A500FD2116003E02CDBE1F21C114119B00FD21021E
:20138000003E02CDBE1F21B41411AA02FD210D003E02CDBE1F213B141100003E04FD2112B5
:2013A00000CDBE1F06010EC0CDD91F2100807EFEAA204C237EFE552046212480CD4619115A
:2013C0002480210102CD5119212480CD461923545DCD461921C101CD5119212480CD461912
:2013E00023CD46192311AC02FD2104003E02CDBE1FCD681906010E80CDD91F2A0A80E9214A
:20140000791411AA01FD210D003E02CDBE1F21861411E401FD211A003E02CDBE1F21A014C6
:20142000112702FD2114003E02CDBE1F21008ACD6B1906010E80CDD91F18FE000000F0F00A
:20144000F0F0F0F0F0F0F0D08090B0304060616869707178798081888964656C74757C8468
:20146000858C8D62636A6B72737A7B82838A8B66676D76777D86878E8F5455524E20474181
:201480004D45204F46464245464F524520494E53455254494E472043415254524944474584
:2014A0004F5220455850414E53494F4E204D4F44554C452E1D203139383220434F4C45430B
:2014C0004F1E1F00000000000000003F7FFFFFF3F3F0F00080C0C0C0C000003F7FFFFFF3CF
:2014E000F3F3F30080C0C0C0C0C0C0F0F0F0F0F0F0F0F0FFFFFFF0F0FFFFFFC0C0C0000079
:20150000000000F1F1F17B7B7B3F3FE0E0E0C0C0C080801F3F7F79787F7F3F80C0E0E0001E
:2015200080C0E0F3F3FBFBFBFFFFFFC0C0C0C0C0C0C0C0F3F3FFFF7F3F0000C0C0C0C08095
:20154000000000F0F0FFFFFFFF00000000C0C0C0C000003F1F1F1F0E0E0000800000000077
:20156000000000F0F0F0F0F0F000001F01797F3F1F0000E0E0E0E0C0800000FFF7F7F7F3BE
:20158000F30000C0C0C0C0C0C000007E81BDA1A1BD817E1F04040400000000446C5454009B
:2015A0000000000000000000000000202020202000200050505000000000005050F850F89B
:2015C0005050002078A07028F02000C0C810204098180040A0A040A8906800202020000023
:2015E0000000002040808080402000201008080810200020A8702070A82000002020F8204B
:201600002000000000000020204000000000F800000000000000000000200000081020409A
:20162000800000708898A8C88870002060202020207000708808304080F800F80810300892
:2016400088700010305090F8101000F880F00808887000384080F088887000F80810204012
:201660004040007088887088887000708888780810E000000020002000000000002000200A
:2016800020400010204080402010000000F800F8000000402010081020400070881020206A
:2016A0000020007088A8B8B080780020508888F8888800F08888F08888F00070888080801A
:2016C000887000F08888888888F000F88080F08080F800F88080F0808080007880808098B2
:2016E000887800888888F888888800702020202020700008080808088870008890A0C0A00A
:20170000908800808080808080F80088D8A8A8888888008888C8A8988888007088888888B9
:20172000887000F08888F08080800070888888A8906800F08888F0A0908800708880700801
:20174000887000F82020202020200088888888888870008888888888502000888888A8A839
:20176000D8880088885020508888008888502020202000F80810204080F800F8C0C0C0C069
:20178000C0F8000080402010080000F81818181818F8000000205088000000000000000039
:2017A0000000F8402010000000000000007088F88888000000F0487048F000000078808069
:2017C0008078000000F0484848F0000000F080E080F0000000F080E080800000007880B899
:2017E00088700000008888F88888000000F8202020F8000000702020A0E000000090A0C069
:20180000A09000000080808080F800000088D8A8888800000088C8A89888000000F8888868
:2018200088F8000000F088F08080000000F888A890E0000000F888F8A09000000078807018
:2018400008F0000000F8202020200000008888888870000000888890A0400000008888A850
:20186000D88800000088602060880000008850202020000000F8102040F800384020C02008
:201880004038004020100810204000E01020182010E00040A8100000000000A850A850A820
:2018A00050A85501020E0F0809121303040E0F05140000050010110A0B15160607101105AF
:2018C00014000001020E0F03040E0F03040E0F0C0D1718FF4F7DD3BF7CF640D3BF79D3BE99
:2018E0001B7AB320F8CDDC1FC906000E00CDD91F06010E80CDD91F3E02210018CDB81F3E69
:2019000004210020CDB81F3E03210000CDB81F3E0021001BCDB81F3E01210038CDB81F0678
:20192000070E00CDD91FC9218B15111D00FD2160003E03CDBE1F21A315110000FD210100A3
:201940003E03CDBE1FC90100007EFE2FC8230318F8C5FDE13E20991F06004F09444D626BB4
:2019600050593E02CDBE1FC9210017CD0B001B7AB320FB2B7CB520F3C92100001100403EB0
:2019800000CD821FCD851F060F0E04CDD91FCD7F1F217C1A112500FD2116003E02CDBE1F06
:2019A00021921A116500FD2117003E02CDBE1F11C500CDCA1A110501CDCA1A114501CDCA88
:2019C0001A118501CDCA1A11E501CDCA1A112502CDCA1A116502CDCA1A11A502CDCA1A1171
:2019E0000501CDD71A114501CDDC1A118501CDE11A21C21A11E501CDE41A21C31A112502B5
:201A0000CDE41A21C41A116502CDE41A21C51A11A502CDE41A110F01CDD71A114F01CDDC4D
:201A20001A118F01CDE11A11F101CDEE1A113102CDEE1A117102CDEE1A11B102CDEE1A112F
:201A40002F02CDD71A116F02CDDC1A11AF02CDE11A11FB01CDFB1A113B02CDFB1A117B021B
:201A6000CDFB1A11BB02CDFB1A2AFA731120003EF4CD821F06010EC0CDD91FC9544F2053F3
:201A8000454C4543542047414D45204F5054494F4E2C505245535320425554544F4E204F82
:201AA0004E204B45595041442E31203D20534B494C4C20312F4F4E4520504C41594552321E
:201AC00033343536373854574F5321A91AFD2116003E02CDBE1FC921BF1A180821C01A1880
:201AE0000321C11AFD2101003E02CDBE1FC921C61AFD2103003E02CDBE1FC921C91AFD211E
:201B000001003E02CDBE1FC902000100020001081B11BA73CD98003ABA732ABB734F060031
:201B2000DD21F273DD09DD09DD7500DD74013AC373CB4F282779FE032806FE042810181CE3
:201B400006047DB420040E0318280E07182406037DB420040E7F181A0EFF1816FD21761B7D
:201B6000FD09FD09FD7E00FD4601CB3CCB1D3D20F94DCDCA1CC907050B060A020B0406034B
:201B80000500010001000100FEFF020001801B11BA73CD98003ABA73ED5BBB73FD2ABF73C9
:201BA0002ABD73CDAA1BCD3E1DC9FD22FE73DD21F2734F0600FE0420073AC373CB4F282CF9
:201BC000FD21FF1BFD09FD7E00FE00281FCB23CB123D20F9C5ED4BFE73FD7E00FE00280BCC
:201BE000CB21CB103D20F9ED43FE73C1E5DD09DD09DD6E00DD660119EBE1ED4BFE73C902CD
:201C0000030003030500010001000100FEFF020001041C11BA73CD98003ABA73ED5BBB7313
:201C2000FD2ABF732ABD73F5FE0020223AC773FE01201BF1E52A02807BCB27CB275F19EBCA
:201C4000FDE5C179CB27CB274FE1EDB01807F1CDAA1BCD011DC90100010001561C11BA73AE
:201C6000CD98003ABA7347AF2A048077233CB820FAC90100010001721C11BA73CD98003A15
:201C8000BA73DD2A0480F5FD21F273FD5E00FD56017BD3BF7AF640D3BFF12A0280DD4E004E
:201CA000DD2306000909090906040EBEEDA3000020FA3D20E5C902000100010001B61C1187
:201CC000BA73CD98002ABA734C4579D3BF78C680D3BF78FE0020047932C37378FE01200419
:201CE0007932C473C90300FEFF0200020001E51C11BA73CD98002ABA73ED5BBC73ED4BBECC
:201D000073E5D5E1110040197DD3BF7CD3BFC5D1E10EBE43EDA30000C2141D15FA211D20B8
:201D2000F3C90300FEFF0200020001221D11BA73CD98002ABA73ED5BBC73ED4BBE737BD37B
:201D4000BF7AD3BFC5D10EBE43EDA20000C2491D15FA561D20F3C9DBBFC9DD21961D1810C2
:201D6000DD21B71D180ADD21E51D1804DD21071ED908DDE508F508F1D9D5D9D1FD21010020
:201D80002A0680CDA31BDDE1DDE5DDE9130B78B1D920E1DDE1C92A0680010800E5D109EBB7
:201DA000CD001FCD721ECD5D1EFE012006CD891ECD9A1ED92318D52A0680010800E5D10913
:201DC000EBCD4E1FCD721ECD5D1EFE012013CD891E2A0680010800E5D109EBCD4E1FCD9A8F
:201DE0001ED92318A72A0680010800E5D109EBCD121FCD721ECD5D1EFE012006CD891ECD9E
:201E00009A1ED923C38C1D2A0680010800E5D109EBCDAB1E08F508F1D9E5D9D12A0680019A
:201E2000080009FD210400CD271CCD5D1EFE012024CD891E2A0680010800E5D109EBCDEA46
:201E40001E3E04D9E5D9D12A068001080009FD210400CD271CD923232323C38C1D08F508F0
:201E6000F1FE03200A21C373CB4E28033E01C93E00C908F508F1D9E5D9D12A068001080085
:201E800009FD210100CD271CC93E04D9D5D9D12A0680FD210100CDA31BC93E04D9E5D9D1DA
:201EA0002A0680FD210100CD271CC9E5DDE1D5FDE1010800DD7E00DD23571E04CB17CB1486
:201EC000CB12CB141D20F51E04CB17CB15CB12CB151D20F5FD7400FD7510FD23FD7400FDC0
:201EE0007510FD230B79B020CBC9011000E57E23121312130B79FE082001E179B020EFC9E7
:201F0000010800463E80CB101F30FB1223130D20F2C9E5DDE1EB010800DDCB0016CB1EDD44
:201F2000CB0116CB1EDDCB0216CB1EDDCB0316CB1EDDCB0416CB1EDDCB0516CB1EDDCB067E
:201F400016CB1EDDCB0716CB1E230D20CCC901070009037E12132B0B78B120F7C9FFFFFFFC
:201F6000FFC30003C38804C3C706C35A1DC3601DC3661DC36C1DC34A11C38B11C37919C31C
:201F80002719C3D418C3E918C36A11C30E1BC38C1BC3101CC35A1CC3761CC39A0FC3B80F87
:201FA000C34410C3BF10C3BC1CC3ED1CC32A1DC35506C30302C35102C31D1BC3A31BC327A5
:201FC0001CC3661CC3821CC3AA0FC3C40FC35310C3CB10C3370FC33B02C3CA1CC3571DC3BD
:201FE000011DC33E1DC36406C37906C3C111C31302C35E02C37F02C3A304C3D806C33B0059
:00000001FF
