
AF
32
C1
20
CD
CF
01
3A
67
20
0F
DA
72
08
CD
13
02
CD
CF
01
CD
B1
00
CD
D1
19
06
20
CD
FA
18
CD
18
16
CD
0A
19
CD
F3
15
CD
88
09
3A
82
20
A7
CA
EF
09
CD
0E
17
CD
35
09
CD
D8
08
CD
2C
17
CD
59
0A
CA
49
08
06
04
CD
FA
18
CD
75
17
D3
06
CD
04
18
C3
1F
08
00
00
00
11
BA
1A
CD
F3
08
06
98
DB
01
0F
0F
DA
6D
08
0F
DA
98
07
C3
7F
07
3E
01
C3
9B
07
CD
1A
02
C3
14
08
3A
08
20
47
2A
09
20
EB
C3
86
08
00
00
00
3A
67
20
67
2E
FC
C9
21
11
2B
11
70
1B
0E
0E
CD
F3
08
3A
67
20
0F
3E
1C
21
11
37
D4
FF
08
3E
B0
32
C0
20
3A
C0
20
A7
C8
E6
04
C2
BC
08
CD
CA
09
CD
31
19
C3
A9
08
06
20
21
1C
27
3A
67
20
0F
DA
CB
08
21
1C
39
CD
CB
14
C3
A9
08
DB
02
E6
03
C6
03
C9
3A
82
20
FE
09
D0
3E
FB
32
7E
20
C9
3A
CE
20
A7
C0
21
1C
39
06
20
C3
CB
14
0E
03
1A
D5
CD
FF
08
D1
13
0D
C2
F3
08
C9
11
00
1E
E5
26
00
6F
29
29
29
19
EB
E1
06
08
D3
06
C3
39
14
3A
09
20
FE
78
D0
2A
91
20
7D
B4
C2
29
09
21
00
06
3E
01
32
83
20
2B
22
91
20
C9
CD
11
16
2E
FF
7E
C9
CD
10
19
2B
2B
7E
A7
C8
06
15
DB
02
E6
08
CA
48
09
06
10
CD
CA
09
23
7E
B8
D8
CD
2E
09
34
7E
F5
21
01
25
24
24
3D
C2
58
09
06
10
11
60
1C
CD
39
14
F1
3C
CD
8B
1A
CD
10
19
2B
2B
36
00
3E
FF
32
99
20
06
10
C3
FA
18
21
A0
1D
FE
02
D8
23
FE
04
D8
23
C9
CD
CA
09
3A
F1
20
A7
C8
AF
32
F1
20
E5
2A
F2
20
EB
E1
7E
83
27
77
5F
23
7E
8A
27
77
57
23
7E
23
66
6F
C3
AD
09
7A
CD
B2
09
7B
D5
F5
0F
0F
0F
0F
E6
0F
CD
C5
09
F1
E6
0F
CD
C5
09
D1
C9
C6
1A
C3
FF
08
3A
67
20
0F
21
F8
20
D8
21
FC
20
C9
21
02
24
36
00
23
7D
E6
1F
FE
1C
DA
E8
09
11
06
00
19
7C
FE
40
DA
D9
09
C9
CD
3C
0A
AF
32
E9
20
CD
D6
09
3A
67
20
F5
CD
E4
01
F1
32
67
20
3A
67
20
67
E5
2E
FE
7E
E6
07
3C
77
21
A2
1D
23
3D
C2
13
0A
7E
E1
2E
FC
77
23
36
38
7C
0F
DA
33
0A
3E
21
32
98
20
CD
F5
01
CD
04
19
C3
04
08
CD
EF
01
CD
C0
01
C3
04
08
CD
59
0A
C2
52
0A
3E
30
32
C0
20
3A
C0
20
A7
C8
CD
59
0A
CA
47
0A
CD
59
0A
C2
52
0A
C9
3A
15
20
FE
FF
C9
3A
EF
20
A7
CA
7C
0A
48
06
08
CD
FA
18
41
78
CD
7C
09
7E
21
F3
20
36
00
2B
77
2B
36
01
21
62
20
C9
3E
02
32
C1
20
D3
06
3A
CB
20
A7
CA
85
0A
AF
32
C1
20
C9
D5
1A
CD
FF
08
D1
3E
07
32
C0
20
3A
C0
20
3D
C2
9E
0A
13
0D
C2
93
0A
C9
21
50
20
C3
4B
02
3E
40
C3
D7
0A
3E
80
C3
D7
0A
E1
C3
72
00
3A
C1
20
0F
DA
BB
0A
0F
DA
68
18
0F
DA
AB
0A
C9
21
14
2B
0E
0F
C3
93
0A
32
C0
20
3A
C0
20
A7
C2
DA
0A
C9
21
C2
20
06
0C
C3
32
1A
AF
D3
03
D3
05
CD
82
19
FB
CD
B1
0A
3A
EC
20
A7
21
17
30
0E
04
C2
E8
0B
11
FA
1C
CD
93
0A
11
AF
1D
CD
CF
0A
CD
B1
0A
CD
15
18
CD
B6
0A
3A
EC
20
A7
C2
4A
0B
11
95
1A
CD
E2
0A
CD
80
0A
11
B0
1B
CD
E2
0A
CD
80
0A
CD
B1
0A
11
C9
1F
CD
E2
0A
CD
80
0A
CD
B1
0A
21
B7
33
06
0A
CD
CB
14
CD
B6
0A
CD
D6
09
3A
FF
21
A7
C2
5D
0B
CD
D1
08
32
FF
21
CD
7F
1A
CD
E4
01
CD
C0
01
CD
EF
01
CD
1A
02
3E
01
32
C1
20
CD
CF
01
CD
18
16
CD
F1
0B
D3
06
CD
59
0A
CA
71
0B
AF
32
25
20
CD
59
0A
C2
83
0B
AF
32
C1
20
CD
B1
0A
CD
88
19
0E
0C
21
11
2C
11
90
1F
CD
F3
08
3A
EC
20
FE
00
C2
AE
0B
21
11
33
3E
02
CD
FF
08
01
9C
1F
CD
56
18
CD
4C
18
DB
02
07
DA
C3
0B
01
A0
1F
CD
3A
18
CD
B6
0A
3A
EC
20
FE
00
C2
DA
0B
11
D5
1F
CD
E2
0A
CD
80
0A
CD
9E
18
21
EC
20
7E
3C
E6
01
77
CD
D6
09
C3
DF
18
11
AB
1D
CD
93
0A
C3
0B
0B
CD
0A
19
C3
9A
19
13
00
08
13
0E
26
02
0E
0F
00
00
00
00
00
00
00
00
00
00
00
00
00
00
00
00
00
00
00
00
00
00
00
00
00
00
00
00
00
00
00
00
00
00
00
00
00
00
00
00
00
00
00
00
00
00
00
00
00
00
00
00
00
00
00
00
00
00
00
00
00
00
00
00
00
00
00
00
00
00
00
00
00
00
00
00
00
00
00
00
00
00
00
00
00
00
00
00
00
00
00
00
00
00
00
00
00
00
00
00
00
00
00
00
00
00
00
00
00
00
00
00
00
00
00
00
00
00
00
00
00
00
00
00
00
00
00
00
00
00
00
00
00
00
00
00
00
00
00
00
00
00
00
00
00
00
00
00
00
00
00
00
00
00
00
00
00
00
00
00
00
00
00
00
00
00
00
00
00
00
00
00
00
00
00
00
00
00
00
00
00
00
00
00
00
00
00
00
00
00
00
00
00
00
00
00
00
00
00
00
00
00
00
00
00
00
00
00
00
00
00
00
00
00
00
00
00
00
00
00
00
00
00
00
00
00
00
00
00
00
00
00
00
00
00
00
00
00
00
00
00
00
00
00
00
00
00
00
00
00
00
00
00
00
00
00
00
00
00
00
00
00
00
00
00
00
00
00
00
00
00
00
00
00
00
00
00
00
00
00
00
00
00
00
00
00
00
00
00
00
00
00
00
00
00
00
00
00
00
00
00
00
00
00
00
00
00
00
00
00
00
00
00
00
00
00
00
00
00
00
00
00
00
00
00
00
00
00
00
00
00
00
00
00
00
00
00
00
00
00
00
00
00
00
00
00
00
00
00
00
00
00
00
00
00
00
00
00
00
00
00
00
00
00
00
00
00
00
00
00
00
00
00
00
00
00
00
00
00
00
00
00
00
00
00
00
00
00
00
00
00
00
00
00
00
00
00
00
00
00
00
00
00
00
00
00
00
00
00
00
00
00
00
00
00
00
00
00
00
00
00
00
00
00
00
00
00
00
00
00
00
00
00
00
00
00
00
00
00
00
00
00
00
00
00
00
00
00
00
00
00
00
00
00
00
00
00
00
00
00
00
00
00
00
00
00
00
00
00
00
00
00
00
00
00
00
00
00
00
00
00
00
00
00
00
00
00
00
00
00
00
00
00
00
00
00
00
00
00
00
00
00
00
00
00
00
00
00
00
00
00
00
00
00
00
00
00
00
00
00
00
00
00
00
00
00
00
00
00
00
00
00
00
00
00
00
00
00
00
00
00
00
00
00
00
00
00
00
00
00
00
00
00
00
00
00
00
00
00
00
00
00
00
00
00
00
00
00
00
00
00
00
00
00
00
00
00
00
00
00
00
00
00
00
00
00
00
00
00
00
00
00
00
00
00
00
00
00
00
00
00
00
00
00
00
00
00
00
00
00
00
00
00
00
00
00
00
00
00
00
00
00
00
00
00
00
00
00
00
00
00
00
00
00
00
00
00
00
00
00
00
00
00
00
00
00
00
00
00
00
00
00
00
00
00
00
00
00
00
00
00
00
00
00
00
00
00
00
00
00
00
00
00
00
00
00
00
00
00
00
00
00
00
00
00
00
00
00
00
00
00
00
00
00
00
00
00
00
00
00
00
00
00
00
00
00
00
00
00
00
00
00
00
00
00
00
00
00
00
00
00
00
00
00
00
00
00
00
00
00
00
00
00
00
00
00
00
00
00
00
00
00
00
00
00
00
00
00
00
00
00
00
00
00
00
00
00
00
00
00
00
00
00
00
00
00
00
00
00
00
00
00
00
00
00
00
00
00
00
00
00
00
00
00
00
00
00
00
00
00
00
00
00
00
00
00
00
00
00
00
00
00
00
00
00
00
00
00
00
00
00
00
00
00
00
00
00
00
00
00
00
00
00
00
00
00
00
00
00
00
00
00
00
00
00
00
00
00
00
00
00
00
00
00
00
00
00
00
00
00
00
00
00
00
00
00
00
00
00
00
00
00
00
00
00
00
00
00
00
00
00
00
00
00
00
00
00
00
00
00
00
00
00
00
00
00
00
00
00
00
00
00
00
00
00
00
00
00
00
00
00
00
00
00
00
00
00
00
00
00
00
00
00
00
00
00
00
00
00
00
00
00
00
00
00
00
00
00
00
00
00
00
00
00
00
00
00
00
00
00
00
00
00
00
00
00
00
00
00
00
00
00
00
00
00
00
00
00
00
00
00
00
00
00
00
00
00
00
00
00
00
00
00
00
00
00
00
00
00
00
00
00
00
00
00
00
00
00
00
00
00
00
00
00
00
00
00
00
00
00
00
00
00
00
00
00
00
00
00
00
00
00
00
00
00
00
00
00
00
00
00
00
00
00
