Release 14.7 - WebTalk (P.20131013)
Copyright (c) 1995-2010 Xilinx, Inc.  All rights reserved.

Project Information
--------------------
ProjectID=21F67090E219435EBC756829A4C76E87
ProjectIteration=28

WebTalk Summary
----------------
INFO:WebTalk:1 - WebTalk is enabled because you are using a WebPACK license.

INFO:WebTalk:8 - WebTalk Install setting is ON.
INFO:WebTalk:6 - WebTalk User setting is ON.

INFO:WebTalk:5 - D:/Documentacao/Eletronica/FPGA/Multicore/SRC/Multicore/Intv/synth/ZX Next/usage_statistics_webtalk.html WebTalk report has not been sent to Xilinx.  Please check your network and proxy settings.  For additional details about this file, please refer to the WebTalk help file at f:/Xilinx/14.7/ISE_DS/ISE/data/reports/webtalk_introduction.html
