:100000007ED102FF78FCF0FFFCFF78FF30FFAAFFF3
:10001000A8FFA8FC20FF20FF25FF540000000000DF
:10002000000000C000FFBFCF0F000000000000C0B4
:1000300000000000000000000000000000FFFFFFC3
:10004000FF000000000000000000000000000000B1
:100050000000000300FFFEF3F00000000003000FAB
:10006000010300FF1E3F0FFF3FFF1EFF0CFFAAFF13
:100070002AFF2A3F08FF08FF48FF54000000000045
:100080000000000000000000000000000000000070
:100090000000000F070F0F0F0F0F070F030F0A0FBE
:1000A0000A0F0A0F020F020F020F05F080C000F0C6
:1000B000C0F080FC00FFABFC80F080C000F000FCD2
:1000C00050F04000000000000000000000FFFFFFB3
:1000D000FF00000000000000000000000000000021
:1000E0000000000000FFFFFFFF0000000000000014
:1000F0000000000F0103000F030F013F00FFEA3F64
:10010000020F0203003F00FF143F05F0E0F0F0F0A3
:10011000F0F0E0F0C0F0A0F0A0F0A0F080F080F0EF
:1001200080F040040A11111F11110F12120E121249
:100130000F0E11010101110E0F12121212120F1FD8
:1001400001010F01011F1F0101070101010E110132
:100150001911110E1111111F1111110E04040404B3
:10016000040E1C08080809090611090503050911F0
:100170000101010101011F111B15151111111113AD
:1001800015191111110E11111111110E0F11110F5D
:100190000101010E1111111509160F11110F050999
:1001A000110E11010E10110E1F15040404040E117E
:1001B00011111111110E1111110A0A04041111115A
:1001C0001115150A11110A040A111111110A04045A
:1001D00004041F11080402111F00000000000000A9
:1001E000040404040400040E11191513110E04066E
:1001F000040404040E0E11100E01011F0E11100C48
:1002000010110E080C0A1F0808081F01010F10101A
:100210000F0C02010F11110E1F1008040201010E34
:1002200011110E11110E0E11111E1008063F07FFBD
:100230008FFF47FF43FF553F153F053F053F04FF35
:100240002800000000F080FFC2FF84FF04FF54FC80
:1002500050F040F040F040FC28000000000000009A
:10026000000000000000000000000000000000008E
:1002700000000000000F013F233F113F103F150F0A
:10028000050F010F010F013F0A00000000FCE0FF15
:10029000F0FFE1FFC1FF55FF54FC50FC50FC10FF84
:1002A0000A000000000000C080C000C000C00000C4
:1002B0000000000000000000000000000003000F2C
:1002C000080F040F040F0503010300030003000FD0
:1002D0000200000000FF78FFFCFF78FF30FF55FFB1
:1002E00055FF54FF54FF44FF82000000000000F05F
:1002F00020F040F040F040C000000000000000C0CE
:10030000800000000000000302030103010301005C
:1003100000000000000000030000000000FF1EFFBE
:100320003FFF1EFF0CFF55FF55FF15FF15FF11FF87
:10033000A000000000C000FC08FC10FC10FC50F005
:1003400040C000C000C000F0A0000000003F073F18
:100350000F3F073F03FF15FF55FF45FF45FF84FF94
:10036000040F043F28F080F0C0F080F000FC50FC47
:1003700054FC44FC44CF42C040C040FC2800000074
:10038000000000000000000000000000000000006D
:1003900000000000000F010F030F010F003F053F99
:1003A000153F113F113F213F0103010F0AFCE0FC03
:1003B000F0FCE0FCC0FF54FF55FF51FF51F310F07B
:1003C00010F010FF0A000000000000000000000014
:1003D0000000000000C080000000000000030003D7
:1003E00000030003000F010F050F040F040F080F97
:1003F0000000000302FF78FFFCFF78FF30FF55FF8D
:1004000055FF54FF54FC44FC44FC44FF82000000B0
:100410000000000000C000C040C040C040F020000C
:10042000000000C080000000000000000003000386
:1004300001030103010302030000000000FF1EFF8F
:100440003FFF1EFF0CFF55FF55FF15FF15FF11FF66
:10045000113F11FFA0C000C000C000C000F040F07C
:1004600050F010F0103C0800000000F0A03F07FF23
:100470008FFF47FF43FF553F153F053F053F04FFF3
:100480002803000000F080F0C0F080F000FC50FC79
:1004900054FC44FC44CF42C040C040FC2800000053
:1004A000000000000000000000000000000000004C
:1004B00000000000000F013F233F113F103F150FC8
:1004C000050F010F010F013F0A00000000FCE0FCD6
:1004D000F0FCE0FCC0FF54FF55FF51FF51F310F05A
:1004E00010F0103F0A0000000000000000000000B3
:1004F0000000000000C08000000000000003000FAA
:10050000080F040F040F0503010300030003000F8D
:100510000200000000FF78FFFCFF78FF30FF55FF6E
:1005200055FF54FF54FC44FC843C040F02000000BF
:100530000000000000C000C040C040C040F02000EB
:10054000000000C08000000302030103010301005A
:1005500000000000000000030000000000FF1EFF7C
:100560003FFF1EFF0CFF55FF55FF15FF15FF11FF45
:10057000A10F010300C000C000C000C000F040F0A7
:1005800050F010F0103C0800000000F0A03F073FC2
:100590000F3F073F03FF15FF55FF45FF45FF84FF52
:1005A000043F04FF28F080FFC2FF84FF04FF54FCD7
:1005B00050F040F040F040FC280000000000000037
:1005C000000000000000000000000000000000002B
:1005D00000000000000F010F030F010F003F053F57
:1005E000153F113F113F213F010F013F0AFCE0FF82
:1005F000F0FFE1FFC1FF55FF54FC50FC50FC10FF21
:100600000AC000C0000000C080C000C000C00000E0
:1006100000000000000000000000000000030003D4
:1006200000030003000F010F050F040F040F080F54
:100630000003000F02FF78FFFCFF78FF30FF55FF3B
:1006400055FF54FF54FF44FF42F040F0800000F09B
:1006500020F040F040F040C000000000000000C06A
:100660008000000000000000000000000003000304
:1006700001030103010302030000000300FF1EFF4A
:100680003FFF1EFF0CFF55FF55FF15FF15FF11FF24
:1006900010FC10FCA0C000FC08FC10FC10FC50F08A
:1006A00040C000C000C000F0A000000000FF00FF3C
:1006B00000FF00FF28FF84FF04FF05FF15FF55FF23
:1006C00047FF4FFF8FFF00FF00FF00FF08FFA0FF65
:1006D00040FF40FF50FF14FF84FFC4FFC80000002C
:1006E000000000000000000000000000000000000A
:1006F00000000000003F003F003F003F0A3F213F55
:10070000013F013F053F153F113F133F23FF00FF0E
:1007100000FF00FF02FF28FF10FF50FF54FF45FFBE
:10072000E1FFF1FFF2C000C000C000C000C000C087
:1007300000C000C000C000C000C000C0000F000F1B
:10074000000F000F020F080F000F000F010F050F21
:10075000040F040F08FF00FF00FF00FF80FF4AFFA7
:1007600044FF54FF55FF51FF78FFFCFFFCF000F001
:1007700000F000F080F000F000F000F000F040F039
:1007800040F040F080030003000300030003020375
:1007900000030003000301030103010302FF00FF44
:1007A00000FF00FFA0FF12FF11FF15FF55FF54FFD0
:1007B0001EFF3FFF3FFC00FC00FC00FC20FC80FC17
:1007C00000FC00FC40FC50FC10FC10FC203F7FFFB4
:1007D000FEFD7F3F1E0C0080C0C0C0800000000FE7
:1007E0001F3F3F3F1F0F0703C0E0F0B070E0C08025
:1007F0000003070F0F0F07030100F0F8FCECDCF813
:10080000F0E0C0000103030301000000FCFEFFFB59
:10081000F7FEFC78308E1E00338D001BE6C02716D5
:100820002B09A6C0A7805A26F920F1C47FA6C0A72D
:10083000805A26FB20E639AFFF02FC3F9EFF02F202
:100840008F9EFF02C9639EFF0224189DFF04FCA433
:100850001A3F9CFF04F290068F9CFF04CA9006A3E7
:100860009CFF042A9006A89BFF06F0AA9006AA0FF8
:100870009AFF0602AA4001AA8099FF08F02AAA401E
:1008800001AAA80F98FF010282AA02400182AA01D0
:100890008097FF04C02AAAA98200046AAAA8039527
:1008A000FF02F00A82AA01A98200016A82AA02A0BC
:1008B0000F93FF02FC0283AA01A48200011A83AAFB
:1008C00002803F91FF02FC0084AA01A48200011A69
:1008D00084AA02003F8FFF02FC0085AA01908200DB
:1008E000010685AA02003F87FF01C0870085AA0292
:1008F000A940820002016A85AA870001038DAA012E
:10090000948400011699AA03A9400A8200031401E5
:100910006A98AA08940020800014001697AA0AA5D5
:1009200040002080005500015A95AA02A95082007B
:10093000048020002A820002056A94AA01548300E0
:10094000058020AA2A808200011593AA0155830000
:100950000602002AA8AA808300015589AA89558425
:10096000000602002AA8AAA0840089550240058B2F
:1009700000060200AAA888A08B0004A00240058BF4
:1009800000060200AAA8AA808B0004A00240058BE2
:100990000002020082AA0222808B0002A00282557D
:1009A0008B00820282AA028A208B0082AA02400562
:1009B0008B00820204A2A800A08B0004A0024005C4
:1009C0008B00820204A2AA00288B0004A00240052A
:1009D0008B00060200A0AA80288B0004A00240051C
:1009E0008B00060220A000A0088B0004A002400596
:1009F0008B000602082820280A8B0002A0028255DC
:100A000001158B5501598269825A8A55015482AA6F
:100A10000240058C0001A08228820A8B0002A002FD
:100A200000FFFFFFFFFFFF96A027020AA0CE3600BF
:100A3000A6C42B0CA64127048D0D6F41334C20F02A
:100A4000B6FF03B6FF023B4A2607A6C4850226600E
:100A5000394A3402A6C4850227028D54EC4A3D353A
:100A60000234043D584958495849AE44308BA64396
:100A700084034835043D308BAF46A642C6203D8BEB
:100A8000061F01E64354543AAF4810AE46A64BE663
:100A90004A3412A6A043A484AAA0A7843088205A6E
:100AA00026F1351230014A26E6A6C48A02A7C439C7
:100AB000AE4810AE46A64BE64A3412A6A443A48420
:100AC0003402A6A1A4891800AAE0A7843088205A7D
:100AD00026E9351230014A26DEA6C484FDA7C439B2
:100AE0008603108EC22DC60C3412A6A043A484AA7D
:100AF000A09480A7843088205A26EF351230014A0E
:100B000026E4390A05023404C6203D8B061F01E69F
:100B1000E454543AE6E0C403108ECB1FE6A539C076
:100B2000300C033440CEC123C6073D33CBDC858D6A
:100B3000D586079781A6C03416D783C60696834309
:100B40003402A6891800989FA4E064E424083402C3
:100B500096839487AAE0989FA784A78918000483A6
:100B600004832606300186C097835A26D035163076
:100B700088200A8126BF35C0D68B8E3619AE85CC2B
:100B800062AA2003CC00559786D787C609D7850F60
:100B90008286FF979F341035028D0935028D0586B8
:100BA0001C7ECB233402444444448D133502D68644
:100BB000CB06D786840F8D07D686CB06D786398B92
:100BC0001C0D821026FF5C9782811C1026FF548624
:100BD0001A0F827ECB230F8A038A20020F8AEC81B0
:100BE000DD85A680847F812025378122240480062C
:100BF00020128130252B813A240480142006804164
:100C0000811A241D3410BDCB23351096868B069790
:100C1000860D8A27CD96878B552402865597872087
:100C2000C139B6FF20F6FF233446BDA9748E015B9F
:100C30005FBDA9E53546B7FF20F7FF23B6015A800F
:100C40000124024F39813625028635397D360D263D
:100C50002D0DA2262996A3810324230DA426208DE1
:100C6000C14891882718978896881F89847C545496
:100C700089001F8986B4FD360E8602B7360D390D00
:100C8000972BFB8602D688CB0AC4FE3404D68FC4C9
:100C9000FEE0E027E92A0286FE9B88816C24DF20A3
:100CA000C10DA2263396A38103242D96909B919784
:100CB000902425968F9B96810825048171250B0D24
:100CC000A326090096BDCE1620E90FA3978FDC8ED0
:100CD000FD3602969BB73601390DA226FB96A3106E
:100CE0002600A8D6954F0D972B0AD399810324157A
:100CF000DD9920113406DC99A3E1DD992407C300B6
:100D00004BDD990097D693968E0D972A089399817B
:100D10001E240A20EED39981B4102400C9D79391E0
:100D20008E2765978E96972B46968E81B2244081AA
:100D3000AC253C96888B08908F1FA92A014081081A
:100D4000242D0F960A961F9A2A020096C6233DCBA1
:100D50000AD7918601BDD0BC8602B7360D86ADB7E5
:100D600036028603979BB7360113BDCE2F20941A07
:100D700010DC8EFD3602D69BF736010D972A0981CD
:100D8000A825058602B7360D1CEF394A2652DC939A
:100D9000C30C1CDD93244E968E80048164242B8624
:100DA0000297A3863C9791CC0078DD9986FF9797B0
:100DB0008602979BDCB327110DA4260D0F9F0F878A
:100DC0008ED783BDCBDCBDCBDC39B73602978E0323
:100DD0009B969B8B05B736018602B7360D7ECE16E5
:100DE0004A1027FEFE398601B7360DB73601138645
:100DF0000397A386B4D68FFD36028606B736011355
:100E00003440CECE85C60BBDCE4835408601B736C0
:100E100001861497A03986141A101F895A26FDF6E8
:100E2000FF20C8C0F7FF204C812525EE1CEF398636
:100E3000821A101F895A26FDF6FF20C840F7FF20AE
:100E40004A813224EE1CEF398D0986644A26FD5A08
:100E500026F63934071A10327FAEC1ECC1DDACEC96
:100E6000C1DDAE6FE4DCAAD3AEDDAA66E4DCA8D3B4
:100E7000ACDDA866E4F6FF20E8E4F7FF20301F268B
:100E8000E23261358718300AC8066B10200AC8069E
:100E90006B08100AC8066B18300AC8066B10200CC5
:100EA000D607A108100C18073310200C18073308B8
:100EB000100AC8066B10200AC8066B08100A2E0616
:100EC0000C30610AC8066BCC1203E4483D8EC7CDD6
:100ED0003AAF49A648A047847FA748C6703404BDEE
:100EE000CFFA3504C0102AF5A648AB47847FA7483F
:100EF000C608E7C81286FFAE4DA7805A26FB399672
:100F0000A7A440840E270698A797A720BACC12035F
:100F1000E4483D8EC7CD3AAF4F8612E648EB47C452
:100F2000033D8EC7CD3AAF49C67010AE4DA6A0277F
:100F300066342434048D7235042656A6C81197826F
:100F40006AC812263EA640840C44271194B0260D90
:100F5000BDCEC7A6C8118E04019F9C2021969BB7C9
:100F6000360113BDD034A648AB47847FA748A640BE
:100F7000840E9AB097B0A6C811C6103D1F98BDD078
:100F8000BC35A4BDD0BC8E04019F9C35246F3F208E
:100F90000B8D673524200596B14A26FDC0102A8D99
:100FA000A648AB47847FA74839AE4BEB485454C49E
:100FB0001F3A10AE4F0F820382860234021A10C607
:100FC00009A6A4A884A4A427020F82A6A443A484EB
:100FD0003402A6A0A4891800AAE0A7843088205A69
:100FE00026DF1E108301205CC51F2602C0201E01C3
:100FF0006AE426CB96821CEF3584EB48EB475454C9
:10100000C41FAE4B3A860210AE4934021A10C6090C
:10101000A6A02704AA84A7843088205A26F21E019D
:101020008301205CC51F2602C0201E016AE426DE63
:101030001CEF3582344086FF97870F9F8ED0AA968B
:1010400082810527118ED0A1250C8ED0B30FB086DA
:101050000E97A7BDD7180F8ACC5A42DD85BDCBE2CB
:10106000EE81E6848655978734048ED099BDCBD621
:10107000BDD6ED84038B02919B27F5979BB7360174
:101080003F3504BDCE535A26DF8ED0990F87BDCB96
:10109000DC8ED0A1BDCBE235C05A24424F4E555311
:1010A00000202032303000D3680A20203530300054
:1010B000D3A40A203130303000D3E01C34340DA4E6
:1010C00026119B8D19978D968C890019978C9E8C73
:1010D000BDCB8435B48E0C004F5FCE0600ECC91832
:1010E00000EDC1301F26F63920EB20EC0F9F8ED388
:1010F00017BDCBDC968B448B1DBDCB23BDCB780FAE
:101100009F391210CE02FE8E0080C6356F805A269F
:10111000FB1A50CE36006FC46F41CCC22DED44CCCB
:101120000C03ED4ACC0000ED42334C6FC4CC0C06EE
:10113000ED4ACCC003ED44CC0000ED42A741334C56
:101140008680A7C48ECA27BF010DBF0107867EB760
:101150000106B7010C8602979B8634B7FF01B7FFE3
:10116000214CB7FF03863CB7FF238ED1029F7286C6
:101170005597711CEFBDD7E810CE02FE1CEF8635E7
:10118000B7FF038E1E006F808C360025F9BDC81591
:101190008E0AC0CC4005CEA002ED84ED891800EF88
:1011A000881EEF89181E3088208C1E002DEB8E0BB8
:1011B00040CC5555108EAAAAED84ED89180010AFC9
:1011C000881E10AF89181E308900C08C1E002DE8C3
:1011D000BDD0D5C6208E1E0086FFA7805A26FB866E
:1011E000FFB7FF22B7FFC0B7FFC3B7FFC5B7FFC741
:1011F0008655978786FF979F8ED747BDCBDC86AAFB
:1012000097878ED74FBDCBDC4F5FDD8C8E3619C6EE
:10121000066F805A26FB0F8BBDCB78861CBDCB2377
:101220008601B7360DB736018E04006F80C6F034E4
:1012300004BDD6EDA1E422F984FC8A02A7800382D2
:101240002AEF35045AC10324E66F849F9CCE030025
:101250008681A7C48ED4B6AF418E03E8AF4533C8AC
:101260001B8681A7C4CCCC4CED41CC12C1ED4533DB
:10127000C81B8681A7C48ECCA1AF418E2328AF4561
:1012800033C81B8681A7C48ECCD9AF418E2EE0AF68
:101290004533C81B86089781860197828E0B2010E4
:1012A0008E0013CC057834168ECB0396818A81A7E5
:1012B000C4CCCEFFED41ECE4ED4583012CEDE4968A
:1012C00082A74700826F48EC62ED4BC301C0ED621C
:1012D00010AF4D3128A680A7C81133C81B96814492
:1012E0009781850E26C56FC410CE02FEB6FF238AF5
:1012F00008B7FF238E04009F9C860E97A70FA00FB0
:10130000A386FF97A2CCB43CFD360ED788861E97E5
:10131000B1CE03007ED488642D4C4556454C200048
:101320000B21000005640B2100000815059000004A
:10133000040A05900000040A0590000008150590B5
:10134000000008150B21000005640B2100000815A2
:1013500005900000040A05900000040A05900000B2
:1013600008150590000008150B212B3005640B2192
:1013700028C3081505902679040A059028C3040A95
:101380000590267908150590245108150B21224750
:1013900005640B21205B08150B211E89040A0B2113
:1013A000205B08150B212451060C0B212247081540
:1013B0000590205B040A05902247040A0590205BF3
:1013C000081505901E8908150B211CD2060C0B214F
:1013D0001B3508150B2119AD040A0B211B35081507
:1013E0000B21205B081505900000000005901835C2
:1013F0000C190B2116E0102D0B2118350C190B219F
:10140000205B0815059000000000059018350C19A8
:101410000B2116E0102D0B2118350C1902C80815E8
:10142000146002C80890146002C80913159802C815
:10143000099D16E002C80A2F183702C80ACB1B35CF
:1014400002C80B6F1CD202C80C191E8902C80CD628
:10145000205B02C80D99224702C80E68245102C8B9
:101460000F44267902C8102D28C302C8112328C3AF
:1014700002C812272B3002C8133C2DC202C81460C8
:10148000306B16431598366010CE02FECE0300A6D0
:10149000C427F58501270FEC43E345ED43240734CA
:1014A00040ADD801354033C81B9E9CA68027E09FE5
:1014B0009CB7FF2020D9BDD6ED0DA42707BDD6FED1
:1014C000102701DC0DA21026015586FBB7FF02B6DE
:1014D000FF0084401027010A96A3102700D981033A
:1014E0001025006F102600720DA026678601B73602
:1014F00001130DA4102600920F9F0F878ED783BD76
:10150000CBDCDCB32734DC8C1093B3252D0CA10F7E
:10151000B30FB486FF9787C63C3440CED320340443
:101520008ED783BDCBD6BDCE5335045A26F0354079
:1015300086FF97878ED783BDCBDC0AA1102700A238
:10154000860497A30F800380D6A186FF97A0D6A11B
:101550007ED7A60DA410260111390DA02705BDD6F2
:10156000FE26F60DA42623D6A10F80BDD7A6DCB398
:101570002718865597878ED783BDCBDCBDCBDC86FD
:101580003C978696B30F82BDCBA4860197A3BDD6A8
:10159000ED2A05CC00012003CC78FF978FD7960F5A
:1015A000910F9B86B4978ED68FFD36028605B7368F
:1015B000018602B7360D39968E817A24190DA02640
:1015C0001EBDD6ED840F8B0597A0BDD6ED84038B91
:1015D00002979B16FF7D86020D972A014C979B7EF2
:1015E000D55386FF97A20F9F0F80C603BDD7A60FC6
:1015F000878ED783BDCBDCBDCBDC8ED756BDCBDC95
:101600008ED768BDCBDC8601B73601B7360D3F0FEC
:10161000A386AA9787869697A08ED7777ECBDC96EF
:10162000A326470DA026420F870F9F8ED777BDCBED
:10163000DCD68B8E36193ADC8C10A3842502ED841F
:101640000FA486559787BDD0EC86AA97878ED7566C
:10165000BDCBDC86AA97878ED768BDCBDC863C974E
:10166000A0860AA747860297A339BDD6FE27313444
:1016700040AD9FA00035408031250E8103240A48EB
:10168000978B86559787BDD0EC0DA4261296A02681
:101690000E863C97A06A47260686FF97A42012393B
:1016A0000FA4BDD6ED840F810A24F58B05195FDDEB
:1016B000B3968B4897B2BDD72A0FA286039795861B
:1016C000010DA4261D0F9F0F878ED756BDCBDC8E34
:1016D000D768BDCBDCBDD0EC8E00009F8CBDCB8429
:1016E000860397A1860E97A70FB07ED563DCA5C3AE
:1016F00000074C841FDDA58BA03406A6F13986FFB8
:10170000B7FF02B6FF008401391F402B5C4627104B
:101710003A983C2EE04A381E96B24C0DA42705811B
:101720000325014F8110240297B296B2485FC31F70
:1017300040FD033B96B2485FC32AF8FD035686502E
:1017400090B290B297B139000053434F5245000018
:10175000684849474800781453454C454354204C49
:101760004556454C204F5200821E5052455353203F
:10177000425554544F4E00782747414D45204F560F
:101780004552006424424F4E555320504C4159005D
:101790006E2A415420202030303000782A4D454EAA
:1017A000204C454654000DA426278E164FC1022614
:1017B00002301EC1032602301D3404BDCAE03504C8
:1017C0005A26F09680845597878ED79B0F9F7ECBA5
:1017D000DC39AEE1A6802705BDA30A20F76E848B15
:1017E000108A8F818F27F8398639B70167BDA928FC
:1017F000860DB7FF22BDD7D20D0D0D202020202051
:101800002020434C4F574E5320262042414C4C4FF2
:101810004F4E530D0D20202020202020202020205E
:101820002020202042590D20202020202020202070
:1018300020535445564520424A4F524B0D0D20200F
:1018400020202020434F50595249474854202020FF
:101850002020313938320D20202020202020202047
:1018600044415441534F465420494E432E0D0D0DD3
:1018700020202020204C4943454E53454420544FBE
:101880002054414E445920434F52502E00CC9F10BB
:101890008E0400A780A780BDD7DF5A26F6C60E307B
:1018A000881FA700A71F308820BDD7DF5A26F3C6A0
:1018B00010A784A71F301EBDD7DF5A26F43088E159
:1018C000C60EA784A7013088E0BDD7DF5A26F3CE25
:1018D000D320C63CBDCE538E0400A6802A0A8010B9
:1018E0008A8F818F27F8A71F8C060026ED7FFF02C5
:1018F000B6FF0043847F26035A26D939FFFFFFFF36
:10190000FFFFFFFFFFFFFFFFFFFFFFFFFFFFFFFFE7
:10191000FFFFFFFFFFFFFFFFFFFFFFFFFFFFFFFFD7
:10192000FFFFFFFFFFFFFFFFFFFFFFFFFFFFFFFFC7
:10193000FFFFFFFFFFFFFFFFFFFFFFFFFFFFFFFFB7
:10194000FFFFFFFFFFFFFFFFFFFFFFFFFFFFFFFFA7
:10195000FFFFFFFFFFFFFFFFFFFFFFFFFFFFFFFF97
:10196000FFFFFFFFFFFFFFFFFFFFFFFFFFFFFFFF87
:10197000FFFFFFFFFFFFFFFFFFFFFFFFFFFFFFFF77
:10198000FFFFFFFFFFFFFFFFFFFFFFFFFFFFFFFF67
:10199000FFFFFFFFFFFFFFFFFFFFFFFFFFFFFFFF57
:1019A000FFFFFFFFFFFFFFFFFFFFFFFFFFFFFFFF47
:1019B000FFFFFFFFFFFFFFFFFFFFFFFFFFFFFFFF37
:1019C000FFFFFFFFFFFFFFFFFFFFFFFFFFFFFFFF27
:1019D000FFFFFFFFFFFFFFFFFFFFFFFFFFFFFFFF17
:1019E000FFFFFFFFFFFFFFFFFFFFFFFFFFFFFFFF07
:1019F000FFFFFFFFFFFFFFFFFFFFFFFFFFFFFFFFF7
:101A0000FFFFFFFFFFFFFFFFFFFFFFFFFFFFFFFFE6
:101A1000FFFFFFFFFFFFFFFFFFFFFFFFFFFFFFFFD6
:101A2000FFFFFFFFFFFFFFFFFFFFFFFFFFFFFFFFC6
:101A3000FFFFFFFFFFFFFFFFFFFFFFFFFFFFFFFFB6
:101A4000FFFFFFFFFFFFFFFFFFFFFFFFFFFFFFFFA6
:101A5000FFFFFFFFFFFFFFFFFFFFFFFFFFFFFFFF96
:101A6000FFFFFFFFFFFFFFFFFFFFFFFFFFFFFFFF86
:101A7000FFFFFFFFFFFFFFFFFFFFFFFFFFFFFFFF76
:101A8000FFFFFFFFFFFFFFFFFFFFFFFFFFFFFFFF66
:101A9000FFFFFFFFFFFFFFFFFFFFFFFFFFFFFFFF56
:101AA000FFFFFFFFFFFFFFFFFFFFFFFFFFFFFFFF46
:101AB000FFFFFFFFFFFFFFFFFFFFFFFFFFFFFFFF36
:101AC000FFFFFFFFFFFFFFFFFFFFFFFFFFFFFFFF26
:101AD000FFFFFFFFFFFFFFFFFFFFFFFFFFFFFFFF16
:101AE000FFFFFFFFFFFFFFFFFFFFFFFFFFFFFFFF06
:101AF000FFFFFFFFFFFFFFFFFFFFFFFFFFFFFFFFF6
:101B0000FFFFFFFFFFFFFFFFFFFFFFFFFFFFFFFFE5
:101B1000FFFFFFFFFFFFFFFFFFFFFFFFFFFFFFFFD5
:101B2000FFFFFFFFFFFFFFFFFFFFFFFFFFFFFFFFC5
:101B3000FFFFFFFFFFFFFFFFFFFFFFFFFFFFFFFFB5
:101B4000FFFFFFFFFFFFFFFFFFFFFFFFFFFFFFFFA5
:101B5000FFFFFFFFFFFFFFFFFFFFFFFFFFFFFFFF95
:101B6000FFFFFFFFFFFFFFFFFFFFFFFFFFFFFFFF85
:101B7000FFFFFFFFFFFFFFFFFFFFFFFFFFFFFFFF75
:101B8000FFFFFFFFFFFFFFFFFFFFFFFFFFFFFFFF65
:101B9000FFFFFFFFFFFFFFFFFFFFFFFFFFFFFFFF55
:101BA000FFFFFFFFFFFFFFFFFFFFFFFFFFFFFFFF45
:101BB000FFFFFFFFFFFFFFFFFFFFFFFFFFFFFFFF35
:101BC000FFFFFFFFFFFFFFFFFFFFFFFFFFFFFFFF25
:101BD000FFFFFFFFFFFFFFFFFFFFFFFFFFFFFFFF15
:101BE000FFFFFFFFFFFFFFFFFFFFFFFFFFFFFFFF05
:101BF000FFFFFFFFFFFFFFFFFFFFFFFFFFFFFFFFF5
:101C0000FFFFFFFFFFFFFFFFFFFFFFFFFFFFFFFFE4
:101C1000FFFFFFFFFFFFFFFFFFFFFFFFFFFFFFFFD4
:101C2000FFFFFFFFFFFFFFFFFFFFFFFFFFFFFFFFC4
:101C3000FFFFFFFFFFFFFFFFFFFFFFFFFFFFFFFFB4
:101C4000FFFFFFFFFFFFFFFFFFFFFFFFFFFFFFFFA4
:101C5000FFFFFFFFFFFFFFFFFFFFFFFFFFFFFFFF94
:101C6000FFFFFFFFFFFFFFFFFFFFFFFFFFFFFFFF84
:101C7000FFFFFFFFFFFFFFFFFFFFFFFFFFFFFFFF74
:101C8000FFFFFFFFFFFFFFFFFFFFFFFFFFFFFFFF64
:101C9000FFFFFFFFFFFFFFFFFFFFFFFFFFFFFFFF54
:101CA000FFFFFFFFFFFFFFFFFFFFFFFFFFFFFFFF44
:101CB000FFFFFFFFFFFFFFFFFFFFFFFFFFFFFFFF34
:101CC000FFFFFFFFFFFFFFFFFFFFFFFFFFFFFFFF24
:101CD000FFFFFFFFFFFFFFFFFFFFFFFFFFFFFFFF14
:101CE000FFFFFFFFFFFFFFFFFFFFFFFFFFFFFFFF04
:101CF000FFFFFFFFFFFFFFFFFFFFFFFFFFFFFFFFF4
:101D0000FFFFFFFFFFFFFFFFFFFFFFFFFFFFFFFFE3
:101D1000FFFFFFFFFFFFFFFFFFFFFFFFFFFFFFFFD3
:101D2000FFFFFFFFFFFFFFFFFFFFFFFFFFFFFFFFC3
:101D3000FFFFFFFFFFFFFFFFFFFFFFFFFFFFFFFFB3
:101D4000FFFFFFFFFFFFFFFFFFFFFFFFFFFFFFFFA3
:101D5000FFFFFFFFFFFFFFFFFFFFFFFFFFFFFFFF93
:101D6000FFFFFFFFFFFFFFFFFFFFFFFFFFFFFFFF83
:101D7000FFFFFFFFFFFFFFFFFFFFFFFFFFFFFFFF73
:101D8000FFFFFFFFFFFFFFFFFFFFFFFFFFFFFFFF63
:101D9000FFFFFFFFFFFFFFFFFFFFFFFFFFFFFFFF53
:101DA000FFFFFFFFFFFFFFFFFFFFFFFFFFFFFFFF43
:101DB000FFFFFFFFFFFFFFFFFFFFFFFFFFFFFFFF33
:101DC000FFFFFFFFFFFFFFFFFFFFFFFFFFFFFFFF23
:101DD000FFFFFFFFFFFFFFFFFFFFFFFFFFFFFFFF13
:101DE000FFFFFFFFFFFFFFFFFFFFFFFFFFFFFFFF03
:101DF000FFFFFFFFFFFFFFFFFFFFFFFFFFFFFFFFF3
:101E0000FFFFFFFFFFFFFFFFFFFFFFFFFFFFFFFFE2
:101E1000FFFFFFFFFFFFFFFFFFFFFFFFFFFFFFFFD2
:101E2000FFFFFFFFFFFFFFFFFFFFFFFFFFFFFFFFC2
:101E3000FFFFFFFFFFFFFFFFFFFFFFFFFFFFFFFFB2
:101E4000FFFFFFFFFFFFFFFFFFFFFFFFFFFFFFFFA2
:101E5000FFFFFFFFFFFFFFFFFFFFFFFFFFFFFFFF92
:101E6000FFFFFFFFFFFFFFFFFFFFFFFFFFFFFFFF82
:101E7000FFFFFFFFFFFFFFFFFFFFFFFFFFFFFFFF72
:101E8000FFFFFFFFFFFFFFFFFFFFFFFFFFFFFFFF62
:101E9000FFFFFFFFFFFFFFFFFFFFFFFFFFFFFFFF52
:101EA000FFFFFFFFFFFFFFFFFFFFFFFFFFFFFFFF42
:101EB000FFFFFFFFFFFFFFFFFFFFFFFFFFFFFFFF32
:101EC000FFFFFFFFFFFFFFFFFFFFFFFFFFFFFFFF22
:101ED000FFFFFFFFFFFFFFFFFFFFFFFFFFFFFFFF12
:101EE000FFFFFFFFFFFFFFFFFFFFFFFFFFFFFFFF02
:101EF000FFFFFFFFFFFFFFFFFFFFFFFFFFFFFFFFF2
:101F0000FFFFFFFFFFFFFFFFFFFFFFFFFFFFFFFFE1
:101F1000FFFFFFFFFFFFFFFFFFFFFFFFFFFFFFFFD1
:101F2000FFFFFFFFFFFFFFFFFFFFFFFFFFFFFFFFC1
:101F3000FFFFFFFFFFFFFFFFFFFFFFFFFFFFFFFFB1
:101F4000FFFFFFFFFFFFFFFFFFFFFFFFFFFFFFFFA1
:101F5000FFFFFFFFFFFFFFFFFFFFFFFFFFFFFFFF91
:101F6000FFFFFFFFFFFFFFFFFFFFFFFFFFFFFFFF81
:101F7000FFFFFFFFFFFFFFFFFFFFFFFFFFFFFFFF71
:101F8000FFFFFFFFFFFFFFFFFFFFFFFFFFFFFFFF61
:101F9000FFFFFFFFFFFFFFFFFFFFFFFFFFFFFFFF51
:101FA000FFFFFFFFFFFFFFFFFFFFFFFFFFFFFFFF41
:101FB000FFFFFFFFFFFFFFFFFFFFFFFFFFFFFFFF31
:101FC000FFFFFFFFFFFFFFFFFFFFFFFFFFFFFFFF21
:101FD000FFFFFFFFFFFFFFFFFFFFFFFFFFFFFFFF11
:101FE000FFFFFFFFFFFFFFFFFFFFFFFFFFFFFFFF01
:101FF000FFFFFFFFFFFFFFFFFFFFFFFFFFFFFFFFF1
:00000001FF
