e0
02
90
0d
d0
b8
20
f3
c1
a8
90
02
a0
00
4c
81
9a
8a
0a
aa
bd
ad
02
a8
bd
ae
02
4c
71
94
20
b6
c3
a2
1f
20
d9
c3
20
8f
c3
8c
d0
02
8d
d1
02
20
8f
c3
8c
d2
02
8d
d3
02
08
a2
23
20
d3
c2
28
b0
11
ad
d0
02
8d
d2
02
ad
d1
02
24
83
10
04
0e
d2
02
2a
8d
d3
02
20
8f
c3
8c
d8
02
8d
d9
02
20
8f
c3
8c
da
02
8d
db
02
20
8f
c3
85
80
98
a4
80
20
59
bc
a2
2d
a0
2b
20
05
c3
90
0e
a9
68
a0
01
20
f9
c2
9d
ad
02
98
9d
ae
02
a2
03
bd
d0
02
9d
d4
02
ca
10
f7
a9
90
20
d5
bc
a2
07
bd
d0
02
9d
dc
02
ca
10
f7
20
ee
bc
20
7b
c3
a2
02
20
a7
c3
86
e9
18
a5
e9
d0
03
4c
1c
99
6d
d8
02
8d
d8
02
90
03
ee
d9
02
a2
2d
a0
2b
20
05
c3
b0
08
20
ee
bc
20
da
c0
90
dd
a0
2d
20
f0
bc
a2
02
a0
06
a9
00
9d
b9
02
9d
ba
02
20
22
c3
10
08
de
b9
02
de
ba
02
d0
0b
c9
00
d0
04
c0
00
f0
03
fe
b9
02
9d
b5
02
0a
9d
bd
02
98
9d
b6
02
2a
9d
be
02
ca
ca
a0
04
e0
00
f0
c9
a2
0a
a0
08
20
05
c3
a9
00
2a
2a
8d
c3
02
49
02
8d
c4
02
18
a9
10
6d
c3
02
a8
48
49
02
aa
20
05
c3
9d
ad
02
98
9d
ae
02
68
a8
18
a9
08
6d
c4
02
aa
20
05
c3
8d
c1
02
8c
c2
02
20
a5
c1
ac
c4
02
38
b9
b5
02
e9
01
99
b5
02
b0
0b
b9
b6
02
e9
00
99
b6
02
b0
01
60
ae
c3
02
ad
c2
02
30
06
20
94
c1
ae
c4
02
18
ad
c1
02
7d
bd
02
8d
c1
02
ad
c2
02
7d
be
02
8d
c2
02
ae
c4
02
20
94
c1
f0
bb
a0
02
18
bd
ad
02
7d
b9
02
9d
ad
02
e8
88
d0
f3
60
ad
e8
02
0d
e7
02
f0
16
ee
ad
02
d0
03
ee
ae
02
20
c3
c1
ae
ad
02
d0
03
ce
ae
02
ce
ad
02
20
ad
c2
b0
24
20
1a
c2
20
69
c2
8d
e9
02
b1
8c
0d
e9
02
24
83
10
13
48
a6
84
ad
e9
02
3d
af
c4
8d
e9
02
68
4d
e9
02
91
8c
60
a6
84
d0
f9
f0
f4
20
64
c2
b0
21
8d
e9
02
b1
8c
2d
e9
02
2a
ca
10
fc
2a
24
8b
30
06
29
03
c5
84
18
60
18
29
03
f0
03
a2
00
60
a2
ff
60
bd
02
d8
85
8c
bd
1b
d8
29
03
48
09
1c
85
8d
20
38
c2
91
8c
68
09
18
85
8d
20
4e
c2
91
8c
a5
86
0a
0a
0a
0a
85
7e
ad
15
ff
24
83
10
02
a5
85
29
0f
05
7e
60
a5
86
4a
4a
4a
4a
85
7e
ad
15
ff
24
83
10
02
a5
85
29
f0
05
7e
60
20
ad
c2
b0
1f
20
91
c2
ad
af
02
29
07
a8
ad
ad
02
24
83
08
10
01
0a
29
07
aa
bd
89
c2
28
10
04
e8
1d
89
c2
60
80
40
20
10
08
04
02
01
98
18
7d
02
d8
85
8c
bd
1b
d8
29
03
69
00
06
8c
2a
06
8c
2a
06
8c
2a
09
20
85
8d
60
ad
ae
02
4a
d0
1e
ad
ad
02
6a
4a
24
83
30
01
4a
a8
c0
28
b0
0f
ad
b0
02
d0
0a
ad
af
02
4a
4a
4a
aa
c5
88
60
38
60
ad
e6
02
f0
17
a5
87
20
df
c2
a5
88
0a
a8
a9
00
20
37
c3
9d
ad
02
98
e8
9d
ad
02
e8
60
90
07
b0
14
b0
0f
20
18
c3
18
7d
ad
02
48
98
7d
ae
02
a8
68
60
20
18
c3
38
fd
ad
02
85
57
98
fd
ae
02
a8
08
a5
57
28
60
b9
ad
02
48
b9
ae
02
a8
68
60
20
05
c3
10
0f
08
18
49
ff
69
01
48
98
49
ff
69
00
a8
68
28
60
84
8e
85
8f
bd
ad
02
bc
ae
02
08
20
25
c3
9d
ad
02
98
9d
ae
02
a9
00
8d
ef
02
a0
10
46
8e
66
8f
90
0f
18
7d
ad
02
48
ad
ef
02
7d
ae
02
8d
ef
02
68
4e
ef
02
6a
88
d0
e4
69
00
ac
ef
02
90
01
c8
28
4c
25
c3
a0
00
20
82
c3
a0
02
b9
b1
02
99
ad
02
b9
b2
02
99
ae
02
60
20
79
04
f0
0c
20
91
94
c9
2c
f0
05
20
e1
9d
38
60
a9
00
a8
18
60
a2
00
20
79
04
f0
f8
20
91
94
c9
2c
f0
f1
4c
84
9d
20
bf
c7
a2
01
20
79
04
f0
13
c9
2c
f0
0f
20
84
9d
e0
04
b0
0b
e0
02
24
83
30
02
b0
03
86
84
60
4c
1c
99
20
79
04
f0
07
20
91
94
c9
2c
d0
12
a0
00
b9
ad
02
9d
ad
02
e8
c8
c0
04
d0
f4
60
20
91
94
8e
f0
02
20
8f
c4
20
79
04
c9
2c
f0
56
c9
3b
f0
03
4c
a1
94
20
73
04
20
e1
9d
85
80
98
a4
80
20
59
bc
ae
f0
02
bd
ad
02
9d
af
02
bd
ae
02
9d
b0
02
20
d3
c2
a9
0e
8d
f1
02
18
ae
f0
02
20
b0
bc
9d
ad
02
98
9d
ae
02
a0
00
4e
f1
02
90
02
a0
02
20
f4
c2
9d
ad
02
98
9d
ae
02
e8
e8
4e
f1
02
d0
dc
18
60
20
73
04
ee
f0
02
ee
f0
02
20
8f
c4
ae
f0
02
ca
ca
20
d3
c2
a0
02
ae
f0
02
e8
e8
ca
ca
4e
f1
02
90
0a
20
f6
c2
9d
ad
02
98
9d
ae
02
a0
00
ec
f0
02
f0
e8
18
60
20
79
04
c9
aa
f0
05
c9
ab
f0
01
18
2e
f1
02
20
14
93
20
e8
9d
ae
f0
02
9d
ae
02
98
9d
ad
02
60
ff
aa
55
00
00
00
2c
71
57
8d
80
00
a4
8f
c4
19
dd
b2
f0
90
fc
1c
ff
ff
04
72
04
50
04
0b
03
a8
03
28
02
90
01
e3
01
28
00
63
20
bf
c7
20
79
04
f0
12
a2
01
c9
a4
20
be
c3
20
79
04
c9
2c
f0
05
c9
a4
f0
01
60
48
20
73
04
a2
04
20
f7
c3
68
10
06
20
da
c0
4c
e8
c4
20
7b
c3
20
a5
c1
4c
e8
c4
20
bf
c7
a2
04
20
f7
c3
4c
7b
c3
20
84
9d
e0
05
b0
43
86
7e
20
d8
9d
ca
e0
10
b0
39
86
7f
a2
07
20
a7
c3
e0
08
b0
2e
8a
0a
0a
0a
0a
05
7f
a6
7e
e0
01
f0
07
b0
0c
8d
15
ff
d0
19
85
86
8d
3b
05
f0
12
e0
03
f0
06
b0
09
85
85
d0
08
8d
16
ff
f0
03
8d
19
ff
60
4c
1c
99
a5
83
d0
05
a9
93
4c
d2
ff
29
40
f0
0b
20
6b
c5
a2
14
a0
00
18
20
f0
ff
a9
00
a0
20
a2
20
20
a7
c5
20
38
c2
a0
1c
a2
04
20
a7
c5
20
4e
c2
a0
18
a2
04
20
a7
c5
a9
00
a2
03
9d
ad
02
ca
10
fa
60
84
8d
a0
00
84
8c
91
8c
88
d0
fb
e6
8d
ca
d0
f6
60
20
84
9d
e0
02
b0
a5
8e
e6
02
60
c9
9c
d0
0a
20
38
c7
20
73
04
a9
00
f0
0a
20
84
9d
e0
05
b0
15
bd
37
c6
c5
83
f0
4b
85
83
aa
d0
0c
20
c9
c7
a9
28
a2
19
d0
39
4c
1c
99
20
3c
c6
ad
06
ff
09
20
8d
06
ff
ad
07
ff
29
ef
24
83
10
02
09
10
8d
07
ff
ad
12
ff
29
c3
09
08
8d
12
ff
ad
14
ff
29
03
09
18
8d
14
ff
a9
28
a2
19
24
83
10
01
4a
85
87
86
88
20
a5
c3
8a
4a
d0
bc
90
03
4c
67
c5
60
00
20
60
a0
e0
a5
75
f0
01
60
a5
38
c9
40
b0
34
20
54
a9
20
6b
c8
8a
18
65
31
98
65
32
c9
18
b0
20
c6
75
a9
00
85
22
a9
18
85
23
20
f0
c7
a5
22
85
33
a5
23
85
34
a9
00
85
37
a9
18
85
38
4c
25
c8
4c
81
86
20
54
a9
a4
31
84
5f
a5
32
18
69
30
b0
ef
85
60
c5
34
90
06
d0
e7
c4
33
b0
e3
c6
75
a9
00
85
4e
a9
30
85
4f
20
77
c8
a5
5f
85
22
a5
60
85
23
a6
31
86
24
a5
32
85
25
38
e9
10
a8
20
f8
c7
18
a5
32
69
30
85
32
a5
30
69
30
85
30
a5
2e
69
30
85
2e
a5
2c
69
30
85
2c
a5
42
69
30
85
42
20
18
88
20
4b
88
24
81
10
2d
a2
30
24
75
30
02
a2
d0
8a
18
65
3c
85
3c
8a
18
6d
5c
02
8d
5c
02
8a
18
6d
f6
04
8d
f6
04
20
60
a7
a5
3d
c9
b0
d0
07
a5
3e
c9
07
d0
01
60
a0
00
b1
3d
c9
81
d0
0e
a0
02
20
ad
c7
a0
10
20
ad
c7
a9
12
d0
07
a0
04
20
ad
c7
a9
05
18
65
3d
85
3d
90
cf
e6
3e
d0
cb
a5
75
d0
01
60
a0
00
84
75
a5
38
30
24
20
54
a9
20
6b
c8
ad
33
05
85
22
ad
34
05
85
23
20
f0
c7
a2
01
bd
33
05
95
37
b5
22
95
33
ca
10
f4
4c
25
c8
a0
00
84
75
84
22
84
24
a9
10
85
23
a9
40
85
25
20
bb
04
91
22
c8
d0
f8
e6
23
e6
25
a5
32
c5
25
b0
ee
a5
32
38
e9
30
85
32
a5
2c
e9
30
85
2c
a5
2e
e9
30
85
2e
a5
30
e9
30
85
30
a5
42
e9
30
85
42
4c
d8
c6
b1
3d
24
75
d0
06
38
e9
30
91
3d
60
18
69
30
91
3d
60
a5
75
f0
01
60
a2
23
4c
83
86
ad
06
ff
29
df
8d
06
ff
ad
07
ff
29
ef
8d
07
ff
ad
14
ff
29
07
09
08
8d
14
ff
ad
12
ff
09
04
8d
12
ff
a9
00
85
83
60
a5
37
85
24
a5
38
85
25
8a
49
ff
85
4e
98
49
ff
85
4f
a0
00
e6
4e
d0
04
e6
4f
f0
18
a5
22
d0
02
c6
23
c6
22
a5
24
d0
02
c6
25
c6
24
20
bb
04
91
22
4c
04
c8
60
a5
37
a4
38
85
22
84
23
38
a5
33
e5
22
a5
34
e5
23
b0
ec
38
a5
22
e9
02
85
22
b0
02
c6
23
a0
01
20
b0
04
99
24
00
88
10
f7
c8
20
bb
04
85
80
a5
22
38
e5
80
85
22
b0
02
c6
23
a0
02
b9
21
00
91
24
88
d0
f8
f0
c2
38
a5
37
e5
33
aa
a5
38
e5
34
a8
60
a5
37
85
22
a5
38
85
23
38
a5
33
e5
22
a5
34
e5
23
b0
31
38
a5
22
e9
02
85
22
b0
02
c6
23
18
a0
00
20
b0
04
99
24
00
79
4e
00
91
22
c8
c0
01
d0
f0
88
20
bb
04
85
80
a5
22
38
e5
80
85
22
b0
c8
c6
23
90
c4
60
20
1f
cb
29
e6
d0
7b
a0
00
20
3f
ca
a9
00
ae
77
02
a0
60
20
ba
ff
38
20
c0
ff
90
09
48
20
35
c9
68
aa
4c
83
86
a2
00
20
c6
ff
a0
03
8c
ec
02
20
cf
ff
8d
ed
02
20
b7
ff
d0
3f
20
cf
ff
8d
ee
02
20
b7
ff
d0
34
ce
ec
02
d0
e5
ae
ed
02
ad
ee
02
20
5f
a4
a9
20
20
d2
ff
20
cf
ff
48
20
b7
ff
d0
17
68
f0
06
20
d2
ff
4c
14
c9
a9
0d
20
d2
ff
20
e1
ff
f0
05
a0
02
d0
b4
68
20
cc
ff
a9
00
18
4c
c3
ff
4c
a1
94
a9
66
20
21
cb
20
b5
cc
a0
04
20
3f
ca
4c
e1
a7
a9
e6
20
21
cb
20
b5
cc
a9
00
8d
78
02
85
0a
a0
05
20
3f
ca
4c
fa
a7
20
1f
cb
20
af
cc
29
11
c9
11
f0
03
4c
a1
94
20
e7
ff
20
2b
cd
d0
17
a0
09
20
3f
ca
20
cf
cc
24
81
30
0b
a0
00
a9
7a
20
94
04
c9
32
b0
01
60
a2
24
4c
83
86
20
1f
cb
20
af
cc
20
2b
cd
d0
ef
a0
0f
20
3f
ca
20
cf
cc
24
81
30
e3
a9
0d
20
d2
ff
a0
00
a9
7a
20
94
04
f0
06
20
d2
ff
c8
d0
f3
a9
0d
4c
d2
ff
20
1f
cb
29
e7
d0
a1
20
e7
ff
a0
14
d0
65
20
1f
cb
29
30
c9
30
d0
06
a5
82
29
c7
f0
07
a5
82
20
c0
cc
a5
82
a0
17
d0
4b
a9
e4
20
21
cb
20
c6
cc
a0
1e
d0
3f
a9
c7
20
21
cb
29
30
c9
30
f0
03
4c
a1
94
20
e7
ff
a0
25
4c
3f
ca
48
ad
5d
02
a2
7c
a0
02
20
bd
ff
ad
76
02
ae
77
02
ac
78
02
20
ba
ff
68
f0
0e
ae
5d
02
38
20
c0
ff
ad
76
02
38
4c
c3
ff
60
20
57
cd
a2
00
8e
5d
02
b9
f5
ca
f0
ca
c9
80
f0
c6
aa
ca
f0
1e
ca
f0
21
ca
f0
24
ca
f0
28
ca
f0
2d
ca
f0
34
ca
f0
3f
ca
f0
46
ca
f0
66
20
eb
ca
c8
d0
d5
a5
82
29
10
f0
f7
ad
6f
02
4c
81
ca
ad
73
02
09
30
d0
e7
a9
40
24
82
30
e1
10
e2
ad
6e
02
f0
dd
a9
3a
20
eb
ca
98
48
ad
70
02
ac
71
02
ae
6e
02
4c
ba
ca
ad
72
02
f0
c5
a9
3a
20
eb
ca
98
48
ad
74
02
ac
75
02
ae
72
02
85
22
84
23
86
80
a0
00
20
b0
04
20
eb
ca
c8
c4
80
d0
f5
68
a8
4c
6f
ca
ad
79
02
f0
98
a9
2c
20
eb
ca
ad
79
02
20
eb
ca
ad
7a
02
20
eb
ca
4c
6f
ca
ae
5d
02
9d
7c
02
ee
5d
02
60
24
07
05
00
04
02
3a
06
00
4e
02
3a
06
09
80
53
02
3a
06
80
56
02
80
43
03
07
3d
02
05
80
52
02
3a
08
3d
06
80
44
03
3d
02
80
a9
00
48
a9
00
85
82
a2
1e
9d
5e
02
ca
d0
fa
a2
08
8e
77
02
a2
6f
8e
78
02
a2
00
8e
76
02
20
79
04
d0
07
68
20
aa
cc
a5
82
60
c9
44
f0
1d
c9
91
f0
4e
c9
55
f0
0f
c9
49
f0
2a
c9
22
f0
48
c9
28
f0
44
4c
a1
94
20
58
cc
4c
cd
cb
a9
10
20
aa
cc
20
97
cc
e0
02
b0
0a
8e
6f
02
8e
73
02
a9
10
d0
4d
4c
49
cc
ad
7b
02
d0
d9
20
73
04
8d
79
02
20
73
04
8d
7a
02
a9
ff
8d
7b
02
20
73
04
4c
d1
cb
20
51
cc
4c
cd
cb
a9
01
20
69
cc
8d
6e
02
8d
5d
02
a9
5e
8d
70
02
85
24
a9
02
8d
71
02
85
25
a0
00
20
b0
04
91
24
c8
cc
5d
02
90
f5
a9
01
05
82
85
82
20
79
04
d0
03
4c
42
cb
c9
2c
d0
06
20
73
04
4c
49
cb
c9
91
f0
b8
c9
a4
d0
5b
20
73
04
c9
44
f0
10
c9
91
f0
1f
c9
55
f0
21
c9
22
f0
23
c9
28
f0
1f
a9
20
20
aa
cc
20
97
cc
e0
02
b0
3b
8e
73
02
a9
20
d0
1c
20
51
cc
4c
31
cc
20
58
cc
4c
31
cc
a9
02
20
69
cc
8d
72
02
8e
74
02
8c
75
02
a9
02
05
82
85
82
20
79
04
f0
9c
c9
2c
f0
ad
c9
91
f0
d3
c9
55
f0
d5
a2
0b
2c
a2
0e
2c
a2
17
4c
83
86
20
73
04
c9
55
d0
ee
20
97
cc
e0
20
b0
ea
e0
03
90
e6
8e
77
02
a9
08
60
20
aa
cc
20
48
9c
aa
f0
d7
a0
00
20
b0
04
c9
40
d0
12
a9
80
20
aa
cc
a5
82
09
80
85
82
ca
e6
22
d0
02
e6
23
8a
c9
11
b0
ba
a6
22
a4
23
60
20
73
04
f0
aa
90
09
20
8e
94
20
84
9d
4c
8b
94
4c
84
9d
25
82
d0
98
60
29
e6
f0
02
d0
91
a5
82
29
01
c9
01
d0
f6
a5
82
60
29
c4
d0
ef
a5
82
29
03
c9
03
d0
e7
a5
82
60
a5
79
d0
11
a9
28
85
79
20
06
a9
86
7a
84
7b
a0
28
20
ba
cd
ea
ae
77
02
d0
05
a2
08
8e
77
02
a9
00
a0
6f
20
ba
ff
a9
00
20
bd
ff
20
c0
ff
a2
00
20
c6
ff
b0
1b
a0
ff
c8
20
cf
ff
c9
0d
f0
04
91
7a
d0
f4
a9
00
91
7a
20
cc
ff
a9
00
38
4c
c3
ff
48
20
12
cd
20
57
cd
68
aa
4c
83
86
24
81
30
25
20
4f
ff
41
52
45
20
59
4f
55
20
53
55
52
45
3f
00
20
cc
ff
20
cf
ff
48
c9
0d
f0
05
20
cf
ff
d0
f7
68
c9
59
60
a9
00
60
98
48
a5
79
f0
0a
a0
28
98
91
7a
c8
a9
ff
91
7a
a9
00
85
79
68
a8
60
2c
30
20
59
45
4b
aa
98
48
a9
00
20
5f
a4
68
a8
60
85
3a
88
aa
e8
d0
02
86
81
60
d8
1b
14
0c
07
7b
01
d7
d8
11
07
10
1d
7b
17
d8
07
10
05
1a
1a
16
7b
1f
d8
1b
10
02
1a
17
7b
13
47
d8
a0
21
b9
89
cd
49
55
20
d2
ff
88
10
f5
60
00
a9
79
91
7a
a9
00
c8
91
7a
60
ff
ff
ff
ff
ff
ff
ff
ff
ff
ff
ff
ff
ff
ff
ff
ff
ff
ff
ff
ff
ff
ff
ff
ff
ff
ff
ff
ff
ff
ff
ff
ff
ff
ff
ff
ff
ff
ff
ff
ff
ff
ff
ff
ff
ff
ff
ff
ff
ff
ff
ff
ff
ff
ff
ff
ff
ff
ff
ff
ff
ba
bd
04
01
29
10
d0
03
6c
14
03
6c
16
03
ad
09
ff
29
02
f0
03
20
60
ce
2c
d8
07
10
0e
ad
01
fd
8d
d4
07
10
06
20
95
ea
20
5b
ea
20
e4
e3
ad
09
ff
29
02
f0
28
8d
09
ff
2c
0b
ff
a9
cc
50
1b
6c
12
03
20
bf
cf
20
cd
ce
a5
fb
48
a9
00
85
fb
08
58
20
11
db
28
68
85
fb
a9
a1
8d
0b
ff
4c
be
fc
ad
1c
ff
29
01
d0
39
ad
1d
ff
c9
a3
b0
2e
24
83
50
52
a9
08
8d
14
ff
ad
06
ff
29
df
a8
ad
07
ff
29
ef
aa
ad
12
ff
0d
fa
07
48
ad
1d
ff
c9
a3
90
f9
68
8d
12
ff
8c
06
ff
8e
07
ff
60
c9
cc
90
24
a6
83
f0
20
10
08
ad
07
ff
09
10
8d
07
ff
ad
06
ff
09
20
8d
06
ff
ad
12
ff
29
fb
8d
12
ff
ad
fb
07
8d
14
ff
60
ea
ea
ea
ea
ea
ea
ea
ea
a2
01
bd
fc
04
1d
fe
04
f0
13
fe
fc
04
d0
0e
fe
fe
04
d0
09
bd
ee
ce
2d
11
ff
8d
11
ff
ca
10
e2
60
ef
9f
e6
a5
d0
06
e6
a4
d0
02
e6
a3
38
a5
a5
e9
01
a5
a4
e9
1a
a5
a3
e9
4f
90
08
a2
00
86
a3
86
a4
86
a5
a9
7f
20
70
db
85
ee
a9
7f
20
70
db
c5
ee
d0
f0
09
7f
85
91
60
78
a5
a5
a6
a4
a4
a3
78
85
a5
86
a4
84
a3
58
60
0d
4d
4f
4e
49
54
4f
52
8d
0d
42
52
45
41
cb
0d
20
20
20
50
43
20
20
53
52
20
41
43
20
58
52
20
59
52
20
53
50
0d
3b
a0
41
a0
20
45
52
52
4f
d2
bd
36
cf
08
29
7f
20
d2
ff
e8
28
10
f3
60
a9
0d
a6
98
e0
03
f0
06
a6
99
e0
03
f0
03
20
49
dc
a9
0d
4c
b0
d9
bd
13
01
2c
f9
07
10
03
bd
43
e1
60
2c
f8
07
30
03
b1
a1
60
a9
a1
8d
df
07
4c
d9
07
a9
09
8d
20
fd
09
80
8d
20
fd
4c
1e
fc
08
78
8d
3f
ff
b1
00
8d
3e
ff
28
60
ad
10
fd
29
04
d0
1b
2c
fc
07
30
06
a5
01
29
f7
85
01
ce
fd
07
10
08
a9
04
8d
fd
07
20
f0
ce
4c
f0
ce
8d
fc
07
20
b0
e3
4c
d1
cf
e8
8e
c4
fe
8e
c0
fe
a9
80
8d
11
ff
60
ff
ff
ff
ff
ff
ff
ff
ff
ff
3c
66
6e
6e
60
62
3c
00
18
3c
66
7e
66
66
66
00
7c
66
66
7c
66
66
7c
00
3c
66
60
60
60
66
3c
00
78
6c
66
66
66
6c
78
00
7e
60
60
78
60
60
7e
00
7e
60
60
78
60
60
60
00
3c
66
60
6e
66
66
3c
00
66
66
66
7e
66
66
66
00
3c
18
18
18
18
18
3c
00
1e
0c
0c
0c
0c
6c
38
00
66
6c
78
70
78
6c
66
00
60
60
60
60
60
60
7e
00
63
77
7f
6b
63
63
63
00
66
76
7e
7e
6e
66
66
00
3c
66
66
66
66
66
3c
00
7c
66
66
7c
60
60
60
00
3c
66
66
66
66
3c
0e
00
7c
66
66
7c
78
6c
66
00
3c
66
60
3c
06
66
3c
00
7e
18
18
18
18
18
18
00
66
66
66
66
66
66
3c
00
66
66
66
66
66
3c
18
00
63
63
63
6b
7f
77
63
00
66
66
3c
18
3c
66
66
00
66
66
66
3c
18
18
18
00
7e
06
0c
18
30
60
7e
00
3c
30
30
30
30
30
3c
00
0c
12
30
7c
30
62
fc
00
3c
0c
0c
0c
0c
0c
3c
00
00
18
3c
7e
18
18
18
18
00
10
30
7f
7f
30
10
00
00
00
00
00
00
00
00
00
18
18
18
18
00
00
18
00
66
66
66
00
00
00
00
00
66
66
ff
66
ff
66
66
00
18
3e
60
3c
06
7c
18
00
62
66
0c
18
30
66
46
00
3c
66
3c
38
67
66
3f
00
06
0c
18
00
00
00
00
00
0c
18
30
30
30
18
0c
00
30
18
0c
0c
0c
18
30
00
00
66
3c
ff
3c
66
00
00
00
18
18
7e
18
18
00
00
00
00
00
00
00
18
18
30
00
00
00
7e
00
00
00
00
00
00
00
00
00
18
18
00
00
03
06
0c
18
30
60
00
3c
66
6e
76
66
66
3c
00
18
18
38
18
18
18
7e
00
3c
66
06
0c
30
60
7e
00
3c
66
06
1c
06
66
3c
00
06
0e
1e
66
7f
06
06
00
7e
60
7c
06
06
66
3c
00
3c
66
60
7c
66
66
3c
00
7e
66
0c
18
18
18
18
00
3c
66
66
3c
66
66
3c
00
3c
66
66
3e
06
66
3c
00
00
00
18
00
00
18
00
00
00
00
18
00
00
18
18
30
0e
18
30
60
30
18
0e
00
00
00
7e
00
7e
00
00
00
70
18
0c
06
0c
18
70
00
3c
66
06
0c
18
00
18
00
00
00
00
ff
ff
00
00
00
08
1c
3e
7f
7f
1c
3e
00
18
18
18
18
18
18
18
18
00
00
00
ff
ff
00
00
00
00
00
ff
ff
00
00
00
00
00
ff
ff
00
00
00
00
00
00
00
00
00
ff
ff
00
00
30
30
30
30
30
30
30
30
0c
0c
0c
0c
0c
0c
0c
0c
00
00
00
e0
f0
38
18
18
18
18
1c
0f
07
00
00
00
18
18
38
f0
e0
00
00
00
c0
c0
c0
c0
c0
c0
ff
ff
c0
e0
70
38
1c
0e
07
03
03
07
0e
1c
38
70
e0
c0
ff
ff
c0
c0
c0
c0
c0
c0
ff
ff
03
03
03
03
03
03
00
3c
7e
7e
7e
7e
3c
00
00
00
00
00
00
ff
ff
00
36
7f
7f
7f
3e
1c
08
00
60
60
60
60
60
60
60
60
00
00
00
07
0f
1c
18
18
c3
e7
7e
3c
3c
7e
e7
c3
00
3c
7e
66
66
7e
3c
00
18
18
66
66
18
18
3c
00
06
06
06
06
06
06
06
06
08
1c
3e
7f
3e
1c
08
00
18
18
18
ff
ff
18
18
18
c0
c0
30
30
c0
c0
30
30
18
18
18
18
18
18
18
18
00
00
03
3e
76
36
36
00
ff
7f
3f
1f
0f
07
03
01
00
00
00
00
00
00
00
00
f0
f0
f0
f0
f0
f0
f0
f0
00
00
00
00
ff
ff
ff
ff
ff
00
00
00
00
00
00
00
00
00
00
00
00
00
00
ff
c0
c0
c0
c0
c0
c0
c0
c0
cc
cc
33
33
cc
cc
33
33
03
03
03
03
03
03
03
03
00
00
00
00
cc
cc
33
33
ff
fe
fc
f8
f0
e0
c0
80
03
03
03
03
03
03
03
03
18
18
18
1f
1f
18
18
18
00
00
00
00
0f
0f
0f
0f
18
18
18
1f
1f
00
00
00
00
00
00
f8
f8
18
18
18
00
00
00
00
00
00
ff
ff
00
00
00
1f
1f
18
18
18
18
18
18
ff
ff
00
00
00
00
00
00
ff
ff
18
18
18
18
18
18
f8
f8
18
18
18
c0
c0
c0
c0
c0
c0
c0
c0
e0
e0
e0
e0
e0
e0
e0
e0
07
07
07
07
07
07
07
07
ff
ff
00
00
00
00
00
00
ff
ff
ff
00
00
00
00
00
00
00
00
00
00
ff
ff
ff
03
03
03
03
03
03
ff
ff
00
00
00
00
f0
f0
f0
f0
0f
0f
0f
0f
00
00
00
00
18
18
18
f8
f8
00
00
00
f0
f0
f0
f0
00
00
00
00
f0
f0
f0
f0
0f
0f
0f
0f
3c
66
6e
6e
60
62
3c
00
00
00
3c
06
3e
66
3e
00
60
60
7c
66
66
66
7c
00
00
00
3c
66
60
66
3c
00
06
06
3e
66
66
66
3e
00
00
00
3c
66
7e
60
3e
00
1c
36
30
78
30
30
30
00
00
00
3e
66
66
3e
06
7c
60
60
7c
66
66
66
66
00
18
00
18
18
18
18
18
00
06
00
06
06
06
06
66
3c
60
60
66
6c
78
7c
66
00
38
18
18
18
18
18
3c
00
00
00
6b
7f
7f
63
63
00
00
00
7c
66
66
66
66
00
00
00
3c
66
66
66
3c
00
00
00
7c
66
66
7c
60
60
00
00
3e
66
66
3e
06
06
00
00
7c
66
60
60
60
00
00
00
3c
60
3c
06
7c
00
30
30
fc
30
30
36
1c
00
00
00
66
66
66
66
3c
00
00
00
66
66
66
3c
18
00
00
00
63
6b
7f
36
22
00
00
00
66
3c
18
3c
66
00
00
00
66
66
66
3e
06
7c
00
00
7e
0c
18
30
7e
00
3c
30
30
30
30
30
3c
00
0c
12
30
7c
30
62
fc
00
3c
0c
0c
0c
0c
0c
3c
00
00
18
3c
7e
18
18
18
18
00
10
30
7f
7f
30
10
00
00
00
00
00
00
00
00
00
18
18
18
18
00
00
18
00
66
66
66
00
00
00
00
00
66
66
ff
66
ff
66
66
00
18
3e
60
3c
06
7c
18
00
62
66
0c
18
30
66
46
00
3c
66
3c
38
67
66
3f
00
06
0c
18
00
00
00
00
00
0c
18
30
30
30
18
0c
00
30
18
0c
0c
0c
18
30
00
00
66
3c
ff
3c
66
00
00
00
18
18
7e
18
18
00
00
00
00
00
00
00
18
18
30
00
00
00
7e
00
00
00
00
00
00
00
00
00
18
18
00
00
03
06
0c
18
30
60
00
3c
66
6e
76
66
66
3c
00
18
18
38
18
18
18
7e
00
3c
66
06
0c
30
60
7e
00
3c
66
06
1c
06
66
3c
00
06
0e
1e
66
7f
06
06
00
7e
60
7c
06
06
66
3c
00
3c
66
60
7c
66
66
3c
00
7e
66
0c
18
18
18
18
00
3c
66
66
3c
66
66
3c
00
3c
66
66
3e
06
66
3c
00
00
00
18
00
00
18
00
00
00
00
18
00
00
18
18
30
0e
18
30
60
30
18
0e
00
00
00
7e
00
7e
00
00
00
70
18
0c
06
0c
18
70
00
3c
66
06
0c
18
00
18
00
00
00
00
ff
ff
00
00
00
18
3c
66
7e
66
66
66
00
7c
66
66
7c
66
66
7c
00
3c
66
60
60
60
66
3c
00
78
6c
66
66
66
6c
78
00
7e
60
60
78
60
60
7e
00
7e
60
60
78
60
60
60
00
3c
66
60
6e
66
66
3c
00
66
66
66
7e
66
66
66
00
3c
18
18
18
18
18
3c
00
1e
0c
0c
0c
0c
6c
38
00
66
6c
78
70
78
6c
66
00
60
60
60
60
60
60
7e
00
63
77
7f
6b
63
63
63
00
66
76
7e
7e
6e
66
66
00
3c
66
66
66
66
66
3c
00
7c
66
66
7c
60
60
60
00
3c
66
66
66
66
3c
0e
00
7c
66
66
7c
78
6c
66
00
3c
66
60
3c
06
66
3c
00
7e
18
18
18
18
18
18
00
66
66
66
66
66
66
3c
00
66
66
66
66
66
3c
18
00
63
63
63
6b
7f
77
63
00
66
66
3c
18
3c
66
66
00
66
66
66
3c
18
18
18
00
7e
06
0c
18
30
60
7e
00
18
18
18
ff
ff
18
18
18
c0
c0
30
30
c0
c0
30
30
18
18
18
18
18
18
18
18
33
33
cc
cc
33
33
cc
cc
33
99
cc
66
33
99
cc
66
00
00
00
00
00
00
00
00
f0
f0
f0
f0
f0
f0
f0
f0
00
00
00
00
ff
ff
ff
ff
ff
00
00
00
00
00
00
00
00
00
00
00
00
00
00
ff
c0
c0
c0
c0
c0
c0
c0
c0
cc
cc
33
33
cc
cc
33
33
03
03
03
03
03
03
03
03
00
00
00
00
cc
cc
33
33
cc
99
33
66
cc
99
33
66
03
03
03
03
03
03
03
03
18
18
18
1f
1f
18
18
18
00
00
00
00
0f
0f
0f
0f
18
18
18
1f
1f
00
00
00
00
00
00
f8
f8
18
18
18
00
00
00
00
00
00
ff
ff
00
00
00
1f
1f
18
18
18
18
18
18
ff
ff
00
00
00
00
00
00
ff
ff
18
18
18
18
18
18
f8
f8
18
18
18
c0
c0
c0
c0
c0
c0
c0
c0
e0
e0
e0
e0
e0
e0
e0
e0
07
07
07
07
07
07
07
07
ff
ff
00
00
00
00
00
00
ff
ff
ff
00
00
00
00
00
00
00
00
00
00
ff
ff
ff
01
03
06
6c
78
70
60
00
00
00
00
00
f0
f0
f0
f0
0f
0f
0f
0f
00
00
00
00
18
18
18
f8
f8
00
00
00
f0
f0
f0
f0
00
00
00
00
f0
f0
f0
f0
0f
0f
0f
0f
08
09
00
28
50
78
a0
c8
f0
18
40
68
90
b8
e0
08
30
58
80
a8
d0
f8
20
48
70
98
c0
0c
0c
0c
0c
0c
0c
0c
0d
0d
0d
0d
0d
0d
0e
0e
0e
0e
0e
0e
0e
0f
0f
0f
0f
0f
a2
28
a0
19
60
b0
0e
86
cd
86
c4
84
ca
84
c5
20
70
de
20
a8
d8
a6
cd
a4
ca
60
a9
0c
8d
3e
05
a9
03
85
99
a9
00
85
98
8d
47
05
85
83
85
ef
85
f0
a9
7a
8d
45
05
a9
db
8d
46
05
a9
0a
8d
3f
05
8d
4a
05
8d
42
05
a9
80
8d
40
05
a9
10
8d
3b
05
a9
04
8d
41
05
20
70
de
20
9a
d8
20
aa
d8
20
f7
da
ec
e5
07
e8
90
f4
ae
e6
07
86
cd
86
c4
ac
e7
07
84
ca
84
c5
a6
cd
bd
02
d8
85
c8
bd
1b
d8
85
c9
a5
c8
85
ea
a5
c9
29
03
09
08
85
eb
60
ae
5d
05
f0
0f
ac
5e
05
b9
67
05
ce
5d
05
ee
5e
05
58
18
60
ac
27
05
ea
bd
28
05
9d
27
05
e8
e4
ef
d0
f5
c6
ef
98
58
18
60
20
49
dc
20
b4
d8
a4
ca
b1
ea
48
ad
3b
05
91
ea
98
18
65
c8
8d
0d
ff
a5
c9
69
00
e9
0b
8d
0c
ff
a5
ef
0d
5d
05
f0
f9
68
91
ea
a9
ff
8d
0c
ff
8d
0d
ff
20
c1
d8
c9
83
d0
10
a2
09
78
86
ef
bd
29
e1
9d
26
05
ca
d0
f7
f0
ba
c9
0d
d0
b3
85
c7
20
95
df
8e
49
05
20
87
df
a9
00
85
cb
ac
e7
07
a5
c4
30
13
c5
cd
90
0f
a4
c5
cd
49
05
d0
04
c4
c3
f0
02
b0
11
85
cd
84
ca
4c
77
d9
98
48
8a
48
a5
c7
f0
c4
10
08
a9
00
85
c7
4c
74
cf
ea
20
a8
d8
20
2f
df
85
ce
29
3f
06
ce
24
ce
10
02
09
80
90
04
a6
cb
d0
04
70
02
09
40
20
ba
d9
a4
cd
cc
49
05
90
0a
a4
ca
c4
c3
90
04
66
c7
30
03
20
bf
df
c9
de
d0
02
a9
ff
85
ce
68
aa
68
a8
a5
ce
18
60
c9
22
d0
08
a5
cb
49
01
85
cb
a9
22
60
a5
ce
8d
eb
07
68
a8
a5
cf
f0
02
46
cb
68
aa
68
18
60
09
40
a6
c2
f0
02
09
80
a6
cf
f0
02
c6
cf
2c
ea
07
10
09
48
20
ce
dd
a2
00
86
cf
68
20
01
e0
cc
e8
07
90
0c
a6
cd
ec
e5
07
90
05
2c
e9
07
30
17
20
a8
d8
20
bf
df
90
0f
20
39
df
b0
09
38
2c
e9
07
70
04
20
5e
da
18
60
a6
cd
ec
e5
07
90
10
2c
e9
07
10
07
ad
e6
07
85
cd
b0
06
20
89
da
18
e6
cd
4c
a8
d8
bd
02
d8
85
a9
85
c0
bd
1b
d8
85
c1
29
03
09
08
85
aa
b1
c0
91
c8
b1
a9
91
ea
cc
e8
07
c8
90
f2
60
a6
c4
30
06
e4
cd
90
02
e6
c4
ae
e5
07
20
aa
d8
ac
e7
07
e4
cd
f0
0e
ca
20
3b
df
e8
20
48
df
ca
20
3d
da
b0
e8
20
f7
da
4c
59
df
ae
e6
07
e8
20
3b
df
90
0c
ec
e5
07
90
f5
ae
e6
07
e8
20
4a
df
c6
cd
24
c4
30
02
c6
c4
ae
e6
07
e4
fe
b0
02
c6
fe
20
c5
da
ae
e6
07
20
3b
df
08
20
4a
df
28
90
05
2c
ec
07
30
c5
60
20
aa
d8
ac
e7
07
ec
e5
07
b0
0e
e8
20
3b
df
ca
20
48
df
e8
20
3d
da
b0
e7
20
f7
da
a9
7f
20
70
db
c9
df
d0
09
a0
00
ea
ca
d0
fc
88
d0
f9
60
ea
ea
ea
ac
e7
07
20
4a
df
20
aa
d8
88
c8
a9
20
91
c8
ad
3b
05
91
ea
cc
e8
07
d0
f1
60
a9
00
8d
43
05
a0
40
84
c6
20
70
db
aa
e0
ff
d0
03
4c
01
dc
a0
00
a9
26
85
ec
a9
e0
85
ed
a9
fe
a2
08
48
68
48
20
70
db
85
ee
68
48
20
70
db
c5
ee
d0
f0
4a
b0
16
48
b1
ec
c9
05
b0
0c
c9
03
f0
08
0d
43
05
8d
43
05
10
02
84
c6
68
c8
c0
41
b0
08
ca
d0
df
38
68
2a
d0
c7
68
a5
c6
6c
45
05
8d
30
fd
8d
08
ff
ad
08
ff
60
ad
43
05
c9
03
d0
19
ad
47
05
30
34
ad
44
05
d0
2f
ad
13
ff
49
04
8d
13
ff
a9
08
8d
44
05
d0
20
0a
c9
08
90
10
a9
06
ae
f7
07
d0
09
a6
c6
e0
0d
d0
03
86
f0
60
aa
bd
1e
e0
85
ec
bd
1f
e0
85
ed
a4
c6
b1
ec
aa
cc
f6
07
f0
07
a0
10
8c
42
05
d0
36
29
7f
2c
40
05
30
16
70
57
c9
7f
f0
29
c9
14
f0
0c
c9
20
f0
08
c9
1d
f0
04
c9
11
d0
43
ac
42
05
f0
05
ce
42
05
d0
39
ce
41
05
d0
34
a0
04
8c
41
05
a4
ef
88
10
2a
ea
ea
4e
44
05
a4
c6
8c
f6
07
e0
ff
f0
1c
8a
a2
00
86
f0
a2
07
dd
41
dc
f0
11
ca
10
f8
a6
ef
ec
3f
05
b0
06
9d
27
05
e8
86
ef
60
bd
5f
05
8d
5d
05
a9
00
ca
30
06
18
7d
5f
05
90
f7
8d
5e
05
60
85
89
86
8a
87
8b
88
8c
85
ce
48
8a
48
98
48
a5
f0
d0
fc
85
c7
a9
d9
48
a9
c6
48
a4
ca
a5
ce
c9
0d
f0
28
c9
8d
f0
24
ae
eb
07
e0
1b
d0
03
4c
06
de
aa
30
14
c9
20
90
2e
c9
60
90
04
29
df
d0
02
29
3f
20
ba
d9
4c
db
d9
4c
47
dd
20
95
df
e8
20
4a
df
ac
e7
07
84
ca
20
21
da
a9
00
85
cf
85
c2
85
cb
8d
3c
05
60
c9
1b
f0
4e
a6
cf
f0
03
4c
df
d9
c9
14
d0
03
4c
99
dd
a6
cb
d0
f2
c9
12
d0
02
85
c2
c9
13
d0
0b
cd
eb
07
d0
03
20
70
de
4c
9a
d8
c9
1d
f0
24
c9
11
f0
26
c9
0e
f0
49
c9
08
f0
4c
c9
09
f0
4f
a2
0f
dd
33
e1
f0
04
ca
10
f8
60
48
20
8a
cf
8d
3b
05
68
60
20
bf
df
b0
04
60
20
21
da
20
39
df
b0
03
38
66
c4
18
60
ae
e6
07
e4
cd
b0
f8
20
03
dd
c6
cd
4c
a8
d8
20
d4
df
b0
eb
d0
e8
e6
cd
d0
ed
ad
13
ff
09
04
d0
15
a9
80
0d
47
05
30
05
a9
7f
2d
47
05
8d
47
05
60
ad
13
ff
29
fb
8d
13
ff
60
29
7f
c9
7f
d0
02
a9
5e
c9
20
90
03
4c
d9
d9
a6
cb
f0
05
09
40
4c
df
d9
c9
14
f0
6b
a6
cf
d0
f3
c9
11
f0
a2
c9
12
d0
04
a9
00
85
c2
c9
1d
f0
a5
c9
13
d0
03
4c
8b
d8
c9
02
d0
05
a9
80
8d
3c
05
c9
04
d0
05
a9
00
8d
3c
05
c9
0e
f0
aa
09
80
4c
e6
dc
20
1c
dd
20
f6
df
b0
10
cc
e8
07
90
16
a6
cd
e8
20
3b
df
b0
0e
20
ff
df
a5
cc
85
ca
a5
fe
85
cd
4c
a8
d8
20
bf
df
20
2f
df
20
d4
df
20
11
e0
20
bf
df
4c
a1
dd
20
f6
df
20
95
df
e4
fe
d0
02
c4
cc
90
21
20
f8
d9
b0
22
20
d4
df
20
2f
df
20
bf
df
20
11
e0
20
d4
df
a6
cd
e4
fe
d0
eb
c4
cc
d0
e7
20
ff
df
e6
cf
d0
02
c6
cf
4c
b1
dd
29
7f
38
e9
41
c9
17
b0
0a
0a
aa
bd
1b
de
48
bd
1a
de
48
60
28
df
5f
de
25
df
9f
de
18
de
18
de
18
de
18
de
8a
de
81
df
94
df
1c
df
1f
df
87
d8
9a
dc
e0
de
ca
de
47
de
18
de
5d
de
18
de
f5
de
03
df
20
70
de
20
8b
d8
a9
01
aa
20
7a
de
a9
17
a2
26
20
67
de
4c
9a
d8
18
24
38
a6
ca
a5
cd
90
13
8d
e5
07
8e
e8
07
4c
80
de
a9
18
a2
27
20
67
de
a9
00
aa
8d
e6
07
8e
e7
07
a9
00
a2
04
9d
ed
07
ca
d0
fa
60
20
5e
da
20
a1
d8
e8
20
3b
df
08
20
46
df
28
b0
03
38
66
c4
60
20
87
df
ad
e6
07
48
a5
cd
8d
e6
07
ad
ec
07
48
a9
80
8d
ec
07
20
9e
da
68
8d
ec
07
ad
e6
07
85
cd
68
8d
e6
07
38
66
c4
4c
a1
d8
20
f6
df
20
fd
da
e6
cd
20
a8
d8
ac
e7
07
20
39
df
b0
f0
4c
b1
dd
20
f6
df
20
ff
df
cc
e7
07
d0
05
20
39
df
90
ed
20
d4
df
90
ee
20
f6
df
8a
48
20
89
da
68
85
fe
4c
de
de
20
f6
df
20
39
df
b0
03
38
66
c4
ad
e6
07
85
cd
20
5e
da
20
4a
df
4c
de
de
a9
00
2c
a9
80
8d
e9
07
60
a9
00
2c
a9
ff
8d
ea
07
60
a4
ca
b1
ea
8d
ed
07
b1
c8
60
a6
cd
20
66
df
3d
ee
07
c9
01
4c
55
df
a6
cd
b0
0f
20
66
df
49
ff
3d
ee
07
9d
ee
07
ae
e9
02
60
2c
e9
07
70
dd
20
66
df
1d
ee
07
d0
ec
8e
e9
02
8a
29
07
aa
bd
7a
df
48
ad
e9
02
4a
4a
4a
aa
68
60
80
40
20
10
08
04
02
01
ac
e7
07
84
ca
20
39
df
90
06
c6
cd
10
f7
e6
cd
4c
a8
d8
e6
cd
20
39
df
b0
f9
c6
cd
20
a8
d8
ac
e8
07
84
ca
20
2f
df
c9
20
d0
0f
cc
e7
07
d0
05
20
39
df
90
05
20
d4
df
90
ea
84
c3
60
48
a4
ca
cc
e8
07
90
08
20
21
da
ac
e7
07
88
38
c8
84
ca
68
60
a4
ca
88
30
05
cc
e7
07
b0
11
ac
e6
07
c4
cd
b0
10
c6
cd
48
20
a8
d8
68
ac
e8
07
84
ca
cc
e8
07
18
60
a4
ca
84
cc
a6
cd
86
fe
60
a9
20
a4
ca
91
c8
20
b4
d8
ad
3b
05
0d
3c
05
91
ea
60
a4
ca
91
c8
20
b4
d8
ad
ed
07
91
ea
60
26
e0
67
e0
a8
e0
e9
e0
14
0d
5c
8c
85
89
86
40
33
57
41
34
5a
53
45
01
35
52
44
36
43
46
54
58
37
59
47
38
42
48
55
56
39
49
4a
30
4d
4b
4f
4e
11
50
4c
91
2e
3a
2d
2c
9d
2a
3b
1d
1b
3d
2b
2f
31
13
04
32
20
02
51
03
ff
94
8d
a9
88
8a
87
8b
ba
23
d7
c1
24
da
d3
c5
01
25
d2
c4
26
c3
c6
d4
d8
27
d9
c7
28
c2
c8
d5
d6
29
c9
ca
5e
cd
cb
cf
ce
11
d0
cc
91
3e
5b
dd
3c
9d
c0
5d
1d
1b
5f
db
3f
21
93
04
22
a0
02
d1
83
ff
94
8d
a8
88
8a
87
8b
a4
96
b3
b0
97
ad
ae
b1
01
98
b2
ac
99
bc
bb
a3
bd
9a
b7
a5
9b
bf
b4
b8
be
29
a2
b5
30
a7
a1
b9
aa
11
af
b6
91
3e
5b
dc
3c
9d
df
5d
1d
1b
de
a6
3f
81
93
04
95
a0
02
ab
83
ff
ff
ff
1c
ff
ff
ff
ff
ff
1c
17
01
9f
1a
13
05
ff
9c
12
04
1e
03
06
14
18
1f
19
07
9e
02
08
15
16
12
09
0a
92
0d
0b
0f
0e
ff
10
0c
ff
84
1b
ff
82
ff
ff
1d
ff
1b
06
ff
ff
90
ff
ff
05
ff
ff
11
ff
ff
44
cc
22
2a
0d
52
55
4e
0d
90
05
1c
9f
9c
1e
1f
9e
81
95
96
97
98
99
9a
9b
00
71
32
63
44
35
46
77
48
29
5a
6b
5c
6d
2e
5f
09
40
2c
09
20
48
24
94
10
0a
38
66
a6
20
81
e1
46
94
46
a6
68
85
95
78
20
c6
e2
20
bf
e2
a5
01
09
04
85
01
78
20
bf
e2
20
c6
e2
20
dc
e2
78
20
c6
e2
20
d4
e2
b0
5f
20
b8
e2
24
a6
10
0e
20
d4
e2
90
fb
a5
01
c5
01
d0
fa
0a
b0
f7
20
d4
e2
90
fb
20
bf
e2
a9
08
85
aa
20
d4
e2
90
3e
66
95
b0
05
20
cd
e2
d0
03
20
c6
e2
20
11
e3
20
b8
e2
20
11
e3
a5
01
29
fe
09
02
85
01
c6
aa
d0
da
8a
48
a2
78
a5
01
c5
01
d0
fa
0a
90
07
ca
d0
f4
68
aa
b0
09
68
aa
58
60
a9
80
4c
f0
e1
a9
03
20
1e
f4
58
18
90
4b
85
95
20
77
e1
a5
01
29
fb
85
01
60
85
95
20
77
e1
24
90
30
36
78
20
cd
e2
20
fc
e1
20
b8
e2
24
01
70
fc
58
60
ff
24
94
30
05
38
66
94
d0
05
48
20
81
e1
68
85
95
18
60
78
20
bf
e2
a5
01
09
04
85
01
a9
5f
d0
02
a9
3f
20
58
e1
20
fc
e1
8a
a2
14
ca
d0
fd
aa
20
b8
e2
4c
c6
e2
78
a9
00
85
aa
20
b8
e2
8a
48
20
d4
e2
10
fb
a2
20
20
c6
e2
a5
01
c5
01
d0
fa
0a
10
1f
ca
d0
f4
a5
aa
f0
07
68
aa
a9
02
4c
f0
e1
20
cd
e2
a2
40
ca
d0
fd
a9
40
20
1e
f4
e6
aa
d0
d3
a2
08
a5
01
0a
10
fb
66
a8
a5
01
c5
01
d0
fa
0a
30
f7
ca
d0
ed
86
aa
68
aa
20
cd
e2
a9
40
24
90
50
03
20
45
e2
a5
a8
58
18
60
a5
01
29
fd
85
01
60
a5
01
09
02
85
01
60
a5
01
29
fe
85
01
60
a5
01
09
01
85
01
60
a5
01
c5
01
d0
fa
0a
60
20
f8
e2
a9
10
2c
09
ff
f0
fb
8d
09
ff
60
20
fc
e2
a9
10
2c
09
ff
f0
fb
8d
09
ff
60
a9
04
d0
02
a9
40
08
48
78
a9
00
8d
02
ff
68
8d
03
ff
a9
10
8d
09
ff
28
60
8a
a2
05
ca
d0
fd
aa
60
38
24
18
ad
10
fd
29
04
f0
3f
08
20
d8
fb
0d
50
52
45
53
53
20
50
4c
41
59
20
00
28
90
0d
20
d8
fb
26
20
52
45
43
4f
52
44
20
00
20
d8
fb
4f
4e
20
54
41
50
45
00
20
cb
fb
b0
0f
ad
10
fd
29
04
d0
f4
20
d8
fb
0d
4f
4b
00
18
60
78
ad
06
ff
29
ef
8d
06
ff
ad
0a
ff
29
fd
09
08
8d
0a
ff
60
78
ad
06
ff
09
10
8d
06
ff
ad
0a
ff
29
f7
09
02
8d
0a
ff
58
60
08
38
6e
fc
07
a5
01
29
f5
85
01
a2
1e
20
ea
e2
ca
d0
fa
28
60
43
31
39
38
34
43
4f
4d
4d
4f
44
4f
52
45
a5
01
09
08
85
01
60
a0
00
a9
20
91
b6
c8
c0
c0
d0
f9
60
48
a9
33
85
b6
a9
03
85
b7
68
60
20
cb
fb
90
10
20
b0
e3
20
78
e3
ae
be
07
9a
a9
00
8d
be
07
38
60
ad
09
ff
2d
0a
ff
29
08
d0
01
60
8d
09
ff
78
a9
90
8d
00
ff
a9
33
8d
01
ff
ae
bf
07
9a
38
60
a9
a8
8d
00
ff
a9
48
8d
01
ff
a9
08
8d
09
ff
60
38
b0
01
18
8c
ca
07
8e
cb
07
ac
c8
07
ae
c9
07
a9
10
2c
09
ff
f0
fb
8c
02
ff
8e
03
ff
8d
09
ff
a5
01
49
02
85
01
08
20
ce
e3
28
ac
ca
07
ae
cb
07
b0
d0
60
a9
4e
8d
c8
07
a9
03
8d
c9
07
60
a9
d0
8d
c8
07
a9
00
8d
c9
07
60
a9
a4
8d
c8
07
a9
01
8d
c9
07
60
20
52
e4
20
13
e4
20
5d
e4
4c
13
e4
20
5d
e4
20
13
e4
20
52
e4
4c
13
e4
20
47
e4
20
13
e4
20
5d
e4
4c
13
e4
85
a7
a9
01
8d
b1
07
20
80
e4
a2
08
66
a7
b0
09
ee
b1
07
20
68
e4
4c
a8
e4
20
74
e4
ca
d0
ed
6e
b1
07
b0
06
20
68
e4
4c
b9
e4
20
74
e4
60
ba
8e
be
07
a5
01
09
02
85
01
20
52
e4
a0
01
8c
03
ff
a9
10
8d
09
ff
24
f7
10
04
a0
40
a2
fe
20
13
e4
ca
d0
fa
88
d0
f7
a0
09
98
05
f7
20
8c
e4
88
d0
f7
a5
f8
85
f5
f0
03
20
8c
e4
a0
00
a9
ba
8d
df
07
20
d9
07
48
45
f5
85
f5
68
20
8c
e4
e6
ba
d0
02
e6
bb
ee
f3
03
d0
e2
ee
f4
03
d0
dd
a5
f5
20
8c
e4
20
5d
e4
20
13
e4
20
52
e4
a0
01
a2
c2
20
13
e4
ca
d0
fa
88
d0
f7
60
20
19
e3
20
64
e3
20
8d
e3
b0
26
a9
80
85
f7
a5
b6
85
ba
a5
b7
85
bb
a9
41
8d
f3
03
a9
ff
8d
f4
03
20
ba
e4
b0
0b
a5
f7
10
06
a9
00
85
f7
10
df
18
20
b0
e3
4c
78
e3
20
c3
e3
20
b7
e3
a0
00
a5
b2
91
b6
c8
a5
b3
91
b6
c8
a5
9d
91
b6
c8
a5
9e
91
b6
c8
8c
b3
07
a0
00
8c
b2
07
ac
b2
07
c4
ab
f0
16
a9
af
8d
df
07
20
d9
07
ac
b3
07
91
b6
ee
b2
07
ee
b3
07
4c
90
e5
4c
35
e5
20
19
e3
20
64
e3
20
8d
e3
b0
2f
a9
80
85
f7
a5
b2
85
ba
a5
b3
85
bb
18
a5
9d
e5
b2
49
ff
8d
f3
03
a5
9e
e5
b3
49
ff
8d
f4
03
20
ba
e4
b0
0b
a5
f7
10
06
a9
00
85
f7
10
d6
18
20
b0
e3
4c
78
e3
20
b7
e3
a9
05
85
f8
4c
35
e5
40
00
80
ae
b8
07
ac
b9
07
ad
bb
07
48
ad
ba
07
48
a9
10
24
01
f0
fc
24
01
d0
fc
8e
02
ff
8c
03
ff
68
8d
04
ff
68
8d
05
ff
a9
50
8d
09
ff
a5
01
c5
01
d0
fa
29
10
d0
d1
20
ce
e3
a9
10
24
01
d0
47
2c
09
ff
f0
f7
a5
01
c5
01
d0
fa
29
10
d0
38
a9
40
2c
09
ff
f0
fb
a5
01
c5
01
d0
fa
29
10
d0
2c
ad
bc
07
8d
02
ff
ad
bd
07
8d
03
ff
a9
10
8d
09
ff
a9
10
2c
09
ff
f0
fb
a5
01
c5
01
d0
fa
29
10
f0
0f
2c
fc
e5
30
08
2c
fa
e5
70
03
2c
fb
e5
18
60
38
60
40
00
80
20
fd
e5
b0
3d
70
12
10
02
30
27
20
fd
e5
b0
32
70
02
50
2e
2c
8f
e6
18
60
20
fd
e5
70
04
10
0d
30
20
20
fd
e5
b0
1b
70
f9
10
17
30
05
2c
8e
e6
18
60
20
fd
e5
b0
0b
70
09
10
02
30
05
2c
90
e6
18
60
38
60
ba
8e
bf
07
18
6e
cc
07
58
20
91
e6
b0
fb
70
f9
10
f7
20
03
e4
18
60
2c
cc
07
30
51
20
d5
e6
b0
4c
a9
01
8d
b1
07
a2
08
8e
b5
07
38
6e
cc
07
20
91
e6
b0
39
70
04
10
0f
30
33
18
66
a7
ee
b1
07
ce
b5
07
d0
ea
f0
08
38
66
a7
ce
b5
07
d0
e0
20
91
e6
b0
19
70
04
10
0b
30
13
ad
b1
07
29
01
d0
0c
f0
07
ad
b1
07
29
01
f0
03
18
90
01
38
78
08
18
6e
cc
07
28
60
ba
8e
be
07
a5
93
f0
03
38
66
93
20
8d
e3
20
64
e3
ad
c0
07
85
b6
ad
c1
07
85
b7
ad
c2
07
8d
f5
03
ad
c3
07
8d
f6
03
20
1d
e9
a0
00
8c
b6
07
8c
b7
07
84
f5
84
b1
84
f8
a9
b6
8d
df
07
2c
b0
07
10
13
20
ec
e6
b0
0b
a5
a7
85
f8
45
f5
85
f5
4c
a0
e7
38
66
f8
20
ec
e6
b0
19
a0
00
20
d9
07
ea
24
93
30
02
a5
a7
c5
a7
d0
09
91
b6
45
f5
85
f5
4c
dc
e7
ac
b6
07
c0
1e
b0
12
a5
b6
99
37
04
a5
b7
99
55
04
ee
b6
07
e6
b1
4c
dc
e7
a9
ff
8d
b6
07
e6
b6
d0
02
e6
b7
ee
f5
03
d0
b9
ee
f6
03
d0
b4
ad
b6
07
8d
b7
07
20
ec
e6
ad
b7
07
d0
06
a5
a7
c5
f5
d0
03
4c
0a
e8
a5
f7
30
03
4c
b7
e8
a5
f7
30
0b
ad
b7
07
f0
03
4c
b7
e8
4c
c7
e8
a9
00
8d
b6
07
85
f5
ad
c0
07
85
b6
ad
c1
07
85
b7
ad
c2
07
8d
f5
03
ad
c3
07
8d
f6
03
20
1d
e9
2c
b0
07
10
15
20
ec
e6
24
f8
10
08
a5
a7
85
f8
90
02
66
f8
a5
f8
45
f5
85
f5
20
ec
e6
6e
c4
07
a5
a7
45
f5
85
f5
2c
b7
07
30
32
ac
b6
07
cc
b7
07
f0
2a
b9
37
04
c5
b6
d0
23
b9
55
04
c5
b7
d0
1c
ee
b6
07
ad
c4
07
30
14
a0
00
20
d9
07
ea
24
93
30
02
a5
a7
c5
a7
d0
04
c6
b1
91
b6
e6
b6
d0
02
e6
b7
ee
f5
03
d0
b2
ee
f6
03
d0
ad
20
ec
e6
a9
00
85
90
a5
f8
a6
b1
f0
14
24
93
30
08
a9
60
85
90
38
4c
c8
e8
a9
10
85
90
38
4c
c8
e8
18
20
b0
e3
20
78
e3
60
33
03
41
ff
a0
03
b9
cf
e8
99
c0
07
88
10
f7
8c
b0
07
a5
93
48
c8
84
93
8c
39
05
20
4b
e7
68
85
93
4c
c3
e3
a5
b2
8d
c0
07
a5
b3
8d
c1
07
18
a5
9d
e5
b2
49
ff
8d
c2
07
a5
9e
e5
b3
49
ff
8d
c3
07
18
6e
b0
07
4c
4b
e7
02
01
02
02
0d
02
a2
05
bd
17
e9
9d
b8
07
ca
10
f7
a9
0a
8d
c5
07
20
fd
e5
b0
f6
50
f4
ce
c5
07
d0
f4
a9
00
85
ba
85
bb
a0
10
a2
00
a9
10
24
01
f0
fc
24
01
d0
fc
e8
f0
e9
24
01
f0
f9
e8
f0
e2
24
01
d0
f9
8a
18
65
ba
85
ba
a9
00
65
bb
85
bb
88
d0
d7
46
bb
66
ba
46
bb
66
ba
a5
ba
8d
b8
07
0a
8d
ba
07
8d
bc
07
a5
bb
8d
b9
07
2a
8d
bb
07
8d
bd
07
20
fd
e5
b0
fb
70
f9
10
f7
20
fd
e5
b0
f2
70
f0
30
ee
18
6e
cc
07
20
03
e4
a9
03
8d
c6
07
20
f6
e6
90
03
ce
c6
07
20
ec
e6
90
08
ce
c6
07
d0
03
4c
1d
e9
a5
a7
29
0f
c9
01
d0
eb
a5
a7
29
80
85
f7
60
20
d3
e8
b0
4d
a5
f8
c9
05
f0
43
c9
01
f0
08
c9
03
f0
04
c9
04
d0
e9
aa
24
9a
10
2f
20
d8
fb
0d
46
4f
55
4e
44
20
00
a0
04
b1
b6
20
d2
ff
c8
c0
15
d0
f6
a2
ff
20
ea
e2
20
ea
e2
ca
f0
0d
a9
7f
20
70
db
c9
7f
f0
0b
c9
df
d0
ea
18
a5
f8
60
ea
ea
ea
a9
00
60
20
cc
e9
b0
2d
c9
05
f0
2b
a0
ff
c8
c4
ab
f0
26
a9
af
8d
df
07
20
d9
07
d9
37
03
f0
ee
46
f8
90
df
a0
ff
8c
c3
07
88
8c
c2
07
a0
01
20
d5
e8
4c
21
ea
a9
00
38
60
18
a5
f8
60
ad
d4
07
29
10
f0
32
ad
10
fd
29
02
f0
2b
a2
00
2c
d0
07
10
09
ad
cf
07
8e
d0
07
4c
89
ea
2c
ce
07
10
16
2c
d6
07
30
11
ad
cd
07
8e
ce
07
8d
00
fd
ad
d4
07
29
ef
8d
d4
07
60
ad
d4
07
29
08
f0
54
ad
d4
07
29
f7
8d
d4
07
ad
00
fd
f0
19
8d
d5
07
c5
fc
d0
07
a9
00
8d
d6
07
f0
39
c5
fd
d0
07
a9
ff
8d
d6
07
d0
2e
ad
d3
07
c9
3f
f0
27
c9
38
d0
0f
a5
fd
f0
0b
8d
cf
07
a9
ff
8d
d0
07
8d
d7
07
ae
d1
07
e8
8a
29
3f
8d
d1
07
aa
ad
d5
07
9d
f7
03
ee
d3
07
60
ad
d3
07
f0
34
08
78
ae
d2
07
e8
8a
29
3f
8d
d2
07
28
aa
bd
f7
03
48
ce
d3
07
ad
d3
07
c9
08
d0
19
2c
d7
07
10
14
a5
fc
f0
10
8d
cf
07
38
6e
d0
07
4e
d7
07
2c
d8
07
10
0b
48
ad
d4
07
29
4f
49
40
85
90
68
18
60
2c
ce
07
30
fb
8d
cd
07
38
6e
ce
07
4c
2a
eb
a9
00
a2
0b
9d
cd
07
ca
10
fa
8d
01
fd
85
fc
85
fd
60
0d
49
2f
4f
20
45
52
52
4f
52
20
a3
0d
53
45
41
52
43
48
49
4e
47
a0
46
4f
52
a0
0d
50
52
45
53
53
20
50
4c
41
59
20
4f
4e
20
54
41
50
c5
50
52
45
53
53
20
52
45
43
4f
52
44
20
26
20
50
4c
41
59
20
4f
4e
20
54
41
50
c5
0d
4c
4f
41
44
49
4e
c7
0d
53
41
56
49
4e
47
a0
0d
56
45
52
49
46
59
49
4e
c7
0d
46
4f
55
4e
44
a0
0d
4f
4b
8d
24
9a
10
0d
b9
58
eb
08
29
7f
20
d2
ff
c8
28
10
f3
18
60
a5
98
d0
1a
a5
ef
0d
5d
05
f0
3e
78
4c
c1
d8
a5
98
d0
0b
a5
ca
85
c5
a5
cd
85
c4
4c
65
d9
c9
03
d0
1f
05
c7
85
c7
ad
e8
07
85
c3
4c
65
d9
20
ba
fb
c9
01
d0
06
20
24
ec
4c
c4
fb
20
f1
ea
4c
c4
fb
90
eb
a5
90
f0
6b
a9
0d
18
60
ac
39
05
c0
bf
90
06
20
d3
e8
90
f4
60
ac
39
05
b1
b6
48
c8
c0
bf
b0
09
b1
b6
d0
05
a9
40
20
1e
f4
ee
39
05
68
18
60
48
a5
99
c9
03
d0
04
68
4c
49
dc
90
04
68
4c
df
ec
20
b7
fb
c9
01
d0
21
ac
39
05
c0
bf
90
0b
20
35
e5
b0
0f
a9
02
85
f8
a0
00
68
91
b6
c8
8c
39
05
90
0a
68
a9
00
4c
c4
fb
68
20
37
eb
4c
c1
fb
86
ba
24
f9
70
05
a6
ba
4c
52
e2
a5
f9
29
30
aa
a9
84
9d
c0
fe
bd
c2
fe
30
fb
a9
00
9d
c3
fe
9d
c2
fe
bd
c2
fe
10
fb
bd
c1
fe
29
03
c9
03
d0
02
a9
40
20
1e
f4
bd
c0
fe
48
a9
40
9d
c2
fe
bd
c2
fe
30
fb
a9
ff
9d
c3
fe
a9
00
9d
c0
fe
9d
c2
fe
4c
d4
ed
ea
24
f9
30
03
4c
1d
e2
48
8d
e8
05
a9
83
86
ba
48
a5
f9
29
30
aa
68
9d
c0
fe
bd
c2
fe
30
fb
ad
e8
05
9d
c0
fe
a9
00
9d
c2
fe
bd
c2
fe
10
fb
bd
c1
fe
29
03
20
1e
f4
4c
db
ed
20
e8
ee
f0
03
4c
79
f2
20
f8
ee
f0
11
c9
03
f0
0d
b0
0f
c9
02
d0
28
20
25
eb
b0
05
a5
ae
85
98
18
60
aa
20
fa
ed
24
90
30
12
a5
ad
10
06
20
13
ee
4c
4f
ed
20
1a
ee
8a
24
90
10
e2
4c
7f
f2
a6
ad
e0
60
f0
d9
4c
82
f2
20
e8
ee
f0
03
4c
79
f2
20
f8
ee
d0
03
4c
85
f2
c9
03
f0
0d
b0
0f
c9
02
d0
27
20
25
eb
b0
05
a5
ae
85
99
18
60
aa
20
2c
ee
24
90
30
11
a5
ad
10
05
20
45
ee
d0
03
20
4d
ee
8a
24
90
10
e3
4c
7f
f2
a6
ad
e0
60
f0
c6
d0
d8
48
86
ba
a2
30
a5
ae
c9
08
f0
06
c9
09
d0
17
a2
00
a9
55
9d
c0
fe
5d
c0
fe
d0
0b
bd
c1
fe
29
02
d0
04
86
f9
18
24
38
a6
ba
68
60
bd
c2
fe
10
fb
30
05
a9
00
9d
c0
fe
a9
40
9d
c2
fe
a6
ba
68
18
60
8d
f2
fe
8d
c5
fe
8d
c2
fe
ca
8e
c3
fe
4c
ea
cf
20
a9
ed
90
03
4c
53
e1
48
a9
40
8d
e8
05
a5
f9
09
40
85
f9
a9
81
4c
ec
ec
24
f9
70
35
4c
0c
e2
24
f9
70
03
4c
03
e2
48
ea
ea
8d
e8
05
a9
82
4c
ec
ec
20
a9
ed
90
03
4c
56
e1
48
a9
20
8d
e8
05
a5
f9
09
80
85
f9
a9
81
4c
ec
ec
24
f9
30
03
4c
fc
e1
60
24
f9
30
03
4c
f7
e1
48
8d
e8
05
a9
82
4c
ec
ec
66
ba
20
ed
ee
f0
02
18
60
20
f8
ee
8a
48
a5
ae
f0
5b
c9
03
f0
57
b0
40
c9
02
d0
08
08
78
20
46
eb
28
f0
49
a5
ad
29
0f
f0
43
ac
39
05
c0
bf
90
0e
20
35
e5
b0
12
a9
02
85
f8
a0
00
8c
39
05
a9
00
91
b6
20
35
e5
90
04
68
a9
00
60
a5
ad
c9
62
d0
1b
20
f0
e5
4c
ca
ee
24
ba
10
0e
a5
ae
c9
08
90
08
a5
ad
29
0f
c9
0f
f0
03
20
11
f2
68
aa
c6
97
e4
97
f0
14
a4
97
b9
09
05
9d
09
05
b9
13
05
9d
13
05
b9
1d
05
9d
1d
05
18
60
a9
00
85
90
8a
a6
97
ca
30
15
dd
09
05
d0
f8
60
bd
09
05
85
ac
bd
1d
05
85
ad
bd
13
05
85
ae
60
a9
00
85
97
a2
03
e4
99
b0
03
20
23
ef
e4
98
b0
03
20
3b
ef
86
99
a9
00
85
98
60
24
f9
30
03
4c
3d
e2
48
a9
3f
8d
e8
05
a5
f9
29
7f
85
f9
a9
81
4c
ec
ec
24
f9
70
03
4c
2f
e2
48
a9
5f
8d
e8
05
a5
f9
29
bf
85
f9
a9
81
4c
ec
ec
a6
ac
20
e8
ee
d0
03
4c
76
f2
a6
97
e0
0a
90
03
4c
73
f2
e6
97
a5
ac
9d
09
05
a5
ad
09
60
85
ad
9d
1d
05
a5
ae
9d
13
05
f0
09
c9
03
f0
05
90
05
20
05
f0
18
60
c9
02
d0
2c
20
46
eb
aa
e8
f0
0b
8e
03
fd
ec
03
fd
f0
f5
4c
7f
f2
38
6e
d8
07
a9
af
8d
df
07
a0
00
20
d9
07
8d
03
fd
c8
20
d9
07
8d
02
fd
18
60
a5
ad
29
0f
d0
2c
20
1b
e3
b0
26
20
60
f1
a5
ab
f0
0a
20
21
ea
90
10
f0
18
4c
7c
f2
20
cc
e9
f0
10
b0
f6
c9
05
f0
f2
a0
bf
8c
39
05
a9
02
85
f8
18
60
20
19
e3
b0
fa
a9
04
85
f8
20
6c
e5
b0
0c
a9
02
85
f8
a0
00
8c
39
05
8c
37
05
60
a5
ad
30
df
a4
ab
f0
db
a9
00
85
90
a5
ae
20
2c
ee
24
90
30
0b
a5
ad
09
f0
20
4d
ee
a5
90
10
05
68
68
4c
7f
f2
a5
ab
f0
12
a0
00
a9
af
8d
df
07
20
d9
07
20
df
ec
c8
c4
ab
d0
f0
4c
23
f2
86
b4
84
b5
6c
2e
03
85
93
a9
00
85
90
a5
ae
d0
03
4c
8b
f2
c9
03
f0
f9
b0
07
c9
02
f0
f3
4c
f0
f0
a4
ab
d0
03
4c
88
f2
a6
ad
20
60
f1
a9
60
85
ad
20
05
f0
a5
ae
20
fa
ed
a5
ad
20
1a
ee
20
8b
ec
85
9d
a5
90
4a
4a
b0
5c
20
8b
ec
85
9e
8a
d0
08
a5
b4
85
9d
a5
b5
85
9e
20
89
f1
a9
fd
25
90
85
90
20
e1
ff
d0
03
4c
ff
f1
20
8b
ec
aa
a5
90
4a
4a
b0
e8
8a
a4
93
f0
18
a0
00
8d
c7
07
a9
9d
8d
df
07
20
d9
07
cd
c7
07
f0
08
a9
10
20
1e
f4
2c
91
9d
e6
9d
d0
02
e6
9e
24
90
50
bf
20
3b
ef
20
11
f2
90
03
4c
7c
f2
a6
9d
a4
9e
60
20
1b
e3
b0
fa
20
60
f1
a5
ab
f0
09
20
21
ea
90
0b
f0
ec
b0
e3
20
cc
e9
f0
e5
b0
dc
a5
f8
c9
01
f0
12
c9
03
d0
e2
a0
00
b1
b6
85
b4
c8
b1
b6
85
b5
4c
28
f1
a5
ad
d0
ee
38
a0
02
b1
b6
a0
00
f1
b6
aa
a0
03
b1
b6
a0
01
f1
b6
a8
18
8a
65
b4
85
9d
98
65
b5
85
9e
a5
b4
85
b2
a5
b5
85
b3
20
89
f1
20
f3
e8
90
95
a9
1d
24
93
10
93
a9
1c
d0
8f
a5
9a
10
24
a0
0c
20
ca
eb
a5
ab
f0
1b
a0
17
20
ca
eb
a4
ab
f0
12
a0
00
a9
af
8d
df
07
20
d9
07
20
d2
ff
c8
c4
ab
d0
f0
60
a0
49
a5
93
f0
02
a0
59
4c
c6
eb
86
9d
84
9e
aa
b5
00
85
b2
b5
01
85
b3
6c
30
03
a5
ae
d0
03
4c
8b
f2
c9
03
f0
f9
c9
02
f0
f5
90
7f
a9
61
85
ad
a4
ab
d0
03
4c
88
f2
20
05
f0
20
28
f2
a5
ae
20
2c
ee
a5
ad
20
4d
ee
a0
00
a5
b3
85
9c
a5
b2
85
9b
a5
9b
20
df
ec
a5
9c
20
df
ec
38
a5
9b
e5
9d
a5
9c
e5
9e
b0
1f
a9
9b
8d
df
07
20
d9
07
20
df
ec
20
e1
ff
d0
07
20
11
f2
a9
00
38
60
e6
9b
d0
da
e6
9c
d0
d6
20
23
ef
24
ad
30
11
a5
ae
20
2c
ee
a5
ad
29
ef
09
e0
20
4d
ee
20
23
ef
18
60
a5
9a
10
38
a0
51
20
ca
eb
4c
72
f1
20
19
e3
b0
29
20
28
f2
a2
03
a5
ad
29
01
d0
02
a2
01
86
f8
20
6c
e5
b0
15
a9
00
85
f8
20
b0
e5
b0
0c
a5
ad
29
02
f0
05
20
f0
e5
b0
01
18
a9
00
60
a5
91
c9
7f
d0
07
08
20
cc
ff
85
ef
28
60
a9
01
2c
a9
02
2c
a9
03
2c
a9
04
2c
a9
05
2c
a9
06
2c
a9
07
2c
a9
08
2c
a9
09
48
20
cc
ff
a0
00
24
9a
50
0a
20
ca
eb
68
48
09
30
20
d2
ff
68
38
60
a2
ff
78
9a
d8
20
a6
cf
20
0b
f3
20
11
cf
08
30
07
a9
a5
cd
08
05
f0
03
20
52
f3
20
ce
f2
20
4e
d8
28
30
03
4c
45
f4
4c
00
80
a2
eb
a0
f2
18
86
b8
84
b9
a0
1f
b9
12
03
b0
02
b1
b8
99
12
03
90
02
91
b8
88
10
ef
60
42
ce
0e
ce
4c
f4
53
ef
5d
ee
18
ed
60
ed
0c
ef
e8
eb
4b
ec
65
f2
d9
eb
08
ef
4c
f4
4a
f0
a4
f1
a9
0f
85
00
a9
08
85
01
a2
ff
8e
10
fd
8e
f3
fe
e8
8e
f4
fe
8e
f0
fe
a9
40
8d
f5
fe
20
ea
ed
bd
38
f3
9d
00
ff
e8
e0
1a
d0
f5
4c
46
eb
f1
39
00
00
00
00
1b
08
00
00
02
cc
00
00
00
00
00
00
04
d0
08
71
5b
75
77
6e
a9
00
a8
99
02
00
99
00
02
99
00
03
99
00
04
99
00
07
c8
d0
ee
a2
08
86
9f
bd
f5
ff
9d
f5
ff
dd
f5
3f
d0
01
c8
dd
f5
7f
d0
02
c6
9f
ca
d0
ea
c0
08
f0
07
a5
9f
d0
08
a0
7f
2c
a0
3f
a2
f6
2c
a0
fd
18
20
2f
f4
a9
10
8d
32
05
a2
3a
bd
d1
f3
9d
5e
05
ca
d0
f7
8e
5d
05
a2
0b
bd
b3
cf
9d
d9
07
ca
10
f7
a2
0f
bd
43
e1
9d
13
01
ca
10
f7
a9
a5
8d
08
05
a9
04
8d
fa
07
a9
18
8d
fb
07
60
ea
ea
07
06
0a
07
06
04
05
05
47
52
41
50
48
49
43
44
4c
4f
41
44
22
44
49
52
45
43
54
4f
52
59
0d
53
43
4e
43
4c
52
0d
44
53
41
56
45
22
52
55
4e
0d
4c
49
53
54
0d
48
45
4c
50
0d
85
ab
86
af
84
b0
60
85
ac
86
ae
84
ad
60
85
9a
a5
90
05
90
85
90
60
8d
35
05
60
90
06
ae
33
05
ac
34
05
8e
33
05
8c
34
05
60
90
06
ae
31
05
ac
32
05
8e
31
05
8c
32
05
60
a2
00
8e
54
05
f0
0c
d8
a2
05
68
9d
52
05
ca
10
f9
a2
09
8e
f4
07
a9
c0
85
9a
ba
8e
58
05
ae
f4
07
20
66
cf
ad
06
ff
09
10
8d
06
ff
a9
00
85
a1
85
a2
58
a2
0f
20
66
cf
ad
52
05
20
10
fb
a0
00
b9
53
05
20
05
fb
c8
c0
06
90
f5
b0
03
20
0b
fb
20
3a
fb
a2
00
86
f3
20
cf
ff
9d
00
02
e8
c9
0d
d0
f5
ca
86
f4
20
3f
fb
f0
e6
c9
20
f0
f7
a2
0f
dd
70
f5
f0
05
ca
10
f8
30
d3
e0
0d
b0
0e
8a
0a
aa
bd
81
f5
48
bd
80
f5
48
4c
ad
fa
8d
5b
05
4c
6e
f6
b0
08
20
5b
fb
20
ad
fa
90
06
a9
0b
85
f1
d0
0e
20
64
fb
4a
66
f1
4a
66
f1
4a
66
f1
85
f2
20
e1
ff
f0
0d
20
9a
f5
a9
08
20
96
fb
20
72
fb
b0
ee
4c
95
f4
b0
fb
a5
f1
a4
f2
8d
53
05
8c
52
05
a0
00
20
ad
fa
b0
ea
a5
f1
99
54
05
c8
c0
05
90
f1
b0
de
b0
13
20
5b
fb
a0
00
20
ad
fa
b0
09
a5
f1
91
a1
c8
c0
08
90
f2
20
d8
fb
1b
4f
91
00
20
9a
f5
4c
95
f4
b0
0a
a5
f1
8d
53
05
a5
f2
8d
52
05
ae
58
05
9a
a2
00
bd
52
05
48
e8
e0
03
d0
f7
ae
56
05
ac
57
05
ad
55
05
40
58
4d
52
47
54
43
44
41
2e
48
46
3e
3b
4c
53
56
02
80
d6
f4
77
f4
4a
f5
d0
f5
cd
f5
23
f7
1e
f9
1e
f9
0d
f6
09
f7
28
f5
09
f5
20
3a
fb
a9
3e
20
d2
ff
20
fb
fa
a0
00
20
96
cf
20
05
fb
c8
c0
08
90
f5
20
d8
fb
3a
12
00
a0
00
20
96
cf
29
7f
c9
20
b0
02
a9
2e
20
d2
ff
c8
c0
08
90
ed
60
a9
00
2c
a9
80
85
bb
20
a0
fb
b0
30
20
ad
fa
b0
2b
20
3a
fb
a0
00
20
96
cf
24
bb
10
02
91
f1
d1
f1
f0
08
20
e1
ff
f0
11
20
fb
fa
e6
f1
d0
02
e6
f2
20
94
fb
20
86
fb
b0
dd
4c
95
f4
4c
92
f4
ea
20
a0
fb
b0
f7
a0
00
20
3f
fb
c9
27
d0
12
20
3f
fb
99
5d
02
c8
20
3f
fb
f0
1b
c0
20
d0
f3
f0
15
8c
5c
05
20
ab
fa
a5
f1
99
5d
02
c8
20
ad
fa
b0
04
c0
20
d0
f1
8c
5b
05
20
3a
fb
a2
00
a0
00
20
96
cf
dd
5d
02
d0
0f
c8
e8
ec
5b
05
d0
f1
20
e1
ff
f0
a6
20
fb
fa
20
94
fb
20
86
fb
b0
dd
90
99
a0
01
84
ae
84
ad
88
84
ab
84
90
84
93
a9
02
85
b0
a9
5d
85
af
20
3f
fb
f0
5e
c9
20
f0
f7
c9
22
d0
17
a6
f3
e4
f4
b0
50
bd
00
02
e8
c9
22
f0
0d
91
af
e6
ab
c8
c0
11
90
eb
4c
92
f4
ea
86
f3
20
3f
fb
20
ad
fa
b0
31
a5
f1
f0
ee
c9
03
f0
ea
85
ae
20
ad
fa
b0
22
20
5b
fb
20
ad
fa
b0
db
20
3a
fb
a6
f1
a4
f2
ad
5b
05
c9
53
d0
cd
a9
00
85
ad
a9
a1
20
d8
ff
4c
95
f4
ad
5b
05
c9
56
f0
06
c9
4c
d0
b6
a9
00
20
d5
ff
a5
90
29
10
f0
e7
ad
5b
05
c9
4c
f0
a4
a2
2a
20
66
cf
30
d9
20
a0
fb
b0
98
20
ad
fa
b0
93
a0
00
a5
f1
91
a1
20
94
fb
20
86
fb
b0
f4
90
bf
b0
08
20
5b
fb
20
ad
fa
90
06
a9
14
85
f1
d0
03
20
64
fb
20
3a
fb
20
e1
ff
f0
a4
20
52
f7
e6
f6
a5
f6
20
96
fb
a5
f6
20
74
fb
b0
e7
90
91
a9
2e
20
d2
ff
20
08
fb
20
fb
fa
20
08
fb
a0
00
20
96
cf
20
d4
f7
48
a6
f6
e8
ca
10
0b
20
d8
fb
20
20
20
00
4c
80
f7
ea
20
96
cf
20
05
fb
c8
c0
03
90
e7
68
a2
03
20
1b
f8
a2
06
e0
03
d0
14
a4
f6
f0
10
ad
4b
05
c9
e8
20
96
cf
b0
1d
20
10
fb
88
d0
f0
0e
4b
05
90
0e
bd
8e
f8
20
d2
ff
bd
94
f8
f0
03
20
d2
ff
ca
d0
d2
60
20
c8
f7
18
69
01
d0
01
e8
4c
ff
fa
a6
a2
a8
10
01
ca
65
a1
90
01
e8
60
a8
4a
90
0b
4a
b0
17
c9
22
f0
13
29
07
09
80
4a
aa
bd
3d
f8
b0
04
4a
4a
4a
4a
29
0f
d0
04
a0
80
a9
00
aa
bd
81
f8
8d
4b
05
29
03
85
f6
98
29
8f
aa
98
a0
03
e0
8a
f0
0b
4a
90
08
4a
4a
09
20
88
d0
fa
c8
88
d0
f2
60
a8
b9
9b
f8
85
9f
b9
db
f8
85
a0
a9
00
a0
05
06
a0
26
9f
2a
88
d0
f8
69
3f
20
d2
ff
ca
d0
ec
4c
08
fb
40
02
45
03
d0
08
40
09
30
22
45
33
d0
08
40
09
40
02
45
33
d0
08
40
09
40
02
45
b3
d0
08
40
09
00
22
44
33
d0
8c
44
00
11
22
44
33
d0
8c
44
9a
10
22
44
33
d0
08
40
09
10
22
44
33
d0
08
40
09
62
13
78
a9
00
21
81
82
00
00
59
4d
91
92
86
4a
85
9d
2c
29
2c
23
28
24
59
00
58
24
24
00
1c
8a
1c
23
5d
8b
1b
a1
9d
8a
1d
23
9d
8b
1d
a1
00
29
19
ae
69
a8
19
23
24
53
1b
23
24
53
19
a1
00
1a
5b
5b
a5
69
24
24
ae
ae
a8
ad
29
00
7c
00
15
9c
6d
9c
a5
69
29
53
84
13
34
11
a5
69
23
a0
d8
62
5a
48
26
62
94
88
54
44
c8
54
68
44
e8
94
00
b4
08
84
74
b4
28
6e
74
f4
cc
4a
72
f2
a4
8a
00
aa
a2
a2
74
74
74
72
44
68
b2
32
b2
00
22
00
1a
1a
26
26
72
72
88
c8
c4
ca
26
48
44
44
a2
c8
0d
20
20
20
90
03
4c
92
f4
20
5b
fb
a2
00
86
78
20
3f
fb
d0
07
e0
00
d0
03
4c
95
f4
c9
20
f0
ec
9d
4c
05
e8
e0
03
d0
e8
ca
30
12
bd
4c
05
38
e9
3f
a0
05
4a
66
78
66
77
88
d0
f8
f0
eb
a2
02
20
3f
fb
f0
1e
c9
20
f0
f7
20
7d
fa
b0
0e
20
8b
fa
a4
f1
84
f2
85
f1
a9
30
95
77
e8
95
77
e8
e0
0a
90
dd
86
9f
a2
00
8e
4f
05
a2
00
8e
50
05
ad
4f
05
20
d4
f7
ae
4b
05
86
a0
aa
bd
db
f8
20
5e
fa
bd
9b
f8
20
5e
fa
a2
06
e0
03
d0
13
a4
f6
f0
0f
ad
4b
05
c9
e8
a9
30
b0
1e
20
5b
fa
88
d0
f1
0e
4b
05
90
0e
bd
8e
f8
20
5e
fa
bd
94
f8
f0
03
20
5e
fa
ca
d0
d3
f0
06
20
5b
fa
20
5b
fa
a5
9f
cd
50
05
f0
03
4c
6a
fa
a4
f6
f0
34
a5
a0
c9
9d
d0
26
a5
f1
e5
a1
8d
51
05
a5
f2
e5
a2
90
09
d0
77
ae
51
05
30
72
10
09
a8
c8
d0
6c
ae
51
05
10
67
ca
ca
8a
a4
f6
d0
03
b9
f0
00
91
a1
88
d0
f8
ad
4f
05
91
a1
20
35
fb
a2
28
20
66
cf
20
5a
f7
e6
f6
a5
f6
20
96
fb
a9
41
8d
27
05
a9
20
8d
28
05
8d
2d
05
a5
a2
20
20
fb
8d
29
05
8e
2a
05
a5
a1
20
20
fb
8d
2b
05
8e
2c
05
a9
07
85
ef
4c
95
f4
20
5e
fa
8e
f3
07
ae
50
05
d5
77
f0
0d
68
68
ee
4f
05
f0
03
4c
84
f9
4c
92
f4
e8
8e
50
05
ae
f3
07
60
c9
41
90
03
c9
47
60
c9
30
90
16
c9
3a
60
20
a0
fa
0a
0a
0a
0a
8d
5c
05
20
3f
fb
20
a0
fa
0d
5c
05
38
60
c9
3a
08
29
0f
28
90
02
69
08
60
c6
f3
a9
00
85
f1
85
f2
8d
f4
07
20
3f
fb
f0
3a
c9
20
f0
f7
c9
20
f0
2e
c9
2c
f0
2a
c9
30
90
2b
c9
47
b0
27
c9
3a
90
06
c9
41
90
1f
e9
08
e9
2f
0a
0a
0a
0a
a2
04
0a
26
f1
26
f2
ca
d0
f8
ee
f4
07
20
3f
fb
d0
ce
ad
f4
07
18
60
68
68
4c
92
f4
a5
a1
a6
a2
48
8a
20
10
fb
68
20
10
fb
a9
20
2c
a9
3f
4c
d2
ff
8e
f3
07
20
20
fb
20
d2
ff
8a
ae
f3
07
4c
d2
ff
48
20
2a
fb
aa
68
4a
4a
4a
4a
29
0f
c9
0a
90
02
69
06
69
30
60
a9
91
20
d2
ff
a9
0d
4c
d2
ff
8e
f3
07
a6
f3
e4
f4
b0
0f
bd
00
02
c9
3a
f0
08
e6
f3
08
ae
f3
07
28
60
a9
00
f0
f6
a5
f1
85
a1
a5
f2
85
a2
60
38
a5
f1
e5
a1
85
f1
a5
f2
e5
a2
85
f2
60
a9
01
8d
f3
07
38
a5
f1
ed
f3
07
85
f1
a5
f2
e9
00
85
f2
60
38
a5
9f
e9
01
85
9f
a5
a0
e9
00
85
a0
60
a9
01
18
65
a1
85
a1
90
02
e6
a2
60
b0
14
20
5b
fb
20
ad
fa
b0
0c
20
64
fb
a5
f1
85
9f
a5
f2
85
a0
18
60
8d
10
01
8e
12
01
8c
11
01
60
ad
10
01
ae
12
01
ac
11
01
60
86
fa
20
11
cf
a6
fa
49
80
0a
a9
00
60
48
98
48
8a
48
ba
e8
e8
e8
e8
bd
00
01
85
bc
e8
bd
00
01
85
bd
e6
bc
d0
02
e6
bd
a0
00
b1
bc
f0
06
20
d2
ff
c8
d0
f6
98
ba
e8
e8
e8
e8
18
65
bc
9d
00
01
a9
00
65
bd
e8
9d
00
01
68
aa
68
a8
68
60
a2
00
a0
fd
60
a2
03
86
96
a9
00
9d
ec
05
ca
10
fa
a6
96
bd
7b
fc
aa
9d
d0
fd
a0
02
b9
07
80
d9
56
fc
d0
14
88
10
f5
ad
06
80
a6
96
9d
ec
05
c9
01
d0
05
86
fb
20
00
80
c6
96
10
d5
60
43
42
4d
78
a2
03
bd
ec
05
f0
10
8a
48
bd
7b
fc
aa
9d
d0
fd
86
fb
20
00
80
68
aa
ca
d0
e8
8d
d0
fd
86
fb
58
60
00
05
0a
0f
9d
d0
fd
aa
b1
be
9d
d0
fd
60
48
86
fb
9d
d0
fd
ae
f3
05
ad
f4
05
48
ad
f2
05
28
20
b0
fc
8d
f2
05
08
68
8d
f4
05
8e
f3
05
68
85
fb
aa
9d
d0
fd
60
6c
f0
05
48
8a
48
98
48
8d
d0
fd
4c
00
ce
a6
fb
9d
d0
fd
68
a8
68
aa
68
40
a6
fb
9d
d0
fd
6c
fe
02
ff
ff
ff
ff
ff
ff
ff
ff
ff
ff
ff
ff
ff
ff
ff
ff
ff
ff
ff
ff
ff
ff
ff
ff
ff
ff
ff
ff
ff
ff
ff
ff
4c
c9
fc
4c
59
fc
4c
7f
fc
4c
89
fc
4c
b8
fc
00
00
00
00
00
00
00
00
00
00
00
00
00
00
00
00
00
00
00
00
00
00
00
00
00
00
00
00
00
00
00
00
00
00
00
00
00
00
00
00
00
00
00
00
00
00
00
00
00
00
00
00
00
00
00
00
00
00
00
00
00
00
00
00
00
00
00
00
00
00
00
00
00
00
00
00
00
00
00
00
00
00
00
00
00
00
00
00
00
00
00
00
00
00
00
00
00
00
00
00
00
00
00
00
00
00
00
00
00
00
00
00
00
00
00
00
00
00
00
00
00
00
00
00
00
00
00
00
00
00
00
00
00
00
00
00
00
00
00
00
00
00
00
00
00
00
00
00
00
00
00
00
00
00
00
00
00
00
00
00
00
00
00
00
00
00
00
00
00
00
00
00
00
00
00
00
00
00
00
00
00
00
00
00
00
00
00
00
00
00
00
00
00
00
00
00
00
00
00
00
00
00
00
00
00
00
00
00
00
00
00
00
00
00
00
00
00
00
00
00
00
00
00
00
00
00
00
00
00
00
00
00
00
00
00
00
00
00
00
00
00
00
00
00
00
00
00
00
00
00
00
00
00
00
00
00
00
00
00
00
00
00
00
00
00
00
00
00
00
00
00
00
00
00
00
00
00
00
00
00
00
00
00
00
00
00
00
00
00
00
00
00
00
00
00
00
00
00
00
00
00
00
00
00
00
00
00
00
00
00
00
00
00
00
00
00
00
00
00
00
00
00
00
00
00
00
00
00
00
00
00
00
00
00
00
00
00
00
00
00
00
00
00
00
00
00
00
00
00
00
00
00
00
00
00
00
00
00
00
00
00
00
00
00
00
00
00
00
00
00
00
00
00
00
00
00
00
00
00
00
00
00
00
00
00
00
00
00
00
00
00
00
00
00
00
00
00
00
00
00
00
00
00
00
00
00
00
00
00
00
00
00
00
00
00
00
00
00
00
00
00
00
00
00
00
00
00
00
00
00
00
00
00
00
00
00
00
00
00
00
00
00
00
00
00
00
00
00
00
00
00
00
00
00
00
00
00
00
00
00
00
00
00
00
00
00
00
00
00
00
00
00
00
00
00
00
00
00
00
00
00
00
00
00
00
00
00
00
00
00
00
00
00
00
00
00
00
00
00
00
00
00
00
00
00
00
00
00
00
00
00
00
00
00
00
00
00
00
00
00
00
00
00
00
00
00
00
00
00
00
00
00
00
00
00
00
00
00
00
00
00
00
00
00
00
00
00
00
00
00
00
00
00
00
00
00
00
00
00
00
00
00
00
00
00
00
00
00
00
00
00
00
00
00
00
00
ff
ff
ff
ff
ff
ff
ff
ff
ff
4c
c2
b7
4c
49
dc
4c
d8
fb
4c
45
f4
ff
ff
ff
ff
ff
ff
ff
ff
ff
ff
ff
ff
ff
ff
ff
ff
ff
ff
ff
ff
ff
ff
ff
ff
ff
ff
ff
ff
ff
ff
ff
ff
ff
ff
ff
ff
ff
ff
ff
ff
ff
ff
5e
85
4c
4e
d8
4c
0b
f3
4c
52
f3
4c
ce
f2
4c
d3
f2
4c
1a
f4
4c
4d
ee
4c
1a
ee
4c
27
f4
4c
36
f4
4c
11
db
4c
23
f4
4c
8b
ec
4c
df
ec
4c
3b
ef
4c
23
ef
4c
2c
ee
4c
fa
ed
4c
1c
f4
4c
13
f4
4c
0c
f4
6c
18
03
6c
1a
03
6c
1c
03
6c
1e
03
6c
20
03
6c
22
03
6c
24
03
4c
43
f0
4c
94
f1
4c
2d
cf
4c
26
cf
6c
26
03
6c
28
03
6c
2a
03
4c
f0
ce
4c
34
d8
4c
39
d8
4c
19
fc
8d
3e
ff
4c
a4
f2
f6
ff
b3
fc
