0
1
2
3
4
5
6
7
8
FF
FF
FF
FF
FF
FF
FF
9
A
B
C
D
E
F
10
11
FF
FF
FF
FF
FF
FF
FF
12
FF
FF
FF
12
FF
FF
FF
12
FF
FF
FF
FF
FF
FF
FF
13
14
15
16
17
18
FF
FF
FF
FF
FF
FF
FF
FF
FF
FF
19
1A
1B
1C
1D
1E
1F
20
21
FF
FF
FF
FF
FF
FF
FF
22
23
24
25
26
27
28
29
2A
FF
FF
FF
FF
FF
FF
FF
2B
2C
2D
2E
2F
30
FF
FF
FF
FF
FF
FF
FF
FF
FF
FF
31
32
33
34
35
36
37
38
39
FF
FF
FF
FF
FF
FF
FF
3A
3B
3C
3D
3E
3F
40
41
42
FF
FF
FF
FF
FF
FF
FF
FF
FF
FF
FF
FF
FF
FF
FF
FF
FF
FF
FF
FF
FF
FF
FF
FF
FF
FF
FF
FF
FF
FF
FF
FF
FF
FF
FF
FF
FF
FF
FF
FF
FF
FF
FF
FF
FF
FF
FF
FF
FF
FF
FF
FF
FF
FF
FF
FF
FF
FF
FF
FF
FF
FF
FF
FF
FF
FF
FF
FF
FF
FF
FF
FF
FF
FF
FF
FF
FF
FF
FF
FF
FF
FF
FF
FF
FF
FF
FF
FF
FF
FF
FF
FF
FF
FF
FF
FF
FF
FF
FF
FF
FF
FF
FF
FF
FF
FF
FF
FF
FF
FF
FF
FF
FF
FF
FF
FF
FF
FF
FF
