
25
07
00
24
19
18
12
17
1D
1C
FE
2E
0A
01
00
00
00
24
24
19
18
12
17
1D
1C
FE
2A
11
26
18
17
15
22
24
01
24
19
15
0A
22
0E
1B
27
24
FE
29
0E
28
28
28
28
28
24
01
09
08
00
24
28
28
28
28
28
24
FE
29
0B
28
1D
0A
12
1D
18
24
0C
18
1B
19
18
1B
0A
1D
12
18
17
28
24
24
FF
FE
34
0B
01
24
0C
18
12
17
24
FF
1A
02
3A
5F
20
3D
C8
32
5F
20
13
21
20
00
09
44
4D
C3
64
18
3A
CC
21
A7
CA
88
18
3D
CA
76
19
3D
CA
76
19
C9
11
0B
00
21
06
24
36
00
23
7D
E6
1F
FE
1B
C2
8E
18
19
7C
FE
40
C2
8E
18
3E
01
32
CC
21
3E
54
32
B0
21
3E
C8
32
B1
21
AF
32
BF
21
C3
C8
18
3E
55
32
B0
21
3E
C9
32
B1
21
AF
32
BF
21
C3
C8
18
C9
21
D8
19
22
B2
21
2A
B2
21
7E
FE
00
CA
C6
1B
FE
07
CA
B0
19
32
B5
21
2A
B2
21
23
22
B2
21
7E
32
B6
21
3A
B6
21
A7
CA
CE
19
3D
32
B6
21
3A
B5
21
21
B0
21
FE
00
CA
23
19
FE
01
CA
29
19
FE
02
CA
2F
19
FE
03
CA
33
19
FE
04
CA
37
19
FE
05
CA
3C
19
FE
09
CA
41
19
FE
0A
CA
47
19
34
23
34
C3
4D
19
35
23
35
C3
4D
19
34
C3
4D
19
35
C3
4D
19
23
34
C3
4D
19
23
35
C3
4D
19
35
23
34
C3
4D
19
34
23
35
C3
4D
19
3A
CC
21
FE
02
CA
64
19
00
3A
BF
21
FE
02
C2
6F
19
AF
32
BF
21
FB
C9
3A
BF
21
FE
60
C2
6F
19
C3
5E
19
3C
32
BF
21
C3
76
19
3A
B0
21
6F
26
00
29
29
29
29
29
01
00
20
09
3A
B1
21
0F
0F
0F
57
E6
1F
06
00
4F
09
7A
E6
E0
0F
0F
0F
0F
0F
4F
A7
CA
A9
19
3E
01
07
0D
C2
A1
19
C3
AB
19
3E
01
B6
77
C3
EA
18
2A
B2
21
23
7E
4F
23
7E
57
23
22
B2
21
3A
B0
21
81
32
B0
21
3A
B1
21
82
32
B1
21
C3
CE
18
2A
B2
21
23
22
B2
21
C3
CE
18
00
28
02
1C
00
10
03
08
01
08
03
0C
00
20
03
08
07
FC
D8
02
20
00
18
03
08
01
10
03
18
01
08
07
14
14
02
0C
00
04
03
0C
01
04
07
0C
0C
02
0C
00
04
03
0C
01
04
07
10
00
02
04
00
08
03
04
01
08
07
08
00
02
04
00
08
03
04
01
08
07
F8
E0
02
08
00
08
02
04
01
04
02
04
00
08
03
08
00
04
03
08
01
04
03
08
01
04
02
08
01
08
07
18
00
02
18
00
10
03
08
01
0C
03
10
01
04
07
08
08
02
04
00
08
03
04
01
08
07
08
00
02
04
00
08
03
04
01
08
07
10
F8
02
10
00
28
03
20
01
10
02
08
00
08
02
10
01
18
03
08
01
08
07
98
E0
05
04
02
04
05
14
02
04
04
14
02
04
04
04
03
0C
07
0C
F8
05
10
02
0A
04
03
03
06
04
03
02
06
04
04
03
06
04
03
02
06
04
03
03
0A
07
0D
00
05
10
02
08
04
03
03
04
04
0D
03
04
07
D0
E0
03
02
01
04
05
04
0A
04
02
02
09
04
04
04
00
04
07
04
04
05
14
02
0C
04
14
03
0C
07
04
FC
05
0C
02
04
04
0C
03
04
07
0C
04
05
14
02
0C
04
0C
03
08
04
04
02
08
04
04
03
0C
07
04
F4
05
04
02
04
04
04
03
04
07
0C
08
0A
04
05
04
01
04
02
02
00
04
04
04
09
04
03
02
07
0C
08
05
04
02
0C
05
06
03
0C
05
04
02
0C
05
06
03
0C
05
04
02
10
04
18
03
10
07
14
00
05
18
02
10
04
18
03
10
07
04
FC
05
10
02
08
04
10
03
08
07
10
04
05
0C
02
0C
05
08
03
0C
05
04
02
10
04
10
03
0C
04
04
02
0C
04
04
03
10
07
14
F6
05
04
02
04
04
04
03
04
07
0C
0A
01
04
05
04
00
04
05
14
02
04
04
18
03
04
07
08
00
05
04
02
0C
05
06
03
0C
05
04
02
0C
05
06
03
0C
05
04
02
10
04
18
03
10
07
14
00
05
04
02
0C
05
06
03
0C
05
04
02
0C
05
06
03
0C
05
04
02
10
04
18
03
10
07
18
00
01
04
05
04
00
04
05
14
02
04
04
18
03
04
08
08
3A
CC
21
FE
02
CA
D6
1B
3E
02
32
CC
21
C3
B6
18
3E
00
32
CC
21
3E
01
32
52
20
3E
40
32
5B
20
FB
C9
F5
1C
35
23
34
C3
F5
1C
34
23
35
C3
F5
1C
3A
CC
21
FE
02
CA
0C
1D
00
3A
BF
F5
C5
D5
E5
00
21
05
24
06
00
36
BA
00
23
04
78
FE
20
C2
0D
1C
7C
FE
40
C2
08
1C
E1
D1
C1
F1
C9
00
FF
00
FF
00
FF
00
FF
00
FF
00
FF
00
FF
00
FF
00
FF
00
FF
00
FF
00
FF
00
FF
00
FF
00
FF
00
FF
CD
00
1C
CD
B8
12
C9
FF
CD
00
1C
CD
B8
12
C9
FF
AF
32
5C
20
C9
FF
00
FF
00
FF
00
FF
00
FF
00
FF
00
FF
00
FF
00
FF
00
FF
00
FF
00
FF
00
FF
00
FF
00
FF
00
FF
00
FF
00
FF
00
FF
00
FF
00
FF
00
FF
00
00
00
00
00
00
00
00
00
00
00
00
00
00
00
00
00
00
00
00
00
00
00
00
00
00
00
00
00
00
00
00
77
77
33
66
55
66
66
66
66
11
11
55
55
22
22
44
44
22
22
55
55
11
11
55
55
55
55
55
66
22
77
77
77
77
33
66
55
66
66
66
66
11
11
55
55
22
22
44
44
22
22
55
55
11
11
55
55
55
55
55
66
22
77
77
77
77
33
66
55
66
66
66
66
11
11
55
55
22
22
44
44
22
22
55
55
11
11
55
55
55
55
55
66
22
77
77
77
77
33
66
55
66
66
66
66
11
11
55
55
22
22
44
44
22
22
55
55
11
11
55
55
55
55
55
66
22
77
77
77
77
33
66
55
66
66
66
66
11
11
55
55
22
22
44
44
22
22
55
55
11
11
55
55
55
55
55
66
22
77
77
77
77
33
66
55
66
66
66
66
11
11
55
55
22
22
44
44
22
22
55
55
11
11
55
55
55
55
55
66
22
77
77
77
77
33
66
55
66
66
66
66
11
11
55
55
22
22
44
44
22
22
55
55
11
11
55
55
55
55
55
66
22
77
77
77
77
11
66
55
66
66
66
66
11
11
55
55
22
22
44
44
22
22
55
55
11
11
55
55
55
55
55
66
22
77
77
77
77
11
66
55
66
66
66
66
11
11
55
55
22
22
44
44
22
22
55
55
11
11
55
55
55
55
55
66
22
77
77
77
77
11
66
55
66
66
66
66
11
11
55
55
22
22
44
44
22
22
55
55
11
11
55
55
55
55
55
66
22
77
77
77
77
11
66
55
66
66
66
66
11
11
55
55
22
22
44
44
22
22
55
55
11
11
55
55
55
55
55
66
22
77
77
77
77
11
66
55
66
66
66
66
11
11
55
55
22
22
44
44
22
22
55
55
11
11
55
55
55
55
55
66
22
77
77
77
77
22
66
55
66
66
66
66
11
11
55
55
22
22
44
44
22
22
55
55
11
11
55
55
55
55
55
66
22
77
77
77
77
22
66
55
66
66
66
66
11
11
55
55
22
22
44
44
22
22
55
55
11
11
55
55
55
55
55
66
22
77
77
77
77
22
66
55
66
66
66
66
11
11
55
55
22
22
44
44
22
22
55
55
11
11
55
55
55
55
55
66
11
77
77
77
77
22
66
55
66
66
66
66
11
11
55
55
22
22
44
44
22
22
55
55
11
11
55
55
55
55
55
66
11
77
77
77
77
22
66
55
66
66
66
66
11
11
55
55
22
22
44
44
22
22
55
55
11
11
55
55
55
55
55
66
11
77
77
77
77
22
66
55
66
66
66
66
11
11
55
55
22
22
44
44
22
22
55
55
11
11
55
55
55
55
55
66
11
77
77
77
77
22
66
55
66
66
66
66
11
11
55
55
22
22
44
44
22
22
55
55
11
11
55
55
55
55
55
66
11
77
77
77
77
22
66
55
66
66
66
66
11
11
55
55
22
22
44
44
22
22
55
55
11
11
55
55
55
55
55
66
33
77
77
77
77
22
66
55
66
66
66
66
11
11
55
55
22
22
44
44
22
22
55
55
11
11
55
55
55
55
55
66
33
77
77
77
77
22
66
55
66
66
66
66
11
11
55
55
22
22
44
44
22
22
55
55
11
11
55
55
55
55
55
66
33
77
77
77
77
22
66
55
66
66
66
66
11
11
55
55
22
22
44
44
22
22
55
55
11
11
55
55
55
55
55
66
33
77
77
77
77
22
66
55
66
66
66
66
11
11
55
55
22
22
44
44
22
22
55
55
11
11
55
55
55
55
55
66
33
77
77
77
77
22
66
55
66
66
66
66
11
11
55
55
22
22
44
44
22
22
55
55
11
11
55
55
55
55
55
66
33
77
77
77
77
22
66
55
66
66
66
66
11
11
55
55
22
22
44
44
22
22
55
55
11
11
55
55
55
55
55
66
33
77
77
00
00
00
00
00
00
00
00
00
00
00
00
00
00
00
00
00
00
00
00
00
00
00
00
00
00
00
00
00
FF
FF
00
