T80_Pack.vhd
T80_MCode.vhd
T80_RegX.vhd
T80_ALU.vhd
T80.vhd
T8080se.vhd
invaders_rom_e.vhd
invaders_rom_f.vhd
invaders_rom_g.vhd
invaders_rom_h.vhd
mw8080.vhd
invaders.vhd
ps2kbd.vhd
invaders_clocks_xilinx.vhd
invaders_audio.vhd
dac.vhd
dblscan.vhd
invaders_top.vhd
