
C3
40
00
41
4B
41
20
45
FB
C9
20
31
35
35
38
48
D3
06
C3
80
00
30
20
43
4E
41
4B
41
20
45
4F
55
20
31
35
35
38
48
0D
01
39
32
38
30
20
43
4E
41
4B
41
20
45
4F
55
20
31
35
35
38
48
0D
01
39
32
21
00
20
36
00
23
7C
FE
40
C2
43
00
31
C0
22
CD
5A
01
CD
6F
01
CD
00
04
CD
40
1C
AF
32
50
20
32
51
20
32
5A
20
32
52
20
3E
09
32
59
20
32
58
20
00
FB
C3
70
00
45
4F
55
20
31
35
35
38
48
0D
01
CD
99
0F
C3
BC
00
21
1E
20
34
7E
0F
DA
98
00
CD
D7
00
CD
E1
00
C3
9E
00
CD
E1
00
CD
D7
00
CD
D2
06
CD
EE
0B
CD
09
03
CD
7F
01
CD
F8
0A
3A
50
20
A7
CC
34
0A
CD
59
07
CD
80
07
FB
C9
21
47
20
7E
A7
CA
00
14
35
CA
CB
00
C3
00
14
21
4E
20
7E
E6
EF
77
D3
03
C3
00
14
CD
11
04
CD
14
06
CD
65
06
C9
CD
A7
07
CD
88
09
CD
D9
09
00
C9
48
78
02
E0
02
50
48
02
B0
02
58
30
02
A0
02
60
60
02
C8
02
68
28
02
98
02
70
48
02
E8
02
78
20
02
78
02
80
A8
02
B8
02
88
40
02
88
02
90
58
02
B8
02
98
90
02
E8
02
A0
70
02
B8
02
A8
50
02
E0
02
B0
30
02
90
02
00
7E
18
3C
66
66
3C
18
7E
00
00
18
18
18
3C
24
7E
7E
18
00
00
92
54
28
C6
28
54
92
00
00
00
00
00
00
00
00
00
00
00
00
21
00
21
11
EC
00
1A
77
13
23
7D
FE
47
C2
60
01
AF
32
C0
21
C9
21
00
21
22
81
21
3E
07
32
8A
21
AF
32
8B
21
C9
3A
C0
21
A7
CA
9E
01
3D
CA
90
01
32
C0
21
C3
9E
01
AF
32
C0
21
3A
4E
20
E6
F7
D3
03
32
4E
20
2A
81
21
7E
32
83
21
23
22
84
21
7E
32
86
21
23
22
87
21
7E
32
89
21
21
8B
21
34
3A
83
21
A7
C2
E0
01
11
05
00
2A
81
21
19
7D
FE
46
C2
D0
01
21
00
21
22
81
21
3A
8A
21
21
8B
21
BE
C2
9E
01
AF
77
C9
3A
83
21
E6
0F
32
8E
21
AF
32
8C
21
32
8D
21
3A
86
21
A7
C2
2F
02
21
8D
21
34
21
8C
21
34
7E
FE
02
C2
14
02
3A
8D
21
FE
02
C2
11
02
2A
81
21
AF
77
C3
C0
01
2A
84
21
23
23
7E
32
86
21
22
84
21
2A
87
21
23
23
7E
32
89
21
22
87
21
C3
EF
01
3A
89
21
FE
01
CA
3D
02
DA
55
02
C3
5E
02
21
46
01
22
8F
21
3A
4E
20
F6
08
D3
03
32
4E
20
3E
0A
32
C0
21
C3
74
02
21
50
01
22
8F
21
C3
74
02
3A
8E
21
A7
C2
6E
02
21
32
01
22
8F
21
C3
74
02
21
3C
01
22
8F
21
AF
32
91
21
3A
8E
21
A7
C2
85
02
CD
8B
02
C3
BB
02
CD
8B
02
C3
EA
02
3A
83
21
0F
0F
0F
E6
1F
4F
06
20
3A
86
21
6F
26
00
29
29
29
29
29
09
EB
2A
8F
21
EB
01
20
00
1A
77
13
09
3A
91
21
3C
32
91
21
FE
0A
C2
AA
02
C9
3A
89
21
FE
01
CA
DA
02
DA
E2
02
2A
84
21
7E
FE
FF
C2
D5
02
3E
18
77
C3
FA
01
3C
77
C3
FA
01
2A
87
21
AF
77
C3
FA
01
2A
84
21
AF
77
C3
FA
01
3A
89
21
FE
01
CA
DA
02
DA
E2
02
2A
84
21
7E
FE
16
C2
04
03
3E
FF
77
C3
FA
01
3D
77
C3
FA
01
3A
0D
20
A7
C2
18
03
3A
2C
20
A7
C2
2F
03
C9
21
06
20
22
A0
21
21
07
20
22
A2
21
CD
3E
03
AF
32
0D
20
32
2C
20
C9
21
29
20
22
A0
21
21
2A
20
22
A2
21
C3
24
03
2A
A0
21
7E
3C
E6
F8
47
21
00
21
11
05
00
0E
0E
0D
7E
B8
CA
5B
03
19
79
A7
C2
4E
03
C9
01
14
02
22
A4
21
2A
A2
21
7E
D6
0A
2A
A4
21
23
BE
CA
7D
03
23
23
05
C2
6B
03
06
02
3C
0D
C2
67
03
C9
3E
01
23
77
C9
C3
BB
02
CD
8B
02
C3
EA
02
3A
83
21
0F
0F
0F
E6
1F
4F
06
20
3A
86
21
6F
26
00
29
29
29
29
29
09
EB
2A
8F
21
EB
01
20
00
1A
77
13
09
3A
91
21
3C
32
91
21
FE
0A
C2
AA
02
C9
3A
89
21
FE
01
CA
DA
02
DA
E2
02
2A
84
21
7E
FE
FF
C2
D5
02
3E
18
77
C3
FA
01
3C
77
C3
FA
01
2A
87
21
AF
77
C3
FA
01
2A
84
21
AF
77
C3
FA
01
3A
89
21
FE
01
CA
DA
02
DA
E2
02
2A
84
21
7E
FE
16
C2
04
03
3E
FF
06
50
21
00
20
11
70
0E
1A
77
13
23
05
C2
08
04
C9
3A
0C
20
A7
C0
3A
00
20
A7
C2
65
05
3A
02
20
A7
C2
07
05
3A
01
20
A7
C2
70
04
3A
50
20
A7
CA
D9
04
3A
14
20
A7
C0
DB
01
E6
10
CA
03
05
3A
3B
20
A7
C2
07
05
2F
32
3B
20
AF
32
38
20
CD
04
0C
3A
08
20
FE
05
DA
07
05
3E
01
32
01
20
CD
FF
06
3A
0A
20
C6
07
32
07
20
3E
00
32
05
20
32
33
20
3A
05
20
3C
32
05
20
CD
20
0A
CD
5A
05
2A
06
20
EB
CD
AD
06
3A
30
20
4F
16
0F
3A
05
20
5F
3A
08
20
BB
DA
F6
04
3E
26
BB
DA
F6
04
7A
A6
C2
49
05
E5
C5
01
20
00
09
7E
A7
C2
CF
04
01
C0
FF
09
7E
A7
C2
CF
04
C1
E1
7A
B6
77
0D
CA
5A
05
CD
20
0A
3A
05
20
3C
32
05
20
0F
D2
D4
04
23
C3
88
04
C1
E1
C3
49
05
16
F0
C3
8A
04
3E
01
32
36
20
21
38
20
7E
A7
C2
49
04
21
39
20
7E
FE
01
00
CA
2B
05
D2
3A
05
C3
19
05
3A
05
20
3D
32
05
20
CD
2A
0A
C3
4F
05
AF
32
3B
20
3A
50
20
A7
CA
E6
04
DB
01
07
07
DA
2B
05
07
DA
3A
05
2A
09
20
EB
CD
AD
06
EB
2A
15
20
EB
06
0F
CD
C4
06
C9
3A
0A
20
FE
E0
CA
19
05
3C
32
0A
20
C3
19
05
3A
0A
20
FE
30
CA
19
05
3D
32
0A
20
C3
19
05
7A
B6
77
32
0B
20
3E
01
32
0C
20
3A
32
20
32
19
20
3A
05
20
87
87
C6
37
32
06
20
C9
3A
03
20
3D
32
03
20
A7
C0
3E
05
32
03
20
CD
43
07
3A
04
20
3D
32
04
20
A7
CA
A0
05
3A
10
20
3C
E6
01
32
10
20
07
07
07
07
2A
15
20
85
6F
EB
2A
09
20
EB
E5
CD
AD
06
D1
C3
25
05
3A
50
20
A7
CA
E1
05
CD
4E
07
3A
1A
20
3D
32
1A
20
F5
CD
07
11
F1
CA
CF
05
3A
50
20
A7
CA
E1
05
CD
74
0A
CD
5A
01
CD
58
15
31
C0
22
C3
70
00
2F
32
1D
20
32
57
20
3E
12
32
58
20
CD
B6
0A
CD
83
13
21
50
20
36
00
23
36
00
CD
4E
07
AF
32
01
22
C3
C0
05
3A
50
20
A7
C8
2A
20
20
3A
24
20
85
27
6F
3A
25
20
8C
27
67
22
24
20
21
00
00
22
20
20
CD
55
10
C9
3A
0B
20
A7
C8
3A
05
20
FE
25
DA
41
06
3E
01
32
14
20
3E
0A
32
03
20
3E
16
32
04
20
21
30
0E
22
17
20
3E
01
32
10
20
32
21
20
C3
5E
06
32
0D
20
01
07
09
21
50
0E
3A
05
20
B8
DA
5A
06
23
04
04
04
04
0D
C2
4D
06
7E
32
20
20
AF
32
0B
20
C3
F3
05
3A
0C
20
A7
C8
3A
19
20
3D
32
19
20
A7
C0
2A
06
20
EB
CD
AD
06
AF
3A
05
20
47
1F
CE
00
36
00
2B
3D
C2
82
06
32
0C
20
32
01
20
CD
38
07
3A
08
20
90
32
08
20
AF
32
0F
20
3A
33
20
2F
C6
9B
47
3A
0E
20
80
27
32
0E
20
C9
26
00
6A
29
29
29
29
29
01
00
20
09
7B
0F
0F
0F
E6
1F
06
00
4F
09
C9
1A
77
13
C5
01
20
00
09
C1
05
C2
C4
06
C9
3A
2D
20
3D
32
2D
20
C0
3A
31
20
32
2D
20
3A
08
20
FE
64
CA
12
07
3C
32
08
20
3A
0E
20
C6
01
27
32
0E
20
DA
0A
07
AF
32
0F
20
C3
0F
07
3A
4E
20
F6
01
32
4E
20
D3
03
C9
3E
01
32
0F
20
CD
BF
0F
3A
2B
20
FE
64
C8
3C
32
2B
20
3A
2E
20
C6
01
27
32
2E
20
DA
2F
07
AF
32
2F
20
C3
34
07
3E
01
32
2F
20
00
00
00
C9
3A
4E
20
E6
FE
32
4E
20
D3
03
C9
3A
4E
20
F6
04
32
4E
20
D3
03
C9
3A
4E
20
E6
FB
32
4E
20
D3
03
C9
3A
45
20
A7
C0
3A
25
20
FE
05
D8
21
1A
20
34
CD
07
11
3A
4E
20
F6
10
32
4E
20
D3
03
3E
80
32
47
20
3E
01
32
45
20
C9
3A
46
20
A7
C0
3A
27
20
FE
05
D8
21
1B
20
34
CD
1A
11
3A
4E
20
F6
10
32
4E
20
D3
03
3E
80
32
47
20
3E
01
32
46
20
C9
3A
28
20
A7
C0
3A
14
20
A7
C2
05
09
3A
01
20
A7
C2
94
08
3A
02
20
A7
C2
03
08
3A
00
20
A7
C0
3A
36
20
A7
C2
79
08
DB
02
E6
10
CA
90
08
3A
3C
20
A7
C2
94
08
2F
32
3C
20
AF
32
4B
22
3A
2B
20
FE
05
DA
94
08
3E
01
32
02
20
CD
FF
06
3A
13
20
C6
07
32
2A
20
3E
00
32
05
20
