#Release 14.7 - par P.20131013 (nt64)
#Copyright (c) 1995-2013 Xilinx, Inc.  All rights reserved.

#Mon Mar 23 11:56:10 2020

#
## NOTE: This file is designed to be imported into a spreadsheet program
# such as Microsoft Excel for viewing, printing and sorting. The |
# character is used as the data field separator. This file is also designed
# to support parsing.
#
#INPUT FILE:       Intv_zxnext_map.ncd
#OUTPUT FILE:      Intv_zxnext_pad.csv
#PART TYPE:        xa6slx16
#SPEED GRADE:      -2
#PACKAGE:          ftg256
#
# Pinout by Pin Number:
# 
# -----,-----,-----,-----,-----,-----,-----,-----,-----,-----,-----,-----,-----,-----,-----,
Pin Number,Signal Name,Pin Usage,Pin Name,Direction,IO Standard,IO Bank Number,Drive (mA),Slew Rate,Termination,IOB Delay,Voltage,Constraint,IO Register,Signal Integrity,
A1,,,GND,,,,,,,,,,,,
A2,audioext_r_o,IOB,IO_L52N_M3A9_3,OUTPUT,LVCMOS33,3,16,SLOW,,,,LOCATED,NO,NONE,
A3,ear_port_i,IOB,IO_L83N_VREF_3,INPUT,LVCMOS33,3,,,,NONE,,LOCATED,NO,NONE,
A4,ram_data_io<15>,IOB,IO_L1N_VREF_0,BIDIR,LVCMOS33,0,4,FAST,,NONE,,LOCATED,NO,NONE,
A5,hdmi_n_o<1>,IOBS,IO_L2N_0,,TMDS_33,0,,,,,,LOCATED,NO,,
A6,bus_data_io<7>,IOB,IO_L4N_0,INPUT,LVCMOS33,0,,,PULLUP,NONE,,LOCATED,NO,NONE,
A7,bus_addr_o<13>,IOB,IO_L6N_0,OUTPUT,LVCMOS33,0,4,SLOW,,,,LOCATED,NO,NONE,
A8,bus_addr_o<0>,IOB,IO_L33N_0,OUTPUT,LVCMOS33,0,4,SLOW,,,,LOCATED,NO,NONE,
A9,bus_addr_o<1>,IOB,IO_L34N_GCLK18_0,OUTPUT,LVCMOS33,0,4,SLOW,,,,LOCATED,NO,NONE,
A10,bus_addr_o<2>,IOB,IO_L35N_GCLK16_0,OUTPUT,LVCMOS33,0,4,SLOW,,,,LOCATED,NO,NONE,
A11,vsync_o,IOB,IO_L39N_0,OUTPUT,LVTTL,0,8,FAST,,,,LOCATED,NO,NONE,
A12,bus_addr_o<7>,IOB,IO_L62N_VREF_0,OUTPUT,LVCMOS33,0,4,SLOW,,,,LOCATED,NO,NONE,
A13,bus_addr_o<5>,IOB,IO_L63N_SCP6_0,OUTPUT,LVCMOS33,0,4,SLOW,,,,LOCATED,NO,NONE,
A14,bus_addr_o<4>,IOB,IO_L65N_SCP2_0,OUTPUT,LVCMOS33,0,4,SLOW,,,,LOCATED,NO,NONE,
A15,,,TMS,,,,,,,,,,,,
A16,,,GND,,,,,,,,,,,,
B1,rgb_b_o<0>,IOB,IO_L50N_M3BA2_3,OUTPUT,LVTTL,3,8,FAST,,,,LOCATED,NO,NONE,
B2,audioext_l_o,IOB,IO_L52P_M3A8_3,OUTPUT,LVCMOS33,3,16,SLOW,,,,LOCATED,NO,NONE,
B3,ram_ce_n_o<3>,IOB,IO_L83P_3,OUTPUT,LVCMOS33,3,4,FAST,,,,LOCATED,NO,NONE,
B4,,,VCCO_0,,,0,,,,,3.30,,,,
B5,hdmi_p_o<1>,IOBM,IO_L2P_0,OUTPUT,TMDS_33,0,,,,,,LOCATED,NO,NONE,
B6,accel_io<21>,IOB,IO_L4P_0,INPUT,LVCMOS33,0,,,,NONE,,LOCATED,NO,NONE,
B7,,,GND,,,,,,,,,,,,
B8,bus_addr_o<12>,IOB,IO_L33P_0,OUTPUT,LVCMOS33,0,4,SLOW,,,,LOCATED,NO,NONE,
B9,,,VCCO_0,,,0,,,,,3.30,,,,
B10,hsync_o,IOB,IO_L35P_GCLK17_0,OUTPUT,LVTTL,0,8,FAST,,,,LOCATED,NO,NONE,
B11,,,GND,,,,,,,,,,,,
B12,bus_addr_o<6>,IOB,IO_L62P_0,OUTPUT,LVCMOS33,0,4,SLOW,,,,LOCATED,NO,NONE,
B13,,,VCCO_0,,,0,,,,,3.30,,,,
B14,bus_addr_o<8>,IOB,IO_L65P_SCP3_0,OUTPUT,LVCMOS33,0,4,SLOW,,,,LOCATED,NO,NONE,
B15,bus_halt_n_o,IOB,IO_L29P_A23_M1A13_1,OUTPUT,LVCMOS33,1,4,SLOW,,,,LOCATED,NO,NONE,
B16,bus_wait_n_i,IOB,IO_L29N_A22_M1A14_1,INPUT,LVCMOS33,1,,,PULLUP,NONE,,LOCATED,NO,NONE,
C1,ram_data_io<9>,IOB,IO_L50P_M3WE_3,BIDIR,LVCMOS33,3,4,FAST,,NONE,,LOCATED,NO,NONE,
C2,rgb_b_o<1>,IOB,IO_L48N_M3BA1_3,OUTPUT,LVTTL,3,8,FAST,,,,LOCATED,NO,NONE,
C3,ram_addr_o<11>,IOB,IO_L48P_M3BA0_3,OUTPUT,LVCMOS33,3,4,FAST,,,,LOCATED,NO,NONE,
C4,ram_addr_o<10>,IOB,IO_L1P_HSWAPEN_0,OUTPUT,LVCMOS33,0,4,FAST,,,,LOCATED,NO,NONE,
C5,bus_data_io<1>,IOB,IO_L3N_0,INPUT,LVCMOS33,0,,,PULLUP,NONE,,LOCATED,NO,NONE,
C6,bus_data_io<2>,IOB,IO_L7N_0,INPUT,LVCMOS33,0,,,PULLUP,NONE,,LOCATED,NO,NONE,
C7,bus_data_io<6>,IOB,IO_L6P_0,INPUT,LVCMOS33,0,,,PULLUP,NONE,,LOCATED,NO,NONE,
C8,bus_data_io<3>,IOB,IO_L38N_VREF_0,INPUT,LVCMOS33,0,,,PULLUP,NONE,,LOCATED,NO,NONE,
C9,bus_rd_n_o,IOB,IO_L34P_GCLK19_0,OUTPUT,LVCMOS33,0,4,SLOW,,,,LOCATED,NO,NONE,
C10,bus_wr_n_o,IOB,IO_L37N_GCLK12_0,OUTPUT,LVCMOS33,0,4,SLOW,,,,LOCATED,NO,NONE,
C11,bus_rfsh_n_o,IOB,IO_L39P_0,OUTPUT,LVCMOS33,0,4,SLOW,,,,LOCATED,NO,NONE,
C12,,,TDI,,,,,,,,,,,,
C13,accel_io<19>,IOB,IO_L63P_SCP7_0,INPUT,LVCMOS33,0,,,,NONE,,LOCATED,NO,NONE,
C14,,,TCK,,,,,,,,,,,,
C15,bus_romcs_i,IOB,IO_L33P_A15_M1A10_1,INPUT,LVCMOS33,1,,,,NONE,,LOCATED,NO,NONE,
C16,bus_ramcs_i,IOB,IO_L33N_A14_M1A4_1,INPUT,LVCMOS33,1,,,,NONE,,LOCATED,NO,NONE,
D1,ram_data_io<14>,IOB,IO_L49N_M3A2_3,BIDIR,LVCMOS33,3,4,FAST,,NONE,,LOCATED,NO,NONE,
D2,,,VCCO_3,,,3,,,,,3.30,,,,
D3,ram_addr_o<12>,IOB,IO_L49P_M3A7_3,OUTPUT,LVCMOS33,3,4,FAST,,,,LOCATED,NO,NONE,
D4,,,GND,,,,,,,,,,,,
D5,bus_data_io<0>,IOB,IO_L3P_0,INPUT,LVCMOS33,0,,,PULLUP,NONE,,LOCATED,NO,NONE,
D6,csync_o,IOB,IO_L7P_0,OUTPUT,LVTTL,0,8,FAST,,,,LOCATED,NO,NONE,
D7,,,VCCO_0,,,0,,,,,3.30,,,,
D8,bus_data_io<5>,IOB,IO_L38P_0,INPUT,LVCMOS33,0,,,PULLUP,NONE,,LOCATED,NO,NONE,
D9,bus_iorq_n_o,IOB,IO_L40N_0,OUTPUT,LVCMOS33,0,4,SLOW,,,,LOCATED,NO,NONE,
D10,,,VCCO_0,,,0,,,,,3.30,,,,
D11,bus_m1_n_o,IOB,IO_L66P_SCP1_0,OUTPUT,LVCMOS33,0,4,SLOW,,,,LOCATED,NO,NONE,
D12,bus_addr_o<10>,IOB,IO_L66N_SCP0_0,OUTPUT,LVCMOS33,0,4,SLOW,,,,LOCATED,NO,NONE,
D13,,,GND,,,,,,,,,,,,
D14,accel_io<13>,IOB,IO_L31P_A19_M1CKE_1,INPUT,LVCMOS33,1,,,,NONE,,LOCATED,NO,NONE,
D15,,,VCCO_1,,,1,,,,,3.30,,,,
D16,accel_io<20>,IOB,IO_L31N_A18_M1A12_1,INPUT,LVCMOS33,1,,,,NONE,,LOCATED,NO,NONE,
E1,ram_oe_n_o,IOB,IO_L46N_M3CLKN_3,OUTPUT,LVCMOS33,3,4,FAST,,,,LOCATED,NO,NONE,
E2,ram_data_io<8>,IOB,IO_L46P_M3CLK_3,BIDIR,LVCMOS33,3,4,FAST,,NONE,,LOCATED,NO,NONE,
E3,ram_addr_o<14>,IOB,IO_L54N_M3A11_3,OUTPUT,LVCMOS33,3,4,FAST,,,,LOCATED,NO,NONE,
E4,ram_addr_o<13>,IOB,IO_L54P_M3RESET_3,OUTPUT,LVCMOS33,3,4,FAST,,,,LOCATED,NO,NONE,
E5,,,VCCAUX,,,,,,,,2.5,,,,
E6,bus_data_io<4>,IOB,IO_L5N_0,INPUT,LVCMOS33,0,,,PULLUP,NONE,,LOCATED,NO,NONE,
E7,bus_addr_o<15>,IOB,IO_L36P_GCLK15_0,OUTPUT,LVCMOS33,0,4,SLOW,,,,LOCATED,NO,NONE,
E8,bus_addr_o<3>,IOB,IO_L36N_GCLK14_0,OUTPUT,LVCMOS33,0,4,SLOW,,,,LOCATED,NO,NONE,
E9,,,GND,,,,,,,,,,,,
E10,bus_mreq_n_o,IOB,IO_L37P_GCLK13_0,OUTPUT,LVCMOS33,0,4,SLOW,,,,LOCATED,NO,NONE,
E11,bus_nmi_n_i,IOB,IO_L64N_SCP4_0,INPUT,LVCMOS33,0,,,,NONE,,LOCATED,NO,NONE,
E12,bus_addr_o<11>,IOB,IO_L1N_A24_VREF_1,OUTPUT,LVCMOS33,1,4,SLOW,,,,LOCATED,NO,NONE,
E13,accel_io<12>,IOB,IO_L1P_A25_1,INPUT,LVCMOS33,1,,,,NONE,,LOCATED,NO,NONE,
E14,,,TDO,,,,,,,,,,,,
E15,accel_io<26>,IOB,IO_L34P_A13_M1WE_1,INPUT,LVCMOS33,1,,,,NONE,,LOCATED,NO,NONE,
E16,accel_io<16>,IOB,IO_L34N_A12_M1BA2_1,INPUT,LVCMOS33,1,,,,NONE,,LOCATED,NO,NONE,
F1,ram_addr_o<16>,IOB,IO_L41N_GCLK26_M3DQ5_3,OUTPUT,LVCMOS33,3,4,FAST,,,,LOCATED,NO,NONE,
F2,ram_addr_o<15>,IOB,IO_L41P_GCLK27_M3DQ4_3,OUTPUT,LVCMOS33,3,4,FAST,,,,LOCATED,NO,NONE,
F3,rgb_g_o<1>,IOB,IO_L53N_M3A12_3,OUTPUT,LVTTL,3,8,FAST,,,,LOCATED,NO,NONE,
F4,rgb_g_o<0>,IOB,IO_L53P_M3CKE_3,OUTPUT,LVTTL,3,8,FAST,,,,LOCATED,NO,NONE,
F5,ram_data_io<12>,IOB,IO_L55N_M3A14_3,BIDIR,LVCMOS33,3,4,FAST,,NONE,,LOCATED,NO,NONE,
F6,ram_data_io<11>,IOB,IO_L55P_M3A13_3,BIDIR,LVCMOS33,3,4,FAST,,NONE,,LOCATED,NO,NONE,
F7,bus_addr_o<14>,IOB,IO_L5P_0,OUTPUT,LVCMOS33,0,4,SLOW,,,,LOCATED,NO,NONE,
F8,,,VCCAUX,,,,,,,,2.5,,,,
F9,bus_addr_o<9>,IOB,IO_L40P_0,OUTPUT,LVCMOS33,0,4,SLOW,,,,LOCATED,NO,NONE,
F10,bus_int_n_io,IOB,IO_L64P_SCP5_0,INPUT,LVCMOS33,0,,,PULLUP,NONE,,LOCATED,NO,NONE,
F11,,,VCCAUX,,,,,,,,2.5,,,,
F12,bus_iorqula_n_i,IOB,IO_L30P_A21_M1RESET_1,INPUT,LVCMOS33,1,,,,NONE,,LOCATED,NO,NONE,
F13,accel_io<5>,IOB,IO_L32P_A17_M1A8_1,INPUT,LVCMOS33,1,,,,NONE,,LOCATED,NO,NONE,
F14,accel_io<6>,IOB,IO_L32N_A16_M1A9_1,INPUT,LVCMOS33,1,,,,NONE,,LOCATED,NO,NONE,
F15,accel_io<7>,IOB,IO_L35P_A11_M1A7_1,INPUT,LVCMOS33,1,,,,NONE,,LOCATED,NO,NONE,
F16,accel_io<8>,IOB,IO_L35N_A10_M1A2_1,INPUT,LVCMOS33,1,,,,NONE,,LOCATED,NO,NONE,
G1,ram_addr_o<17>,IOB,IO_L40N_M3DQ7_3,OUTPUT,LVCMOS33,3,4,FAST,,,,LOCATED,NO,NONE,
G2,,,GND,,,,,,,,,,,,
G3,rgb_g_o<2>,IOB,IO_L40P_M3DQ6_3,OUTPUT,LVTTL,3,8,FAST,,,,LOCATED,NO,NONE,
G4,,,VCCO_3,,,3,,,,,3.30,,,,
G5,ram_data_io<10>,IOB,IO_L51N_M3A4_3,BIDIR,LVCMOS33,3,4,FAST,,NONE,,LOCATED,NO,NONE,
G6,ram_data_io<13>,IOB,IO_L51P_M3A10_3,BIDIR,LVCMOS33,3,4,FAST,,NONE,,LOCATED,NO,NONE,
G7,,,VCCINT,,,,,,,,1.2,,,,
G8,,,GND,,,,,,,,,,,,
G9,,,VCCINT,,,,,,,,1.2,,,,
G10,,,VCCAUX,,,,,,,,2.5,,,,
G11,bus_clk35_o,IOB,IO_L30N_A20_M1A11_1,OUTPUT,LVCMOS33,1,4,SLOW,,,,LOCATED,NO,NONE,
G12,keyb_row_o<7>,IOB,IO_L38P_A5_M1CLK_1,TRISTATE,LVTTL,1,8,SLOW,,,,LOCATED,NO,NONE,
G13,,,VCCO_1,,,1,,,,,3.30,,,,
G14,accel_io<1>,IOB,IO_L36P_A9_M1BA0_1,INPUT,LVCMOS33,1,,,,NONE,,LOCATED,NO,NONE,
G15,,,GND,,,,,,,,,,,,
G16,accel_io<11>,IOB,IO_L36N_A8_M1BA1_1,INPUT,LVCMOS33,1,,,,NONE,,LOCATED,NO,NONE,
H1,rgb_b_o<2>,IOB,IO_L39N_M3LDQSN_3,OUTPUT,LVTTL,3,8,FAST,,,,LOCATED,NO,NONE,
H2,ram_addr_o<18>,IOB,IO_L39P_M3LDQS_3,OUTPUT,LVCMOS33,3,4,FAST,,,,LOCATED,NO,NONE,
H3,rgb_r_o<1>,IOB,IO_L44N_GCLK20_M3A6_3,OUTPUT,LVTTL,3,8,FAST,,,,LOCATED,NO,NONE,
H4,rgb_r_o<0>,IOB,IO_L44P_GCLK21_M3A5_3,OUTPUT,LVTTL,3,8,FAST,,,,LOCATED,NO,NONE,
H5,rgb_r_o<2>,IOB,IO_L43N_GCLK22_IRDY2_M3CASN_3,OUTPUT,LVTTL,3,8,FAST,,,,LOCATED,NO,NONE,
H6,,,VCCAUX,,,,,,,,2.5,,,,
H7,,,GND,,,,,,,,,,,,
H8,,,VCCINT,,,,,,,,1.2,,,,
H9,,,GND,,,,,,,,,,,,
H10,,,VCCINT,,,,,,,,1.2,,,,
H11,keyb_row_o<0>,IOB,IO_L38N_A4_M1CLKN_1,TRISTATE,LVTTL,1,8,SLOW,,,,LOCATED,NO,NONE,
H12,,,GND,,,,,,,,,,,,
H13,keyb_row_o<3>,IOB,IO_L39P_M1A3_1,TRISTATE,LVTTL,1,8,SLOW,,,,LOCATED,NO,NONE,
H14,accel_io<0>,IOB,IO_L39N_M1ODT_1,INPUT,LVCMOS33,1,,,,NONE,,LOCATED,NO,NONE,
H15,accel_io<25>,IOB,IO_L37P_A7_M1A0_1,INPUT,LVCMOS33,1,,,,NONE,,LOCATED,NO,NONE,
H16,accel_io<9>,IOB,IO_L37N_A6_M1A1_1,INPUT,LVCMOS33,1,,,,NONE,,LOCATED,NO,NONE,
J1,sd_miso_i,IOB,IO_L38N_M3DQ3_3,INPUT,LVTTL,3,,,PULLUP,NONE,,LOCATED,NO,NONE,
J2,,,VCCO_3,,,3,,,,,3.30,,,,
J3,ps2_data_io,IOB,IO_L38P_M3DQ2_3,INPUT,LVCMOS33,3,,,PULLUP,NONE,,LOCATED,NO,NONE,
J4,ps2_pin2_io,IOB,IO_L42N_GCLK24_M3LDM_3,INPUT,LVCMOS33,3,,,PULLUP,NONE,,LOCATED,NO,NONE,
J5,,,GND,,,,,,,,,,,,
J6,ram_data_io<0>,IOB,IO_L43P_GCLK23_M3RASN_3,BIDIR,LVCMOS33,3,4,FAST,,NONE,,LOCATED,NO,NONE,
J7,,,VCCINT,,,,,,,,1.2,,,,
J8,,,GND,,,,,,,,,,,,
J9,,,VCCINT,,,,,,,,1.2,,,,
J10,,,VCCAUX,,,,,,,,2.5,,,,
J11,keyb_row_o<6>,IOB,IO_L40P_GCLK11_M1A5_1,TRISTATE,LVTTL,1,8,SLOW,,,,LOCATED,NO,NONE,
J12,keyb_row_o<4>,IOB,IO_L40N_GCLK10_M1A6_1,TRISTATE,LVTTL,1,8,SLOW,,,,LOCATED,NO,NONE,
J13,bus_busack_n_o,IOB,IO_L41P_GCLK9_IRDY1_M1RASN_1,OUTPUT,LVCMOS33,1,4,SLOW,,,,LOCATED,NO,NONE,
J14,accel_io<24>,IOB,IO_L43P_GCLK5_M1DQ4_1,INPUT,LVCMOS33,1,,,,NONE,,LOCATED,NO,NONE,
J15,,,VCCO_1,,,1,,,,,3.30,,,,
J16,accel_io<14>,IOB,IO_L43N_GCLK4_M1DQ5_1,INPUT,LVCMOS33,1,,,,NONE,,LOCATED,NO,NONE,
K1,sd_sclk_o,IOB,IO_L37N_M3DQ1_3,OUTPUT,LVTTL,3,12,SLOW,,,,LOCATED,NO,NONE,
K2,sd_mosi_o,IOB,IO_L37P_M3DQ0_3,OUTPUT,LVTTL,3,12,SLOW,,,,LOCATED,NO,NONE,
K3,ps2_clk_io,IOB,IO_L42P_GCLK25_TRDY2_M3UDM_3,INPUT,LVCMOS33,3,,,PULLUP,NONE,,LOCATED,NO,NONE,
K4,,,VCCO_3,,,3,,,,,3.30,,,,
K5,ram_data_io<2>,IOB,IO_L47P_M3A0_3,BIDIR,LVCMOS33,3,4,FAST,,NONE,,LOCATED,NO,NONE,
K6,ps2_pin6_io,IOB,IO_L47N_M3A1_3,INPUT,LVCMOS33,3,,,PULLUP,NONE,,LOCATED,NO,NONE,
K7,,,GND,,,,,,,,,,,,
K8,,,VCCINT,,,,,,,,1.2,,,,
K9,,,GND,,,,,,,,,,,,
K10,,,VCCINT,,,,,,,,1.2,,,,
K11,keyb_row_o<1>,IOB,IO_L42N_GCLK6_TRDY1_M1LDM_1,TRISTATE,LVTTL,1,8,SLOW,,,,LOCATED,NO,NONE,
K12,keyb_row_o<5>,IOB,IO_L42P_GCLK7_M1UDM_1,TRISTATE,LVTTL,1,8,SLOW,,,,LOCATED,NO,NONE,
K13,,,VCCO_1,,,1,,,,,3.30,,,,
K14,accel_io<23>,IOB,IO_L41N_GCLK8_M1CASN_1,INPUT,LVCMOS33,1,,,,NONE,,LOCATED,NO,NONE,
K15,accel_io<3>,IOB,IO_L44P_A3_M1DQ6_1,INPUT,LVCMOS33,1,,,,NONE,,LOCATED,NO,NONE,
K16,accel_io<4>,IOB,IO_L44N_A2_M1DQ7_1,INPUT,LVCMOS33,1,,,,NONE,,LOCATED,NO,NONE,
L1,sd_cs0_n_o,IOB,IO_L36N_M3DQ9_3,OUTPUT,LVTTL,3,12,SLOW,,,,LOCATED,NO,NONE,
L2,,,GND,,,,,,,,,,,,
L3,ram_addr_o<5>,IOB,IO_L36P_M3DQ8_3,OUTPUT,LVCMOS33,3,4,FAST,,,,LOCATED,NO,NONE,
L4,sd_cs1_n_o,IOB,IO_L45P_M3A3_3,OUTPUT,LVTTL,3,12,SLOW,,,,LOCATED,NO,NONE,
L5,ram_data_io<1>,IOB,IO_L45N_M3ODT_3,BIDIR,LVCMOS33,3,4,FAST,,NONE,,LOCATED,NO,NONE,
L6,,,VCCAUX,,,,,,,,2.5,,,,
L7,keyb_col_i<0>,IOB,IO_L62N_D6_2,INPUT,LVTTL,2,,,PULLUP,NONE,,LOCATED,NO,NONE,
L8,btn_divmmc_n_i,IOB,IO_L62P_D5_2,INPUT,LVCMOS33,2,,,PULLUP,NONE,,LOCATED,NO,NONE,
L9,,,VCCAUX,,,,,,,,2.5,,,,
L10,accel_io<10>,IOB,IO_L16P_2,INPUT,LVCMOS33,2,,,,NONE,,LOCATED,NO,NONE,
L11,,,CMPCS_B_2,,,,,,,,,,,,
L12,keyb_row_o<2>,IOB,IO_L53P_1,TRISTATE,LVTTL,1,8,SLOW,,,,LOCATED,NO,NONE,
L13,accel_io<22>,IOB,IO_L53N_VREF_1,INPUT,LVCMOS33,1,,,,NONE,,LOCATED,NO,NONE,
L14,accel_io<27>,IOB,IO_L47P_FWE_B_M1DQ0_1,INPUT,LVCMOS33,1,,,,NONE,,LOCATED,NO,NONE,
L15,,,GND,,,,,,,,,,,,
L16,accel_io<2>,IOB,IO_L47N_LDC_M1DQ1_1,INPUT,LVCMOS33,1,,,,NONE,,LOCATED,NO,NONE,
M1,ram_addr_o<1>,IOB,IO_L35N_M3DQ11_3,OUTPUT,LVCMOS33,3,4,FAST,,,,LOCATED,NO,NONE,
M2,ram_addr_o<0>,IOB,IO_L35P_M3DQ10_3,OUTPUT,LVCMOS33,3,4,FAST,,,,LOCATED,NO,NONE,
M3,ram_addr_o<7>,IOB,IO_L1N_VREF_3,OUTPUT,LVCMOS33,3,4,FAST,,,,LOCATED,NO,NONE,
M4,ram_addr_o<6>,IOB,IO_L1P_3,OUTPUT,LVCMOS33,3,4,FAST,,,,LOCATED,NO,NONE,
M5,ram_we_n_o,IOB,IO_L2P_3,OUTPUT,LVCMOS33,3,4,FAST,,,,LOCATED,NO,NONE,
M6,ram_data_io<3>,IOB,IO_L64P_D8_2,BIDIR,LVCMOS33,2,4,FAST,,NONE,,LOCATED,NO,NONE,
M7,btn_multiface_n_i,IOB,IO_L31N_GCLK30_D15_2,INPUT,LVCMOS33,2,,,PULLUP,NONE,,LOCATED,NO,NONE,
M8,,,GND,,,,,,,,,,,,
M9,bus_rst_n_io,IOB,IO_L29P_GCLK3_2,INPUT,LVCMOS33,2,,,PULLUP,NONE,,LOCATED,NO,NONE,
M10,ram_ce_n_o<2>,IOB,IO_L16N_VREF_2,OUTPUT,LVCMOS33,2,4,FAST,,,,LOCATED,NO,NONE,
M11,btn_reset_n_i,IOB,IO_L2N_CMPMOSI_2,INPUT,LVCMOS33,2,,,PULLUP,NONE,,LOCATED,NO,NONE,
M12,bus_busreq_n_i,IOB,IO_L2P_CMPCLK_2,INPUT,LVCMOS33,2,,,,NONE,,LOCATED,NO,NONE,
M13,accel_io<18>,IOB,IO_L74P_AWAKE_1,INPUT,LVCMOS33,1,,,,NONE,,LOCATED,NO,NONE,
M14,accel_io<17>,IOB,IO_L74N_DOUT_BUSY_1,INPUT,LVCMOS33,1,,,,NONE,,LOCATED,NO,NONE,
M15,keyb_col_i<5>,IOB,IO_L46P_FCS_B_M1DQ2_1,INPUT,LVTTL,1,,,PULLUP,NONE,,LOCATED,NO,NONE,
M16,keyb_col_i<6>,IOB,IO_L46N_FOE_B_M1DQ3_1,INPUT,LVTTL,1,,,PULLUP,NONE,,LOCATED,NO,NONE,
N1,ram_addr_o<2>,IOB,IO_L34N_M3UDQSN_3,OUTPUT,LVCMOS33,3,4,FAST,,,,LOCATED,NO,NONE,
N2,,,VCCO_3,,,3,,,,,3.30,,,,
N3,ram_addr_o<9>,IOB,IO_L34P_M3UDQS_3,OUTPUT,LVCMOS33,3,4,FAST,,,,LOCATED,NO,NONE,
N4,ram_addr_o<8>,IOB,IO_L2N_3,OUTPUT,LVCMOS33,3,4,FAST,,,,LOCATED,NO,NONE,
N5,hdmi_p_o<0>,IOBM,IO_L49P_D3_2,OUTPUT,TMDS_33,2,,,,,,LOCATED,NO,NONE,
N6,ram_data_io<7>,IOB,IO_L64N_D9_2,BIDIR,LVCMOS33,2,4,FAST,,NONE,,LOCATED,NO,NONE,
N7,,,VCCO_2,,,2,,,,,3.30,,,,
N8,keyb_col_i<2>,IOB,IO_L29N_GCLK2_2,INPUT,LVTTL,2,,,PULLUP,NONE,,LOCATED,NO,NONE,
N9,esp_rx_i,IOB,IO_L14P_D11_2,INPUT,LVCMOS33,2,,,PULLUP,NONE,,LOCATED,NO,NONE,
N10,,,VCCO_2,,,2,,,,,3.30,,,,
N11,,IOBM,IO_L13P_M1_2,UNUSED,,2,,,,,,,,,
N12,flash_wp_o,IOB,IO_L12P_D1_MISO2_2,OUTPUT,LVCMOS33,2,12,SLOW,,,,LOCATED,NO,NONE,
N13,,,GND,,,,,,,,,,,,
N14,accel_io<15>,IOB,IO_L45P_A1_M1LDQS_1,INPUT,LVCMOS33,1,,,,NONE,,LOCATED,NO,NONE,
N15,,,VCCO_1,,,1,,,,,3.30,,,,
N16,extras_io,IOB,IO_L45N_A0_M1LDQSN_1,INPUT,LVTTL,1,,,PULLUP,NONE,,LOCATED,NO,NONE,
P1,ram_addr_o<4>,IOB,IO_L33N_M3DQ13_3,OUTPUT,LVCMOS33,3,4,FAST,,,,LOCATED,NO,NONE,
P2,ram_addr_o<3>,IOB,IO_L33P_M3DQ12_3,OUTPUT,LVCMOS33,3,4,FAST,,,,LOCATED,NO,NONE,
P3,,,GND,,,,,,,,,,,,
P4,ram_data_io<4>,IOB,IO_L63P_2,BIDIR,LVCMOS33,2,4,FAST,,NONE,,LOCATED,NO,NONE,
P5,hdmi_n_o<0>,IOBS,IO_L49N_D4_2,,TMDS_33,2,,,,,,LOCATED,NO,,
P6,hdmi_p_o<2>,IOBM,IO_L47P_2,OUTPUT,TMDS_33,2,,,,,,LOCATED,NO,NONE,
P7,keyb_col_i<3>,IOB,IO_L31P_GCLK31_D14_2,INPUT,LVTTL,2,,,PULLUP,NONE,,LOCATED,NO,NONE,
P8,keyb_col_i<1>,IOB,IO_L30P_GCLK1_D13_2,INPUT,LVTTL,2,,,PULLUP,NONE,,LOCATED,NO,NONE,
P9,joysel_o,IOB,IO_L14N_D12_2,OUTPUT,LVTTL,2,12,SLOW,,,,LOCATED,NO,NONE,
P10,flash_miso_i,IOB,IO_L3P_D0_DIN_MISO_MISO1_2,INPUT,LVCMOS33,2,,,PULLUP,NONE,,LOCATED,NO,NONE,
P11,joyp6_i,IOB,IO_L13N_D10_2,INPUT,LVTTL,2,,,,NONE,,LOCATED,NO,NONE,
P12,flash_hold_o,IOB,IO_L12N_D2_MISO3_2,OUTPUT,LVCMOS33,2,12,SLOW,,,,LOCATED,NO,NONE,
P13,,,DONE_2,,,,,,,,,,,,
P14,,,SUSPEND,,,,,,,,,,,,
P15,joyp9_i,IOB,IO_L48P_HDC_M1DQ8_1,INPUT,LVTTL,1,,,,NONE,,LOCATED,NO,NONE,
P16,joyp4_i,IOB,IO_L48N_M1DQ9_1,INPUT,LVTTL,1,,,,NONE,,LOCATED,NO,NONE,
R1,ram_ce_n_o<1>,IOB,IO_L32N_M3DQ15_3,OUTPUT,LVCMOS33,3,4,FAST,,,,LOCATED,NO,NONE,
R2,ram_ce_n_o<0>,IOB,IO_L32P_M3DQ14_3,OUTPUT,LVCMOS33,3,4,FAST,,,,LOCATED,NO,NONE,
R3,ram_data_io<5>,IOB,IO_L65P_INIT_B_2,BIDIR,LVCMOS33,2,4,FAST,,NONE,,LOCATED,NO,NONE,
R4,,,VCCO_2,,,2,,,,,3.30,,,,
R5,mic_port_o,IOB,IO_L48P_D7_2,OUTPUT,LVCMOS33,2,12,SLOW,,,,LOCATED,NO,NONE,
R6,,,GND,,,,,,,,,,,,
R7,hdmi_p_o<3>,IOBM,IO_L32P_GCLK29_2,OUTPUT,TMDS_33,2,,,,,,LOCATED,NO,NONE,
R8,,,VCCO_2,,,2,,,,,3.30,,,,
R9,i2c_sda_io,IOB,IO_L23P_2,INPUT,LVTTL,2,,,PULLUP,NONE,,LOCATED,NO,NONE,
R10,,,GND,,,,,,,,,,,,
R11,flash_sclk_o,IOB,IO_L1P_CCLK_2,OUTPUT,LVCMOS33,2,12,SLOW,,,,LOCATED,NO,NONE,
R12,esp_gpio0_io,IOB,IO_L52P_M1DQ14_1,INPUT,LVCMOS33,1,,,PULLUP,NONE,,LOCATED,NO,NONE,
R13,,,VCCO_1,,,1,,,,,3.30,,,,
R14,joyp1_i,IOB,IO_L50P_M1UDQS_1,INPUT,LVTTL,1,,,,NONE,,LOCATED,NO,NONE,
R15,joyp3_i,IOB,IO_L49P_M1DQ10_1,INPUT,LVTTL,1,,,,NONE,,LOCATED,NO,NONE,
R16,audioint_o,IOB,IO_L49N_M1DQ11_1,OUTPUT,LVCMOS33,1,16,SLOW,,,,LOCATED,NO,NONE,
T1,,,GND,,,,,,,,,,,,
T2,,,PROGRAM_B_2,,,,,,,,,,,,
T3,flash_cs_n_o,IOB,IO_L65N_CSO_B_2,OUTPUT,LVCMOS33,2,12,SLOW,,,,LOCATED,NO,NONE,
T4,ram_data_io<6>,IOB,IO_L63N_2,BIDIR,LVCMOS33,2,4,FAST,,NONE,,LOCATED,NO,NONE,
T5,keyb_col_i<4>,IOB,IO_L48N_RDWR_B_VREF_2,INPUT,LVTTL,2,,,PULLUP,NONE,,LOCATED,NO,NONE,
T6,hdmi_n_o<2>,IOBS,IO_L47N_2,,TMDS_33,2,,,,,,LOCATED,NO,,
T7,hdmi_n_o<3>,IOBS,IO_L32N_GCLK28_2,,TMDS_33,2,,,,,,LOCATED,NO,,
T8,clock_50_i,IOB,IO_L30N_GCLK0_USERCCLK_2,INPUT,LVCMOS33,2,,,,NONE,,LOCATED,NO,NONE,
T9,i2c_scl_io,IOB,IO_L23N_2,INPUT,LVTTL,2,,,PULLUP,NONE,,LOCATED,NO,NONE,
T10,flash_mosi_o,IOB,IO_L3N_MOSI_CSI_B_MISO0_2,OUTPUT,LVCMOS33,2,12,SLOW,,,,LOCATED,NO,NONE,
T11,,IOBS,IO_L1N_M0_CMPMISO_2,UNUSED,,2,,,,,,,,,
T12,esp_tx_o,IOB,IO_L52N_M1DQ15_1,OUTPUT,LVCMOS33,1,4,SLOW,,,,LOCATED,NO,NONE,
T13,esp_gpio2_io,IOB,IO_L51N_M1DQ13_1,INPUT,LVCMOS33,1,,,PULLUP,NONE,,LOCATED,NO,NONE,
T14,joyp2_i,IOB,IO_L51P_M1DQ12_1,INPUT,LVTTL,1,,,,NONE,,LOCATED,NO,NONE,
T15,joyp7_o,IOB,IO_L50N_M1UDQSN_1,OUTPUT,LVTTL,1,12,SLOW,,,,LOCATED,YES,NONE,
T16,,,GND,,,,,,,,,,,,

# -----,-----,-----,-----,-----,-----,-----,-----,-----,-----,-----,-----,-----,-----,-----,
# 
#* Default value.
#** This default Pullup/Pulldown value can be overridden in Bitgen. 
#****** Special VCCO requirements may apply. Please consult the device 
#       family datasheet for specific guideline on VCCO requirements. 
#
#
#