%YAML 1.1
%TAG !u! tag:unity3d.com,2011:
--- !u!114 &11400000
MonoBehaviour:
  m_ObjectHideFlags: 0
  m_CorrespondingSourceObject: {fileID: 0}
  m_PrefabInstance: {fileID: 0}
  m_PrefabAsset: {fileID: 0}
  m_GameObject: {fileID: 0}
  m_Enabled: 1
  m_EditorHideFlags: 0
  m_Script: {fileID: 11500000, guid: 57ff74f15faccc44b9ce22eea0a7e913, type: 3}
  m_Name: Eva_E
  m_EditorClassIdentifier: 
  rarityLetter: 0
  characterName: EvaE
  level: 1
  attack: 25
  defense: 42
  icon: {fileID: 21300000, guid: bfbad6dea632a984bafc152809e87f6e, type: 3}
  splashArt: {fileID: 1048094775, guid: 5f90eeddb86d3ce43b4837a6a4e0b660, type: 3}
