<?xml version="1.0" encoding="UTF-8" standalone="no"?>
<svg xmlns:xlink="http://www.w3.org/1999/xlink" height="21.15px" width="28.4px" xmlns="http://www.w3.org/2000/svg">
  <g transform="matrix(1.0, 0.0, 0.0, 1.0, 14.2, 19.75)">
    <path d="M11.05 -16.8 Q14.15 -14.55 14.2 -10.85 L14.05 -10.3 Q13.0 -8.75 11.35 -8.0 L11.35 -8.05 Q9.15 -7.05 6.85 -6.55 L6.9 -6.55 6.15 -6.4 6.35 -5.85 6.35 -5.9 Q7.3 -3.05 5.2 -0.7 2.85 1.95 -0.85 1.25 -3.05 0.8 -4.15 -0.95 -4.6 -1.55 -4.85 -2.3 L-5.05 -3.95 -5.05 -4.0 -5.0 -4.45 -6.85 -4.2 -7.0 -4.2 -9.65 -4.35 Q-12.7 -4.6 -13.6 -6.0 -14.8 -7.45 -13.55 -9.95 -12.35 -12.45 -10.4 -14.35 L-8.75 -15.75 -8.4 -16.1 -8.4 -16.15 Q-7.5 -17.1 -6.1 -17.4 L-4.15 -18.3 Q-2.4 -19.1 -0.3 -19.6 L-0.15 -19.65 1.75 -19.75 1.8 -19.75 6.75 -19.15 6.8 -19.1 Q9.05 -18.3 11.05 -16.8" fill="#000000" fill-rule="evenodd" stroke="none"/>
    <path d="M-3.45 -1.55 L-4.0 -2.7 -4.15 -3.95 Q-3.95 -5.95 -2.4 -7.45 L-2.7 -7.1 -2.2 -7.05 Q-0.2 -6.05 1.95 -6.35 L2.45 -5.85 2.4 -4.85 Q1.75 -3.3 0.65 -2.05 L0.45 -1.95 Q-1.15 -1.1 -2.9 -1.5 L-3.45 -1.55 M-3.25 -4.9 L-3.3 -4.85 -3.55 -4.55 -3.65 -3.65 -3.5 -3.15 -3.3 -3.1 Q-2.8 -3.35 -2.95 -3.95 L-2.95 -4.3 Q-2.85 -4.75 -3.25 -4.9" fill="#feaa8f" fill-rule="evenodd" stroke="none"/>
    <path d="M-2.4 -7.45 L-2.35 -7.5 Q-1.7 -8.1 -0.9 -8.5 L0.05 -8.8 0.2 -8.8 2.15 -8.55 3.4 -8.0 3.5 -7.9 4.8 -6.7 4.8 -6.65 4.85 -6.6 5.3 -5.65 Q6.05 -3.35 4.35 -1.45 2.35 0.8 -0.75 0.2 -2.55 -0.15 -3.45 -1.55 L-2.9 -1.5 Q-1.15 -1.1 0.45 -1.95 L0.65 -2.05 Q1.75 -3.3 2.4 -4.85 L2.45 -5.85 1.95 -6.35 Q-0.2 -6.05 -2.2 -7.05 L-2.7 -7.1 -2.4 -7.45" fill="#ed3c01" fill-rule="evenodd" stroke="none"/>
    <path d="M-3.25 -4.9 Q-2.85 -4.75 -2.95 -4.3 L-2.95 -3.95 Q-2.8 -3.35 -3.3 -3.1 L-3.5 -3.15 -3.65 -3.65 -3.55 -4.55 -3.3 -4.85 -3.25 -4.9" fill="#ffffff" fill-rule="evenodd" stroke="none"/>
    <path d="M-3.55 -16.5 L-5.75 -14.55 Q-6.8 -13.8 -7.95 -13.35 -8.2 -13.3 -8.3 -13.45 L-8.25 -13.7 -8.2 -13.85 -8.2 -13.95 -8.2 -14.0 -5.55 -16.1 Q-4.65 -16.7 -3.65 -17.1 -3.2 -16.9 -3.55 -16.5" fill="#ffffff" fill-rule="evenodd" stroke="none"/>
    <path d="M-3.55 -16.5 Q-3.2 -16.9 -3.65 -17.1 -4.65 -16.7 -5.55 -16.1 L-8.2 -14.0 -8.2 -13.95 -8.2 -13.85 -8.25 -13.7 -8.3 -13.45 Q-8.2 -13.3 -7.95 -13.35 -6.8 -13.8 -5.75 -14.55 L-3.55 -16.5 M-7.05 -5.25 L-9.65 -5.4 Q-14.6 -5.85 -12.75 -9.55 -11.65 -11.9 -9.8 -13.65 L-8.45 -14.85 -7.15 -15.75 -5.7 -16.6 -3.9 -17.45 -0.15 -18.7 Q0.1 -18.35 0.5 -18.15 2.85 -17.05 4.5 -15.3 6.25 -13.55 5.95 -11.05 5.8 -9.7 4.75 -8.95 2.8 -7.5 0.35 -7.0 L-2.85 -6.15 -7.05 -5.25" fill="#cc3300" fill-rule="evenodd" stroke="none"/>
    <path d="M-0.15 -18.7 L1.7 -18.8 6.35 -18.25 Q8.45 -17.45 10.35 -16.05 13.05 -14.1 13.1 -10.9 12.25 -9.6 10.85 -9.0 8.75 -8.05 6.55 -7.6 L2.2 -6.75 -2.2 -5.95 -7.05 -5.25 -2.85 -6.15 0.35 -7.0 Q2.8 -7.5 4.75 -8.95 5.8 -9.7 5.95 -11.05 6.25 -13.55 4.5 -15.3 2.85 -17.05 0.5 -18.15 0.1 -18.35 -0.15 -18.7" fill="#990000" fill-rule="evenodd" stroke="none"/>
  </g>
</svg>
