<?xml version="1.0" encoding="UTF-8" standalone="no"?>
<svg xmlns:xlink="http://www.w3.org/1999/xlink" height="28.0px" width="23.8px" xmlns="http://www.w3.org/2000/svg">
  <g transform="matrix(1.0, 0.0, 0.0, 1.0, 13.75, 27.1)">
    <use height="28.0" transform="matrix(1.0, 0.0, 0.0, 1.0, -13.75, -27.1)" width="23.8" xlink:href="#shape0"/>
    <use height="25.85" transform="matrix(1.0, 0.0, 0.0, 1.0, -12.8, -26.0)" width="21.95" xlink:href="#sprite0"/>
    <use height="20.0" transform="matrix(1.0, 0.0, 0.0, 1.0, -7.2, -24.6)" width="16.6" xlink:href="#shape2"/>
  </g>
  <defs>
    <g id="shape0" transform="matrix(1.0, 0.0, 0.0, 1.0, 13.75, 27.1)">
      <path d="M8.7 -18.5 Q9.75 -15.5 9.95 -12.4 10.15 -9.75 9.85 -7.05 9.45 -3.9 7.1 -1.95 4.65 0.1 1.45 0.7 L-3.0 0.45 Q-5.7 -0.75 -8.05 -2.5 -10.4 -4.3 -11.8 -6.9 -13.05 -9.2 -13.55 -11.75 -14.05 -14.55 -13.4 -17.2 -12.75 -20.05 -10.75 -22.2 -8.75 -24.4 -6.15 -25.55 -3.75 -26.65 -1.25 -27.05 0.4 -27.3 2.05 -26.6 4.9 -25.4 6.45 -23.05 7.9 -20.85 8.7 -18.5" fill="#000000" fill-rule="evenodd" stroke="none"/>
      <path d="M2.9 -0.7 Q-4.1 1.7 -8.95 -4.45 -13.35 -9.95 -12.65 -16.85 -10.8 -22.35 -5.6 -24.5 L-4.45 -25.0 Q2.45 -28.0 6.3 -21.35 9.6 -15.6 9.2 -8.85 8.8 -2.2 2.9 -0.7" fill="#000000" fill-rule="evenodd" stroke="none"/>
    </g>
    <g id="sprite0" transform="matrix(1.0, 0.0, 0.0, 1.0, 11.0, 12.95)">
      <use height="25.85" transform="matrix(1.0, 0.0, 0.0, 1.0, -11.0, -12.95)" width="21.95" xlink:href="#sprite1"/>
    </g>
    <g id="sprite1" transform="matrix(1.0, 0.0, 0.0, 1.0, 11.0, 12.95)">
      <use height="25.85" transform="matrix(1.0, 0.0, 0.0, 1.0, -11.0, -12.95)" width="21.95" xlink:href="#shape1"/>
    </g>
    <g id="shape1" transform="matrix(1.0, 0.0, 0.0, 1.0, 11.0, 12.95)">
      <path d="M-10.9 -3.85 Q-9.05 -9.4 -3.85 -11.5 L-2.75 -12.0 Q4.15 -15.0 8.0 -8.4 11.3 -2.6 10.9 4.15 10.5 10.8 4.6 12.25 -2.35 14.65 -7.25 8.5 -11.6 3.0 -10.9 -3.85" fill="url(#gradient0)" fill-rule="evenodd" stroke="none"/>
    </g>
    <radialGradient cx="0" cy="0" gradientTransform="matrix(0.0066, -0.0152, 0.0152, 0.0066, 3.85, -1.95)" gradientUnits="userSpaceOnUse" id="gradient0" r="819.2" spreadMethod="pad">
      <stop offset="0.23137254901960785" stop-color="#ffffb2"/>
      <stop offset="0.6705882352941176" stop-color="#ffd080"/>
      <stop offset="0.8980392156862745" stop-color="#ff9646"/>
    </radialGradient>
    <g id="shape2" transform="matrix(1.0, 0.0, 0.0, 1.0, 7.2, 24.6)">
      <path d="M3.4 -16.25 L4.85 -17.15 6.25 -16.8 Q8.2 -16.05 9.05 -14.1 9.8 -12.45 8.85 -10.9 L7.6 -9.7 Q5.25 -8.45 3.0 -10.05 L1.45 -8.65 -0.5 -8.8 Q-1.8 -9.45 -2.7 -10.65 -3.7 -11.9 -3.75 -13.35 -3.8 -17.05 -0.25 -18.1 3.0 -17.85 3.4 -16.25" fill="#ffffff" fill-rule="evenodd" stroke="none"/>
      <path d="M5.0 -19.95 Q6.85 -19.65 7.5 -17.75 L8.0 -15.6 Q7.6 -17.3 6.15 -18.2 5.15 -18.9 4.0 -19.3 L5.0 -19.95 M3.45 -13.85 L4.7 -14.85 7.2 -13.1 Q7.25 -12.0 6.3 -11.5 L5.4 -11.05 Q3.85 -10.8 3.35 -12.2 L2.9 -11.55 1.05 -11.25 0.25 -13.5 1.85 -15.4 3.45 -13.85 M2.95 -6.3 L1.35 -5.3 -0.25 -4.6 -2.05 -4.75 Q-2.95 -5.05 -3.6 -5.65 L-4.75 -7.35 -4.85 -8.05 -4.7 -8.8 -4.2 -8.95 -3.4 -7.35 Q-3.05 -6.8 -2.4 -6.45 -1.9 -6.1 -1.25 -5.85 L0.15 -5.85 1.5 -5.85 2.95 -6.3 M-0.55 -19.2 Q-2.05 -19.25 -3.2 -18.45 -4.8 -17.2 -5.15 -15.05 -5.35 -13.9 -4.95 -12.9 -4.9 -12.7 -5.0 -12.55 L-5.2 -12.45 -5.45 -12.8 Q-5.95 -15.05 -5.15 -17.15 -4.35 -19.1 -2.3 -19.8 L-0.55 -19.2" fill="#000000" fill-rule="evenodd" stroke="none"/>
      <path d="M2.2 -20.4 Q1.55 -22.35 -0.4 -23.0 -3.7 -24.2 -7.2 -23.45 L-5.6 -23.85 -1.7 -24.6 -0.9 -24.4 Q0.7 -23.8 1.5 -22.4 2.1 -21.4 2.2 -20.4" fill="#ae8300" fill-rule="evenodd" stroke="none"/>
      <path d="M-6.1 -24.0 L-1.15 -23.85 1.25 -22.5 -0.7 -23.35 Q-2.9 -24.35 -5.15 -23.9 L-6.1 -24.0" fill="#000000" fill-rule="evenodd" stroke="none"/>
    </g>
  </defs>
</svg>
