<?xml version="1.0" encoding="UTF-8" standalone="no"?>
<svg xmlns:xlink="http://www.w3.org/1999/xlink" height="29.75px" width="27.4px" xmlns="http://www.w3.org/2000/svg">
  <g transform="matrix(1.0, 0.0, 0.0, 1.0, 14.2, 14.9)">
    <use height="34.8" transform="matrix(0.85, 0.0, 0.0, 0.85, -13.1724, -14.7798)" width="27.75" xlink:href="#sprite0"/>
    <use height="7.9" transform="matrix(0.85, 0.0, 0.0, 0.85, -1.7949, 4.5075)" width="13.4" xlink:href="#sprite1"/>
    <use height="11.35" transform="matrix(0.85, 0.0, 0.0, 0.85, -9.5474, -4.3024)" width="26.75" xlink:href="#sprite2"/>
  </g>
  <defs>
    <g id="sprite0" transform="matrix(1.0, 0.0, 0.0, 1.0, 13.85, 17.8)">
      <use height="34.8" transform="matrix(1.0, 0.0, 0.0, 1.0, -13.85, -17.8)" width="27.75" xlink:href="#shape0"/>
    </g>
    <g id="shape0" transform="matrix(1.0, 0.0, 0.0, 1.0, 13.85, 17.8)">
      <path d="M0.75 -14.8 L0.55 -14.75 0.4 -14.7 0.35 -14.7 0.25 -14.65 -0.2 -14.75 -0.65 -15.0 -0.65 -15.1 Q-0.35 -15.5 0.2 -15.45 L0.35 -15.4 0.45 -15.35 0.75 -14.9 0.75 -14.8 M2.4 -16.95 Q3.75 -15.85 4.0 -14.2 L6.75 -12.7 Q9.15 -11.3 10.85 -9.15 L11.65 -7.85 12.8 -5.3 13.6 -2.5 Q14.15 0.3 13.7 3.15 L13.35 5.05 Q12.9 6.9 11.8 8.7 10.55 10.7 8.9 12.05 6.3 14.15 3.3 15.3 L3.0 15.7 Q1.5 17.3 -0.5 16.9 L-2.25 16.85 Q-3.55 16.4 -4.15 15.0 -5.65 14.4 -6.85 13.65 -8.5 12.5 -9.8 11.05 -11.55 9.1 -12.55 6.6 L-13.4 3.65 -13.8 1.15 -13.65 -2.3 -13.35 -3.65 Q-12.5 -6.35 -10.9 -8.85 -10.05 -10.25 -8.9 -11.3 -6.7 -13.25 -3.9 -14.35 L-2.9 -16.1 -2.3 -16.8 Q-1.4 -17.65 -0.3 -17.8 1.2 -17.9 2.4 -16.95 M9.9 9.65 L10.85 8.1 12.25 4.75 Q12.9 2.6 12.9 0.4 12.9 -2.45 11.85 -5.0 L10.65 -7.35 8.95 -9.45 Q7.6 -10.75 6.05 -11.7 L3.0 -13.5 2.5 -14.85 1.55 -16.0 -0.1 -16.85 -1.2 -16.35 -2.1 -15.55 -3.15 -13.45 -5.1 -12.55 Q-6.8 -11.6 -8.35 -10.5 L-10.05 -8.35 -11.45 -5.85 -12.45 -3.35 -12.8 -2.05 -12.9 -0.2 -12.75 2.25 -12.25 4.6 -10.95 7.65 -9.1 10.35 -6.85 12.5 Q-5.4 13.55 -3.8 14.05 L-2.0 14.2 1.2 14.6 2.4 14.3 Q3.95 13.8 5.35 13.0 L8.1 11.2 9.9 9.65 M-2.7 15.2 L-2.75 15.1 -2.45 15.6 Q-1.95 16.2 -1.25 16.5 1.2 17.3 2.25 15.05 L-2.3 15.2 Q-2.5 15.45 -2.7 15.2" fill="#000000" fill-rule="evenodd" stroke="none"/>
      <path d="M1.25 -15.15 L1.3 -15.25 1.3 -15.3 Q1.05 -16.25 0.0 -16.3 L-0.3 -16.25 -1.2 -15.85 -1.1 -15.5 -1.05 -15.4 -0.8 -15.1 Q-0.5 -14.85 -0.2 -14.75 L0.25 -14.65 0.35 -14.7 0.4 -14.7 0.55 -14.75 0.75 -14.8 1.25 -15.15 M-8.35 -10.5 Q-6.8 -11.6 -5.1 -12.55 L-3.15 -13.45 -2.1 -15.55 -1.2 -16.35 -0.1 -16.85 1.55 -16.0 2.5 -14.85 3.0 -13.5 6.05 -11.7 Q7.6 -10.75 8.95 -9.45 L10.65 -7.35 11.85 -5.0 Q12.9 -2.45 12.9 0.4 12.9 2.6 12.25 4.75 L10.85 8.1 9.9 9.65 Q9.35 9.25 9.85 8.55 L9.9 8.35 9.15 7.75 Q8.4 7.85 8.1 8.4 L8.15 9.55 8.3 9.6 6.15 9.7 5.45 9.25 6.3 8.5 6.5 8.3 Q6.55 7.35 5.55 7.0 L4.7 7.3 4.0 8.3 4.15 9.1 2.95 8.55 2.1 9.05 2.65 9.8 Q2.75 10.4 2.15 10.15 L1.6 9.9 Q0.95 8.95 -0.15 8.55 L-1.55 9.55 -3.05 8.05 -2.05 6.7 Q-2.25 5.75 -3.25 5.4 -3.45 5.15 -4.1 5.85 L-5.0 6.4 Q-6.1 6.3 -6.65 5.5 -7.2 4.65 -6.6 3.65 L-5.7 2.45 -5.7 2.5 Q-5.45 3.45 -4.5 3.7 L-3.6 3.35 -3.1 2.55 Q-3.05 1.45 -4.15 1.15 L-5.2 1.55 -5.55 0.85 -7.45 0.8 Q-8.35 0.35 -8.75 -0.85 -8.25 -1.9 -7.45 -2.4 L-8.55 -5.4 -9.1 -5.25 -10.1 -5.7 -10.25 -6.1 Q-9.75 -7.0 -8.65 -7.45 -8.1 -9.1 -8.35 -10.5 M1.2 -0.4 L1.8 -0.95 1.45 -1.5 Q0.85 -1.85 0.25 -1.1 L0.4 -0.4 1.2 -0.4 M-2.95 -8.95 L-2.85 -9.35 -2.95 -9.75 -3.3 -9.9 -3.6 -9.75 -3.75 -9.35 -3.6 -8.95 Q-3.5 -8.8 -3.3 -8.8 -3.1 -8.8 -2.95 -8.95 M-8.05 -6.2 L-7.25 -6.2 -6.85 -6.85 -7.25 -7.35 -7.85 -7.5 Q-8.6 -7.3 -8.4 -6.8 L-8.05 -6.2 M-7.0 -3.95 Q-6.9 -3.3 -6.3 -3.0 L-6.15 -3.05 Q-5.4 -3.1 -5.6 -3.85 L-5.65 -3.95 -6.35 -4.5 -6.8 -4.2 -7.0 -3.95 M-10.05 -3.55 L-9.85 -3.7 Q-9.0 -3.6 -8.7 -2.9 L-8.7 -2.85 -9.45 -2.2 -9.85 -2.4 Q-10.7 -3.0 -10.05 -3.55 M-5.3 -0.5 L-4.6 -0.1 Q-3.85 -0.1 -3.7 -0.95 L-3.65 -1.5 -4.25 -1.9 -4.9 -1.4 -5.3 -0.75 -5.3 -0.5 M-2.15 -5.3 L-2.15 -5.1 -1.8 -4.55 Q-0.8 -4.6 -1.3 -5.6 -1.95 -6.0 -2.15 -5.3 M-4.25 -5.4 Q-3.8 -5.2 -3.95 -5.7 L-4.15 -6.3 Q-4.75 -6.6 -4.75 -5.95 -4.75 -5.45 -4.25 -5.4 M-0.75 4.3 L0.2 3.9 0.4 3.5 -0.45 2.85 -1.1 3.25 -0.95 4.05 -0.75 4.3 M-7.45 6.8 L-6.6 6.25 Q-6.35 6.1 -6.2 6.45 L-6.3 6.75 -7.45 6.8 M-9.15 2.1 L-8.9 1.9 -8.05 1.6 -7.7 2.15 Q-7.45 2.7 -7.8 3.4 L-8.4 3.6 -8.95 3.75 Q-9.6 3.05 -9.15 2.1 M-0.55 6.4 L-0.15 6.15 0.15 5.75 -0.45 5.15 Q-1.4 5.45 -0.75 6.2 L-0.55 6.4 M-3.8 8.1 L-3.6 8.35 -3.6 8.45 -3.65 8.7 -4.25 9.15 -4.65 9.9 -5.3 8.6 -4.15 7.85 -3.8 8.1 M3.25 5.95 L3.0 5.5 2.6 5.15 Q1.5 5.45 1.25 6.45 L1.9 6.95 2.45 6.95 Q3.15 6.7 3.25 6.0 L3.25 5.95 M6.4 10.5 L6.25 10.9 5.8 11.05 5.4 10.9 5.2 10.5 5.4 10.1 5.8 9.95 6.25 10.1 6.4 10.5 M1.35 10.9 L1.7 11.4 Q1.3 12.65 0.1 12.2 L0.0 11.35 Q0.55 10.65 1.35 10.9" fill="#e4e307" fill-rule="evenodd" stroke="none"/>
      <path d="M-1.1 -15.5 L-1.2 -15.85 -0.3 -16.25 0.0 -16.3 Q1.05 -16.25 1.3 -15.3 L1.3 -15.25 1.25 -15.15 Q0.65 -15.9 -0.6 -15.75 L-1.1 -15.5 M9.9 9.65 L8.1 11.2 5.35 13.0 Q3.95 13.8 2.4 14.3 L1.2 14.6 1.25 14.45 1.1 14.2 0.5 13.55 -0.05 13.75 -0.25 14.4 -1.55 14.15 -1.45 13.9 -1.55 13.3 -2.85 13.35 -4.8 12.7 -4.5 12.2 -4.8 11.5 -5.05 11.5 Q-5.5 11.6 -5.85 11.85 L-7.4 11.25 -6.6 10.65 -6.6 10.4 Q-6.65 9.75 -7.5 9.45 L-8.45 9.95 -8.75 9.55 -9.75 8.2 -9.1 8.0 -9.05 7.85 -8.9 7.1 -9.1 6.95 -9.65 6.85 -9.85 6.5 -10.0 6.45 -10.3 6.45 -10.6 6.65 -11.75 3.6 -11.65 3.65 -10.7 3.2 -10.55 3.1 -11.2 2.65 -11.3 2.35 -12.05 1.65 -12.05 1.7 -12.45 0.9 -12.8 0.15 -12.3 -0.45 -12.55 -1.1 -12.25 -1.55 -12.3 -1.7 -12.8 -2.05 -12.45 -3.35 -11.45 -5.85 -10.05 -8.35 -8.35 -10.5 Q-8.1 -9.1 -8.65 -7.45 -9.75 -7.0 -10.25 -6.1 L-10.1 -5.7 -9.1 -5.25 -8.55 -5.4 -7.45 -2.4 Q-8.25 -1.9 -8.75 -0.85 -8.35 0.35 -7.45 0.8 L-5.55 0.85 -5.2 1.55 -4.15 1.15 Q-3.05 1.45 -3.1 2.55 L-3.6 3.35 -4.5 3.7 Q-5.45 3.45 -5.7 2.5 L-5.7 2.45 -6.6 3.65 Q-7.2 4.65 -6.65 5.5 -6.1 6.3 -5.0 6.4 L-4.1 5.85 Q-3.45 5.15 -3.25 5.4 -2.25 5.75 -2.05 6.7 L-3.05 8.05 -1.55 9.55 -0.15 8.55 Q0.95 8.95 1.6 9.9 L2.15 10.15 Q2.75 10.4 2.65 9.8 L2.1 9.05 2.95 8.55 4.15 9.1 4.0 8.3 4.7 7.3 5.55 7.0 Q6.55 7.35 6.5 8.3 L6.3 8.5 5.45 9.25 6.15 9.7 8.3 9.6 8.15 9.55 8.1 8.4 Q8.4 7.85 9.15 7.75 L9.9 8.35 9.85 8.55 Q9.35 9.25 9.9 9.65 M1.2 -0.4 L0.4 -0.4 0.25 -1.1 Q0.85 -1.85 1.45 -1.5 L1.8 -0.95 1.2 -0.4 M-7.0 -3.95 L-6.8 -4.2 -6.35 -4.5 -5.65 -3.95 -5.6 -3.85 Q-5.4 -3.1 -6.15 -3.05 L-6.3 -3.0 Q-6.9 -3.3 -7.0 -3.95 M-8.05 -6.2 L-8.4 -6.8 Q-8.6 -7.3 -7.85 -7.5 L-7.25 -7.35 -6.85 -6.85 -7.25 -6.2 -8.05 -6.2 M-2.95 -8.95 Q-3.1 -8.8 -3.3 -8.8 -3.5 -8.8 -3.6 -8.95 L-3.75 -9.35 -3.6 -9.75 -3.3 -9.9 -2.95 -9.75 -2.85 -9.35 -2.95 -8.95 M-10.05 -3.55 Q-10.7 -3.0 -9.85 -2.4 L-9.45 -2.2 -8.7 -2.85 -8.7 -2.9 Q-9.0 -3.6 -9.85 -3.7 L-10.05 -3.55 M-0.75 4.3 L-0.95 4.05 -1.1 3.25 -0.45 2.85 0.4 3.5 0.2 3.9 -0.75 4.3 M-4.25 -5.4 Q-4.75 -5.45 -4.75 -5.95 -4.75 -6.6 -4.15 -6.3 L-3.95 -5.7 Q-3.8 -5.2 -4.25 -5.4 M-2.15 -5.3 Q-1.95 -6.0 -1.3 -5.6 -0.8 -4.6 -1.8 -4.55 L-2.15 -5.1 -2.15 -5.3 M-5.3 -0.5 L-5.3 -0.75 -4.9 -1.4 -4.25 -1.9 -3.65 -1.5 -3.7 -0.95 Q-3.85 -0.1 -4.6 -0.1 L-5.3 -0.5 M-9.15 2.1 Q-9.6 3.05 -8.95 3.75 L-8.4 3.6 -7.8 3.4 Q-7.45 2.7 -7.7 2.15 L-8.05 1.6 -8.9 1.9 -9.15 2.1 M-7.45 6.8 L-6.3 6.75 -6.2 6.45 Q-6.35 6.1 -6.6 6.25 L-7.45 6.8 M-0.55 6.4 L-0.75 6.2 Q-1.4 5.45 -0.45 5.15 L0.15 5.75 -0.15 6.15 -0.55 6.4 M-3.8 8.1 L-4.15 7.85 -5.3 8.6 -4.65 9.9 -4.25 9.15 -3.65 8.7 -3.6 8.45 -3.6 8.35 -3.8 8.1 M-2.55 11.55 L-2.15 11.4 -2.0 11.05 -2.15 10.7 Q-2.3 10.55 -2.55 10.55 L-2.95 10.7 -3.1 11.05 -2.95 11.4 -2.55 11.55 M3.25 5.95 L3.25 6.0 Q3.15 6.7 2.45 6.95 L1.9 6.95 1.25 6.45 Q1.5 5.45 2.6 5.15 L3.0 5.5 3.25 5.95 M1.35 10.9 Q0.55 10.65 0.0 11.35 L0.1 12.2 Q1.3 12.65 1.7 11.4 L1.35 10.9 M6.4 10.5 L6.25 10.1 5.8 9.95 5.4 10.1 5.2 10.5 5.4 10.9 5.8 11.05 6.25 10.9 6.4 10.5" fill="#cfbf05" fill-rule="evenodd" stroke="none"/>
      <path d="M1.25 -15.15 L0.75 -14.8 0.75 -14.9 0.45 -15.35 0.35 -15.4 0.2 -15.45 Q-0.35 -15.5 -0.65 -15.1 L-0.65 -15.0 -0.2 -14.75 Q-0.5 -14.85 -0.8 -15.1 L-1.05 -15.4 -1.1 -15.5 -0.6 -15.75 Q0.65 -15.9 1.25 -15.15 M1.2 14.6 L-2.0 14.2 -3.8 14.05 Q-5.4 13.55 -6.85 12.5 L-9.1 10.35 -10.95 7.65 -12.25 4.6 -12.75 2.25 -12.9 -0.2 -12.8 -2.05 -12.3 -1.7 -12.25 -1.55 -12.55 -1.1 -12.3 -0.45 -12.8 0.15 -12.45 0.9 -12.05 1.7 -12.05 1.65 -11.3 2.35 -11.2 2.65 -10.55 3.1 -10.7 3.2 -11.65 3.65 -11.75 3.6 -10.6 6.65 -10.3 6.45 -10.0 6.45 -9.85 6.5 -9.65 6.85 -9.1 6.95 -8.9 7.1 -9.05 7.85 -9.1 8.0 -9.75 8.2 -8.75 9.55 -8.45 9.95 -7.5 9.45 Q-6.65 9.75 -6.6 10.4 L-6.6 10.65 -7.4 11.25 -5.85 11.85 Q-5.5 11.6 -5.05 11.5 L-4.8 11.5 -4.5 12.2 -4.8 12.7 -2.85 13.35 -1.55 13.3 -1.45 13.9 -1.55 14.15 -0.25 14.4 -0.05 13.75 0.5 13.55 1.1 14.2 1.25 14.45 1.2 14.6 M-2.55 11.55 L-2.95 11.4 -3.1 11.05 -2.95 10.7 -2.55 10.55 Q-2.3 10.55 -2.15 10.7 L-2.0 11.05 -2.15 11.4 -2.55 11.55 M-2.7 15.2 Q-2.5 15.45 -2.3 15.2 L2.25 15.05 Q1.2 17.3 -1.25 16.5 -1.95 16.2 -2.45 15.6 L-2.75 15.1 -2.7 15.2" fill="#af9605" fill-rule="evenodd" stroke="none"/>
      <path d="M9.2 -2.5 L9.65 -2.55 10.9 -1.45 9.1 0.6 10.75 -0.3 11.2 -0.2 10.6 1.95 9.9 2.1 9.0 3.95 8.15 2.9 8.45 1.85 7.35 1.7 7.2 0.95 8.6 0.25 7.95 -0.65 7.1 -0.15 6.7 -0.3 6.15 -1.6 4.65 -1.35 4.1 -1.8 3.85 -4.25 4.8 -5.2 4.05 -7.25 3.15 -7.15 1.85 -9.0 3.2 -10.4 4.6 -9.2 5.85 -10.0 6.75 -9.35 Q6.25 -8.95 6.0 -8.25 L5.9 -7.65 5.95 -7.3 6.55 -6.9 7.9 -7.9 7.7 -8.8 8.65 -9.1 9.4 -8.5 9.55 -7.7 8.0 -6.55 9.05 -6.9 Q11.4 -5.75 9.6 -4.2 9.05 -3.75 8.2 -3.7 L7.65 -4.05 7.5 -4.2 8.2 -5.05 7.4 -6.35 6.4 -6.05 6.3 -5.55 Q6.2 -4.45 7.3 -4.15 L7.15 -3.95 5.95 -3.2 6.1 -2.75 Q6.75 -2.45 7.35 -2.2 L7.45 -1.15 8.2 -0.85 9.2 -2.5" fill="#ffff8a" fill-rule="evenodd" stroke="none"/>
      <path d="M6.75 -9.35 L7.7 -8.8 7.9 -7.9 6.55 -6.9 5.95 -7.3 5.9 -7.65 6.0 -8.25 Q6.25 -8.95 6.75 -9.35 M8.2 -3.7 L8.95 -2.95 9.0 -2.4 8.3 -1.65 8.5 -1.7 9.2 -2.5 8.2 -0.85 7.45 -1.15 7.35 -2.2 Q6.75 -2.45 6.1 -2.75 L5.95 -3.2 7.15 -3.95 7.65 -4.05 8.2 -3.7 M7.3 -4.15 Q6.2 -4.45 6.3 -5.55 L6.4 -6.05 7.4 -6.35 8.2 -5.05 7.5 -4.2 7.3 -4.15" fill="#ffffff" fill-rule="evenodd" stroke="none"/>
    </g>
    <g id="sprite1" transform="matrix(1.0, 0.0, 0.0, 1.0, 6.7, 4.05)">
      <use height="7.9" transform="matrix(1.0, 0.0, 0.0, 1.0, -6.7, -4.05)" width="13.4" xlink:href="#shape1"/>
    </g>
    <g id="shape1" transform="matrix(1.0, 0.0, 0.0, 1.0, 6.7, 4.05)">
      <path d="M5.45 -2.55 L5.75 -3.4 5.8 -3.65 5.8 -3.75 6.1 -4.05 6.2 -3.8 6.2 -3.75 6.25 -3.4 Q6.15 -2.6 6.7 -2.7 5.9 -0.2 5.65 1.35 L5.6 2.05 5.1 2.7 1.45 2.45 -5.2 1.95 -6.7 1.8 -6.6 1.7 -4.9 1.7 -0.05 1.85 4.9 1.85 5.0 1.1 5.45 -2.55" fill="#000000" fill-rule="evenodd" stroke="none"/>
      <path d="M-6.0 0.9 L-5.3 0.55 -0.65 0.85 Q0.55 0.6 1.75 -0.15 L5.45 -2.55 5.0 1.1 4.3 0.95 1.9 1.0 -5.55 0.8 -5.75 0.8 -6.0 0.9" fill="#e4e307" fill-rule="evenodd" stroke="none"/>
      <path d="M-6.6 1.7 Q-6.75 1.35 -6.45 1.2 L-6.0 0.9 -5.75 0.8 -5.55 0.8 1.9 1.0 4.3 0.95 5.0 1.1 4.9 1.85 -0.05 1.85 -4.9 1.7 -6.6 1.7" fill="#cfbf05" fill-rule="evenodd" stroke="none"/>
      <path d="M1.45 2.45 L-1.05 3.85 -5.9 1.95 -5.2 1.95 1.45 2.45" fill="#af9605" fill-rule="evenodd" stroke="none"/>
    </g>
    <g id="sprite2" transform="matrix(1.0, 0.0, 0.0, 1.0, 13.35, 5.65)">
      <use height="11.35" transform="matrix(1.0, 0.0, 0.0, 1.0, -13.35, -5.65)" width="26.75" xlink:href="#shape2"/>
    </g>
    <g id="shape2" transform="matrix(1.0, 0.0, 0.0, 1.0, 13.35, 5.65)">
      <path d="M8.5 -4.8 Q9.05 -3.9 9.8 -3.25 10.9 -2.2 12.35 -1.6 L12.35 -1.55 -7.85 -0.8 -7.15 -0.85 -5.8 -1.05 -5.25 -1.15 1.75 -1.7 8.35 -2.3 7.5 -2.2 8.6 -2.75 7.4 -3.6 Q7.35 -4.0 7.55 -4.3 L8.35 -4.8 8.5 -4.8" fill="#e4e307" fill-rule="evenodd" stroke="none"/>
      <path d="M8.5 -4.8 Q8.25 -5.2 8.55 -5.6 L8.8 -5.65 11.0 -3.85 12.05 -3.1 13.05 -2.2 13.4 -1.05 13.3 -0.5 Q12.9 0.75 11.4 0.9 L11.1 1.65 Q10.65 3.1 9.4 3.85 L9.8 2.9 10.65 0.2 10.7 0.15 10.75 -0.1 11.95 -0.7 12.35 -1.55 12.35 -1.6 Q10.9 -2.2 9.8 -3.25 9.05 -3.9 8.5 -4.8" fill="#000000" fill-rule="evenodd" stroke="none"/>
      <path d="M12.35 -1.55 L11.95 -0.7 10.75 -0.1 -7.75 -0.2 -7.15 1.25 -5.8 3.55 -5.55 3.75 -4.05 4.55 -2.2 5.2 -0.2 5.2 1.0 5.15 1.95 4.7 2.8 4.0 3.55 3.1 4.6 3.9 5.2 4.25 5.85 4.55 7.05 4.2 8.1 3.7 8.95 3.05 9.0 3.25 Q8.8 4.2 7.8 4.65 L6.35 5.1 5.25 5.1 4.75 5.05 4.35 4.75 3.65 4.15 3.1 4.5 1.9 5.15 0.65 5.65 -0.05 5.7 -1.6 5.7 -2.3 5.65 -3.0 5.5 -4.35 4.9 -6.0 3.85 Q-7.55 2.5 -9.65 1.6 L-11.9 0.65 -12.45 0.4 -13.05 0.1 -13.25 -0.1 -13.35 -0.4 -7.15 -0.85 -7.85 -0.8 12.35 -1.55" fill="#cfbf05" fill-rule="evenodd" stroke="none"/>
      <path d="M9.2 1.45 L9.0 1.95 8.55 2.35 7.2 3.0 Q5.2 3.8 4.05 2.2 L4.0 1.8 4.05 0.95 4.6 0.65 9.3 1.0 9.2 1.45 M3.0 0.75 L3.3 1.5 2.5 2.6 Q1.65 3.55 0.55 3.8 -1.85 4.2 -4.1 3.35 -5.25 2.85 -5.9 1.9 L-6.1 1.45 -6.1 1.0 3.0 0.75" fill="#ffffff" fill-rule="evenodd" stroke="none"/>
      <path d="M10.75 -0.1 L10.7 0.15 10.65 0.2 Q10.1 1.8 8.95 3.05 L8.1 3.7 7.05 4.2 5.85 4.55 5.2 4.25 4.6 3.9 3.55 3.1 2.8 4.0 1.95 4.7 1.0 5.15 -0.2 5.2 -2.2 5.2 -4.05 4.55 -5.55 3.75 -5.8 3.55 -7.15 1.25 -7.75 -0.2 10.75 -0.1 M9.2 1.45 L9.3 1.0 4.6 0.65 4.05 0.95 4.0 1.8 4.05 2.2 Q5.2 3.8 7.2 3.0 L8.55 2.35 9.0 1.95 9.2 1.45 M3.0 0.75 L-6.1 1.0 -6.1 1.45 -5.9 1.9 Q-5.25 2.85 -4.1 3.35 -1.85 4.2 0.55 3.8 1.65 3.55 2.5 2.6 L3.3 1.5 3.0 0.75" fill="#cccccc" fill-rule="evenodd" stroke="none"/>
      <path d="M-1.35 -0.25 L3.15 -0.25 3.1 0.05 2.85 0.45 Q2.35 1.35 1.1 1.45 -0.5 1.55 -1.3 0.25 L-1.35 0.0 -1.35 -0.25 M7.2 -0.2 Q7.25 0.65 6.5 1.1 5.35 1.75 4.5 0.8 4.1 0.35 4.25 -0.25 L7.2 -0.25 7.2 -0.2" fill="#000000" fill-rule="evenodd" stroke="none"/>
    </g>
  </defs>
</svg>
