<?xml version="1.0" encoding="UTF-8" standalone="no"?>
<svg xmlns:xlink="http://www.w3.org/1999/xlink" height="35.8px" width="32.8px" xmlns="http://www.w3.org/2000/svg">
  <g transform="matrix(1.0, 0.0, 0.0, 1.0, 16.85, 34.65)">
    <use height="31.55" transform="matrix(1.0, 0.0, 0.0, 1.0, -14.75, -30.4)" width="30.55" xlink:href="#shape0"/>
    <use height="6.1" transform="matrix(1.0, 0.0, 0.0, 1.0, -13.85, -27.5)" width="8.0" xlink:href="#sprite0"/>
    <use height="18.85" transform="matrix(1.0, 0.0, 0.0, 1.0, -9.45, -29.75)" width="16.6" xlink:href="#sprite1"/>
    <use height="14.8" transform="matrix(0.8654, 0.0, 0.0, 0.8654, 1.1173, -12.5116)" width="15.7" xlink:href="#sprite2"/>
    <use height="14.8" transform="matrix(1.0, 0.0, 0.0, 1.0, -10.9, -18.45)" width="15.7" xlink:href="#sprite2"/>
  </g>
  <defs>
    <g id="shape0" transform="matrix(1.0, 0.0, 0.0, 1.0, 14.75, 30.4)">
      <path d="M9.1 -12.75 L13.25 -12.3 15.8 -6.95 15.05 -2.5 14.65 -2.35 13.8 -1.85 Q11.9 -0.45 9.7 0.45 7.65 1.45 5.8 1.05 4.45 0.75 3.25 0.1 2.15 -0.4 1.5 -1.3 L0.9 -2.3 Q0.45 -3.15 0.3 -4.1 -0.5 -3.75 -1.3 -3.5 -3.25 -2.8 -5.55 -3.0 -7.55 -3.35 -9.3 -4.65 -11.55 -6.3 -11.85 -9.15 L-11.8 -10.75 Q-11.3 -13.45 -9.35 -15.4 L-8.35 -16.35 Q-7.55 -17.1 -6.7 -17.45 -5.25 -20.35 -7.15 -21.4 L-7.5 -20.8 -10.3 -20.6 Q-11.3 -20.95 -12.15 -21.55 L-14.05 -23.25 -14.45 -23.8 Q-15.0 -24.7 -14.5 -25.55 L-11.05 -25.9 -8.9 -27.45 -10.2 -29.85 -9.95 -30.05 -6.05 -29.85 -2.8 -28.35 Q-0.85 -27.4 0.5 -25.7 L2.65 -22.9 5.0 -20.05 9.1 -12.75 M-1.6 -18.5 L2.45 -18.1 Q0.0 -21.8 -3.55 -24.45 L-1.6 -18.5" fill="#000000" fill-rule="evenodd" stroke="none"/>
    </g>
    <g id="sprite0" transform="matrix(1.0, 0.0, 0.0, 1.0, 7.15, 0.45)">
      <use height="6.1" transform="matrix(1.0, 0.0, 0.0, 1.0, -7.15, -0.45)" width="8.0" xlink:href="#shape1"/>
    </g>
    <g id="shape1" transform="matrix(1.0, 0.0, 0.0, 1.0, 7.15, 0.45)">
      <path d="M0.55 -0.25 L0.55 -0.2 -0.5 0.4 Q-1.3 2.45 -3.3 3.35 L-4.6 3.6 Q-5.9 3.45 -6.85 2.7 L-7.1 2.75 -7.0 1.75 -6.85 1.7 Q-6.1 2.35 -5.25 2.6 L-4.1 2.1 -3.05 1.25 Q-2.2 0.4 -1.15 -0.1 L0.25 -0.45 0.55 -0.25" fill="#00cc00" fill-rule="evenodd" stroke="none"/>
      <path d="M-7.1 2.75 L-6.85 2.7 Q-5.9 3.45 -4.6 3.6 L-3.3 3.35 Q-1.3 2.45 -0.5 0.4 L0.55 -0.2 0.55 -0.25 0.85 0.2 0.75 0.5 0.75 0.6 0.2 0.8 0.15 2.4 Q0.0 3.45 -0.5 4.45 -1.3 5.8 -2.95 5.65 -5.55 5.55 -6.8 3.45 L-7.1 2.75" fill="#336600" fill-rule="evenodd" stroke="none"/>
    </g>
    <g id="sprite1" transform="matrix(1.0, 0.0, 0.0, 1.0, -0.05, 0.0)">
      <use height="18.85" transform="matrix(1.0, 0.0, 0.0, 1.0, 0.05, 0.0)" width="16.6" xlink:href="#shape2"/>
    </g>
    <g id="shape2" transform="matrix(1.0, 0.0, 0.0, 1.0, -0.05, 0.0)">
      <path d="M0.15 0.6 L8.8 4.8 11.4 8.1 12.0 9.05 12.95 10.85 14.35 13.5 15.05 15.45 15.65 18.85 15.6 18.85 15.35 18.55 Q15.05 16.35 14.35 14.25 13.4 12.25 12.1 10.35 10.85 8.6 9.4 7.0 L7.1 4.75 5.9 3.75 Q5.05 3.15 4.05 2.95 L4.35 3.6 3.3 3.2 5.75 11.85 5.3 14.05 4.25 14.4 Q5.05 13.4 4.95 12.05 L4.45 8.7 3.7 5.9 3.15 4.55 2.5 3.25 2.3 2.85 1.9 2.45 0.25 1.15 0.15 0.6" fill="#000000" fill-rule="evenodd" stroke="none"/>
      <path d="M15.65 18.85 L15.05 15.45 14.35 13.5 12.95 10.85 12.0 9.05 11.4 8.1 8.8 4.8 0.15 0.6 0.1 0.5 0.1 0.3 0.15 0.25 0.25 0.15 0.3 0.05 0.6 0.0 Q1.2 0.1 1.7 0.55 L1.75 0.6 Q4.05 1.35 6.15 2.4 7.5 3.1 8.5 4.2 L9.1 4.8 Q11.65 7.25 13.7 10.15 14.8 11.65 15.55 13.35 16.55 15.5 16.65 17.85 16.75 19.0 15.65 18.85 M5.3 14.05 L5.75 11.85 3.3 3.2 4.35 3.6 5.5 6.9 Q6.25 9.5 6.05 12.15 5.95 13.3 5.3 14.05" fill="#996600" fill-rule="evenodd" stroke="none"/>
    </g>
    <g id="sprite2" transform="matrix(1.0, 0.0, 0.0, 1.0, 8.3, 14.4)">
      <use height="14.8" transform="matrix(1.0, 0.0, 0.0, 1.0, -8.3, -14.4)" width="15.7" xlink:href="#shape3"/>
      <use height="2.2" transform="matrix(1.0, 0.0, 0.0, 1.0, -0.2, -4.55)" width="5.65" xlink:href="#shape4"/>
    </g>
    <g id="shape3" transform="matrix(1.0, 0.0, 0.0, 1.0, 8.3, 14.4)">
      <path d="M0.2 -13.65 Q2.7 -13.6 4.45 -12.0 6.25 -10.35 6.3 -8.0 6.25 -5.65 4.45 -4.0 2.6 -2.35 0.05 -2.3 -2.55 -2.35 -4.4 -4.0 -6.25 -5.65 -6.25 -8.0 -6.25 -10.35 -4.4 -12.0 L-2.95 -13.0 0.2 -13.65" fill="#ff6f6f" fill-rule="evenodd" stroke="none"/>
      <path d="M0.2 -13.65 L1.3 -14.4 2.95 -13.3 3.9 -12.9 4.7 -13.3 Q5.3 -13.15 5.75 -12.65 6.75 -11.55 6.8 -10.3 6.8 -9.7 7.1 -9.1 7.6 -8.1 7.3 -6.95 L7.05 -5.1 6.9 -3.9 6.6 -3.4 5.4 -3.5 Q3.45 -1.05 0.25 -0.1 L-1.85 0.4 Q-4.4 0.45 -6.35 -1.2 -7.75 -2.35 -8.15 -4.15 L-8.2 -6.5 -7.5 -9.0 Q-6.9 -10.5 -5.3 -11.65 L-3.75 -12.55 -2.95 -13.0 -4.4 -12.0 Q-6.25 -10.35 -6.25 -8.0 -6.25 -5.65 -4.4 -4.0 -2.55 -2.35 0.05 -2.3 2.6 -2.35 4.45 -4.0 6.25 -5.65 6.3 -8.0 6.25 -10.35 4.45 -12.0 2.7 -13.6 0.2 -13.65" fill="#9e0101" fill-rule="evenodd" stroke="none"/>
      <path d="M-1.7 -10.65 Q-1.6 -11.6 -0.85 -12.1 1.0 -12.9 2.35 -11.4 3.5 -10.2 4.0 -8.7 4.6 -6.75 3.25 -5.3 2.95 -5.0 2.45 -5.0 0.1 -5.0 -1.05 -7.1 -1.95 -8.85 -1.7 -10.65" fill="#ffffff" fill-rule="evenodd" stroke="none"/>
      <path d="M3.55 -7.65 Q2.9 -8.9 3.1 -10.25 3.2 -10.95 3.7 -11.35 5.1 -11.9 6.1 -10.8 L7.25 -8.8 Q7.75 -7.35 6.75 -6.35 6.55 -6.1 6.15 -6.1 4.4 -6.05 3.55 -7.65" fill="#ffffff" fill-rule="evenodd" stroke="none"/>
      <path d="M2.8 -8.9 L3.4 -9.9 Q4.45 -9.8 4.8 -8.5 5.15 -7.2 4.0 -6.95 L3.85 -7.0 Q3.15 -7.55 2.9 -8.6 L2.8 -8.9" fill="#000000" fill-rule="evenodd" stroke="none"/>
      <path d="M6.0 -7.7 L5.9 -7.5 5.9 -7.45 Q5.15 -6.7 4.7 -7.7 4.4 -8.4 4.75 -8.95 L4.9 -9.1 Q6.0 -8.85 6.0 -7.7" fill="#000000" fill-rule="evenodd" stroke="none"/>
    </g>
    <g id="shape4" transform="matrix(1.0, 0.0, 0.0, 1.0, 0.2, 4.55)">
      <path d="M0.05 -4.55 L0.35 -4.3 Q0.6 -3.45 1.35 -2.85 L1.95 -2.75 Q3.25 -3.8 5.0 -3.8 5.4 -3.8 5.45 -3.5 L3.3 -3.2 2.2 -2.55 1.85 -2.35 Q0.55 -2.65 -0.15 -3.85 -0.35 -4.25 0.05 -4.55" fill="#4f0000" fill-rule="evenodd" stroke="none"/>
    </g>
  </defs>
</svg>
