<?xml version="1.0" encoding="UTF-8" standalone="no"?>
<svg xmlns:xlink="http://www.w3.org/1999/xlink" height="30.9px" width="23.45px" xmlns="http://www.w3.org/2000/svg">
  <g transform="matrix(1.0, 0.0, 0.0, 1.0, 13.3, 28.45)">
    <path d="M7.1 -25.6 L7.2 -25.45 7.6 -25.0 7.55 -25.05 7.55 -25.0 7.6 -24.95 Q9.95 -22.0 10.15 -17.55 L10.15 -17.5 Q10.25 -12.15 7.05 -7.9 3.35 -3.1 -1.5 -3.15 -3.35 -3.15 -4.9 -3.75 L-6.15 -1.2 -6.0 -0.35 -6.0 -0.3 -6.05 0.2 -6.05 0.15 -6.15 0.45 -6.2 0.55 Q-6.5 1.6 -7.6 2.05 L-7.65 2.05 -7.75 2.1 -7.85 2.15 -8.0 2.2 -9.95 2.4 -10.6 2.25 -10.8 2.2 -11.2 2.0 -11.7 1.7 -11.75 1.65 -12.8 0.55 -12.85 0.45 -12.9 0.35 -13.05 0.1 -13.15 -0.2 Q-13.45 -1.1 -13.15 -1.95 L-13.1 -2.15 -13.05 -2.2 -13.05 -2.25 -13.0 -2.3 -12.85 -2.55 -12.4 -3.05 -12.3 -3.15 -12.3 -3.2 -11.3 -3.7 -10.55 -5.25 -10.55 -5.3 -9.4 -7.8 -9.55 -8.0 Q-12.0 -12.3 -10.85 -17.7 -9.85 -22.55 -6.45 -25.65 -3.35 -28.6 0.5 -28.45 4.3 -28.6 7.1 -25.6 M6.65 -24.45 L6.2 -25.0 Q3.7 -27.65 0.35 -27.55 -3.1 -27.65 -5.9 -25.0 -9.05 -22.1 -10.0 -17.6 -11.05 -12.6 -8.85 -8.6 L-8.35 -7.85 -8.5 -7.55 -8.55 -7.55 -8.6 -7.5 -9.75 -5.05 -9.8 -4.95 -10.75 -3.0 -10.75 -2.95 -10.85 -2.95 -11.1 -2.85 -11.8 -2.5 -12.2 -2.05 -12.25 -1.95 -12.3 -1.9 -12.35 -1.7 Q-12.6 -1.15 -12.3 -0.5 L-12.3 -0.45 -12.15 -0.2 -12.1 -0.1 -11.25 0.8 -10.9 1.0 -10.6 1.15 -10.5 1.15 -9.95 1.3 -8.5 1.15 -8.35 1.1 -8.2 1.05 Q-7.45 0.75 -7.25 0.05 L-7.15 -0.25 -7.35 -1.25 -7.4 -1.35 -5.5 -5.2 Q-3.8 -4.25 -1.65 -4.25 2.75 -4.25 6.1 -8.6 9.1 -12.6 9.0 -17.6 8.8 -21.7 6.65 -24.45" fill="#875101" fill-rule="evenodd" stroke="none"/>
    <path d="M-8.35 -7.85 Q-7.5 -6.65 -6.45 -5.8 L-7.35 -7.1 -8.05 -8.55 Q-9.45 -11.95 -8.95 -15.95 -8.4 -20.8 -5.05 -23.45 -1.75 -26.15 1.4 -26.15 4.55 -26.15 6.65 -24.45 8.8 -21.7 9.0 -17.6 9.1 -12.6 6.1 -8.6 2.75 -4.25 -1.65 -4.25 -3.8 -4.25 -5.5 -5.2 L-5.8 -5.35 Q-6.25 -5.3 -6.65 -4.65 L-8.0 -1.65 -8.7 -1.6 Q-8.0 -1.3 -7.9 -0.3 -7.95 0.05 -8.3 0.4 L-9.25 0.75 -9.5 0.75 -10.35 0.35 -10.75 -0.35 -10.7 -1.25 -10.05 -2.25 Q-9.5 -2.75 -9.2 -3.7 L-7.7 -6.45 -7.85 -6.75 -8.5 -7.55 -8.35 -7.85 M3.75 -22.45 L4.05 -22.1 3.9 -22.3 3.8 -22.4 3.75 -22.45 M-3.5 -8.3 Q-2.75 -7.75 -1.9 -7.4 -1.15 -6.95 -0.3 -7.05 1.9 -7.4 3.6 -8.65 5.3 -9.95 6.05 -11.2 L7.1 -13.6 Q7.45 -14.8 7.35 -16.5 8.45 -18.05 6.95 -21.2 5.45 -24.35 1.0 -25.2 -3.8 -24.8 -6.15 -20.65 -8.3 -16.7 -7.8 -12.3 L-7.65 -11.4 -6.15 -9.45 -6.15 -9.6 -5.8 -9.45 -4.85 -9.15 -4.5 -8.9 -4.25 -8.7 -3.5 -8.3" fill="#ffac00" fill-rule="evenodd" stroke="none"/>
    <path d="M-8.35 -7.85 L-8.85 -8.6 Q-11.05 -12.6 -10.0 -17.6 -9.05 -22.1 -5.9 -25.0 -3.1 -27.65 0.35 -27.55 3.7 -27.65 6.2 -25.0 L6.65 -24.45 Q4.55 -26.15 1.4 -26.15 -1.75 -26.15 -5.05 -23.45 -8.4 -20.8 -8.95 -15.95 -9.45 -11.95 -8.05 -8.55 L-7.35 -7.1 -6.45 -5.8 Q-7.5 -6.65 -8.35 -7.85 M-10.6 1.15 L-10.9 1.0 -10.85 1.0 -10.6 1.15 M-11.25 0.8 L-12.1 -0.1 -12.15 -0.2 -12.3 -0.45 -12.3 -0.5 -12.4 -1.4 -12.35 -1.7 -12.3 -1.9 -12.25 -1.95 -12.2 -2.05 -11.8 -2.5 -11.2 -2.8 -10.85 -2.95 -10.75 -2.95 -10.75 -3.0 -9.8 -4.95 -9.75 -5.05 -8.6 -7.5 -8.55 -7.55 -8.5 -7.55 -7.85 -6.75 -7.7 -6.45 -9.2 -3.7 Q-9.5 -2.75 -10.05 -2.25 L-10.7 -1.25 -10.75 -0.35 -10.35 0.35 -9.5 0.75 -10.45 0.8 -11.25 0.8 M3.9 -22.3 L4.05 -22.1 3.75 -22.45 4.9 -21.4 Q7.2 -19.4 7.35 -16.5 7.45 -14.8 7.1 -13.6 L6.05 -11.2 Q5.3 -9.95 3.6 -8.65 1.9 -7.4 -0.3 -7.05 -1.15 -6.95 -1.9 -7.4 -2.75 -7.75 -3.5 -8.3 L-1.95 -7.9 0.45 -8.75 2.25 -9.55 Q3.75 -10.3 4.6 -11.95 L5.4 -14.2 5.9 -17.8 Q5.65 -19.35 5.0 -20.65 L3.9 -22.3" fill="#ffea95" fill-rule="evenodd" stroke="none"/>
    <path d="M-7.4 -1.35 L-7.35 -1.25 -7.4 -1.3 -7.35 -1.3 -7.4 -1.35 M-12.3 -0.5 Q-12.6 -1.15 -12.35 -1.7 L-12.4 -1.4 -12.3 -0.5 M-11.8 -2.5 L-11.1 -2.85 -10.85 -2.95 -11.2 -2.8 -11.8 -2.5" fill="#ffcc00" fill-rule="evenodd" stroke="none"/>
    <path d="M-5.5 -5.2 L-7.4 -1.35 -7.35 -1.3 -7.4 -1.3 -7.35 -1.25 -7.15 -0.25 -7.25 0.05 Q-7.45 0.75 -8.2 1.05 L-8.35 1.1 -8.5 1.15 -9.95 1.3 -10.5 1.15 -10.6 1.15 -10.85 1.0 -10.9 1.0 -11.25 0.8 -10.45 0.8 -9.5 0.75 -9.25 0.75 -8.3 0.4 Q-7.95 0.05 -7.9 -0.3 -8.0 -1.3 -8.7 -1.6 L-8.0 -1.65 -6.65 -4.65 Q-6.25 -5.3 -5.8 -5.35 L-5.5 -5.2 M3.75 -22.45 L3.8 -22.4 3.1 -22.95 1.0 -23.8 0.3 -23.9 -0.65 -23.85 -2.1 -23.2 Q-6.05 -20.55 -7.15 -15.85 L-7.2 -13.75 -7.05 -13.0 -6.95 -12.6 -6.9 -12.45 -5.8 -10.2 -4.85 -9.15 -5.8 -9.45 -6.15 -9.6 -6.15 -9.45 -7.65 -11.4 -7.8 -12.3 Q-8.3 -16.7 -6.15 -20.65 -3.8 -24.8 1.0 -25.2 5.45 -24.35 6.95 -21.2 8.45 -18.05 7.35 -16.5 7.2 -19.4 4.9 -21.4 L3.75 -22.45" fill="#bf9900" fill-rule="evenodd" stroke="none"/>
    <path d="M3.8 -22.4 L3.9 -22.3 5.0 -20.65 Q5.65 -19.35 5.9 -17.8 L-1.95 -7.9 -3.5 -8.3 -4.25 -8.7 -4.5 -8.9 -4.85 -9.15 -5.8 -10.2 3.1 -22.95 3.8 -22.4 M0.3 -23.9 L1.0 -23.8 0.85 -23.6 0.3 -23.9 M-7.2 -13.75 L-6.3 -14.05 -7.05 -13.0 -7.2 -13.75" fill="#abeefe" fill-rule="evenodd" stroke="none"/>
    <path d="M0.3 -23.9 L0.85 -23.6 1.05 -23.15 -6.95 -12.6 -7.05 -13.0 -6.3 -14.05 -7.2 -13.75 -7.15 -15.85 -0.65 -23.85 0.3 -23.9" fill="#c2e0e7" fill-rule="evenodd" stroke="none"/>
    <path d="M5.9 -17.8 L5.4 -14.2 4.6 -11.95 Q3.75 -10.3 2.25 -9.55 L0.45 -8.75 -1.95 -7.9 5.9 -17.8 M0.85 -23.6 L1.0 -23.8 3.1 -22.95 -5.8 -10.2 -6.9 -12.45 -6.95 -12.6 1.05 -23.15 0.85 -23.6 M-7.15 -15.85 Q-6.05 -20.55 -2.1 -23.2 L-0.65 -23.85 -7.15 -15.85" fill="#ffffff" fill-rule="evenodd" stroke="none"/>
  </g>
</svg>
