<?xml version="1.0" encoding="UTF-8" standalone="no"?>
<svg xmlns:xlink="http://www.w3.org/1999/xlink" height="28.55px" width="28.35px" xmlns="http://www.w3.org/2000/svg">
  <g transform="matrix(1.0, 0.0, 0.0, 1.0, 14.0, 27.75)">
    <path d="M-0.8 -27.6 L-0.45 -27.35 -0.3 -27.55 0.35 -27.75 Q3.7 -27.7 6.5 -26.3 L6.9 -25.9 7.1 -25.95 7.8 -25.9 8.3 -25.35 8.35 -25.1 10.15 -23.55 Q14.35 -19.4 14.35 -13.45 L14.25 -11.45 14.0 -10.9 Q12.7 -9.45 13.05 -7.85 L12.95 -7.15 12.65 -6.65 Q11.65 -4.9 10.15 -3.35 L7.85 -1.45 7.3 -1.3 7.1 -1.3 6.95 -1.0 6.6 -0.7 Q3.65 0.8 0.1 0.8 L0.05 0.8 -0.5 0.6 -0.75 0.35 -1.25 0.55 -1.35 0.55 -1.55 0.65 -2.0 0.7 Q-5.8 0.15 -8.8 -2.3 L-9.15 -2.8 -9.15 -2.85 -9.75 -3.1 -10.0 -3.3 -10.05 -3.35 Q-13.0 -6.35 -13.65 -10.3 L-13.7 -10.35 -13.95 -10.75 -14.0 -11.25 -13.8 -12.2 -13.85 -12.1 Q-13.65 -14.8 -13.9 -15.45 L-14.0 -16.1 -13.7 -17.3 -13.75 -17.25 Q-12.8 -20.8 -10.05 -23.55 -6.3 -27.25 -1.25 -27.7 L-0.8 -27.6" fill="#000000" fill-rule="evenodd" stroke="none"/>
    <path d="M7.05 -24.6 L3.8 -23.0 3.35 -19.1 0.7 -18.75 0.6 -18.8 Q-0.15 -19.4 -0.55 -19.4 L-2.1 -16.75 -2.65 -15.45 -2.5 -15.65 -5.4 -16.0 -7.95 -16.3 Q-8.4 -16.3 -8.4 -16.1 L-8.35 -16.0 -8.8 -16.1 -9.1 -17.25 -11.6 -16.5 -12.85 -11.8 -8.85 -9.85 -8.3 -11.75 -7.4 -11.75 -6.75 -12.2 -6.75 -11.35 -8.05 -10.8 -8.25 -9.65 -9.15 -9.2 Q-9.65 -9.2 -10.55 -9.9 L-10.85 -9.7 -10.1 -8.6 -9.25 -7.65 -7.4 -6.95 -6.75 -5.95 -8.2 -2.85 Q-7.9 -3.65 -9.05 -3.6 L-7.9 -5.9 -12.7 -10.6 -13.0 -10.9 -12.85 -11.8 Q-12.6 -14.95 -13.0 -15.75 L-12.75 -16.8 -12.55 -17.2 Q-12.15 -17.65 -11.6 -17.75 L-11.5 -17.85 -11.4 -17.75 -8.9 -18.0 -8.4 -17.1 -2.75 -16.9 -0.05 -22.6 -1.5 -23.55 -1.2 -26.5 0.3 -26.55 -0.9 -24.15 Q0.05 -23.95 0.7 -23.35 L0.95 -22.7 Q0.95 -21.3 0.25 -20.0 L2.55 -20.0 2.9 -23.2 6.05 -25.2 Q6.0 -24.6 6.9 -24.7 L7.35 -24.8 7.05 -24.6 M0.05 -18.65 L-0.4 -17.95 -0.25 -18.15 -0.15 -18.4 -0.15 -18.35 0.05 -18.65 M-3.25 -13.7 L1.85 -11.4 1.5 -10.8 1.5 -10.85 -0.5 -11.85 -2.6 -12.9 -3.0 -12.8 -4.0 -13.3 -6.55 -12.3 -4.4 -13.75 -4.3 -14.45 -4.0 -15.05 -3.4 -14.75 -3.45 -14.65 -3.6 -14.45 -3.7 -14.05 Q-3.7 -13.7 -3.3 -13.7 L-3.25 -13.7 M1.4 -10.65 L1.15 -10.2 Q2.6 -9.4 4.4 -9.15 7.95 -9.2 11.5 -10.2 L13.25 -11.35 Q11.55 -9.5 12.05 -7.45 L11.8 -6.9 10.7 -8.95 4.15 -8.1 3.35 -6.6 7.35 -4.35 7.25 -2.05 Q6.3 -2.65 6.1 -1.4 L6.15 -4.0 3.8 -4.95 3.9 -4.15 0.05 0.0 Q-0.2 -0.85 -1.7 -0.2 L-0.65 -0.85 Q-0.05 -0.85 1.45 -2.55 L3.55 -4.55 3.25 -5.4 2.7 -5.9 3.05 -6.75 3.75 -8.35 3.95 -8.35 Q5.3 -8.35 5.3 -8.7 L5.25 -8.85 3.6 -8.9 3.05 -9.0 2.75 -9.0 1.05 -10.25 1.1 -10.35 1.4 -10.65 M-6.5 -15.65 L-6.2 -15.65 -6.1 -15.6 -6.5 -15.65" fill="#684420" fill-rule="evenodd" stroke="none"/>
    <path d="M7.05 -24.6 L9.45 -22.65 Q13.4 -18.75 13.4 -13.3 L13.25 -11.35 11.5 -10.2 Q7.95 -9.2 4.4 -9.15 2.6 -9.4 1.15 -10.2 L1.4 -10.65 1.5 -10.8 1.85 -11.4 -3.25 -13.7 -3.35 -13.75 -2.45 -15.3 -2.35 -15.85 -1.75 -16.0 -0.4 -17.95 0.05 -18.65 0.5 -18.7 0.7 -18.75 3.35 -19.1 3.8 -23.0 7.05 -24.6 M11.8 -6.9 L9.45 -3.9 Q8.4 -2.85 7.25 -2.05 L7.35 -4.35 3.35 -6.6 4.15 -8.1 10.7 -8.95 11.8 -6.9 M6.1 -1.4 Q3.35 0.0 0.1 0.0 L0.05 0.0 3.9 -4.15 3.8 -4.95 6.15 -4.0 6.1 -1.4 M-1.7 -0.2 L-1.9 -0.1 Q-5.4 -0.6 -8.2 -2.85 L-6.75 -5.95 -7.4 -6.95 -8.4 -8.45 -8.25 -9.65 -8.05 -10.8 -6.75 -11.35 -6.75 -12.2 -7.4 -11.75 -8.3 -11.75 -8.85 -9.85 -12.85 -11.8 -11.6 -16.5 -9.1 -17.25 -8.8 -16.1 -8.35 -16.0 -6.6 -15.65 -6.5 -15.65 -6.1 -15.6 -6.05 -15.6 -3.95 -15.2 -4.0 -15.05 -4.3 -14.45 -4.4 -13.75 -6.55 -12.3 -4.0 -13.3 -3.0 -12.8 -0.35 -11.35 1.05 -10.25 2.75 -9.0 3.25 -8.6 Q2.4 -7.4 2.3 -6.1 L2.3 -5.2 2.25 -4.65 Q1.7 -2.8 0.35 -1.75 L0.0 -1.5 -0.65 -0.85 -1.7 -0.2 M-9.05 -3.6 L-9.35 -3.9 Q-12.2 -6.75 -12.7 -10.6 L-7.9 -5.9 -9.05 -3.6 M-12.75 -16.8 Q-11.9 -20.1 -9.35 -22.65 -5.9 -26.1 -1.2 -26.5 L-1.5 -23.55 -0.05 -22.6 -2.75 -16.9 -8.4 -17.1 -8.9 -18.0 -11.4 -17.75 -11.5 -17.85 -11.6 -17.75 Q-12.15 -17.65 -12.55 -17.2 L-12.75 -16.8 M0.3 -26.55 Q3.4 -26.5 6.05 -25.2 L2.9 -23.2 2.55 -20.0 0.25 -20.0 Q0.95 -21.3 0.95 -22.7 L0.7 -23.35 Q0.05 -23.95 -0.9 -24.15 L0.3 -26.55" fill="#9c6630" fill-rule="evenodd" stroke="none"/>
    <path d="M0.7 -18.75 L0.5 -18.7 0.6 -18.8 0.7 -18.75 M-3.45 -14.65 L-3.6 -14.45 -3.45 -14.65" fill="#4f3317" fill-rule="evenodd" stroke="none"/>
    <path d="M0.5 -18.7 L0.05 -18.65 -0.15 -18.35 -0.15 -18.4 -0.25 -18.15 -0.4 -17.95 -1.75 -16.0 -2.35 -15.85 -2.45 -15.3 -3.35 -13.75 -3.25 -13.7 -3.3 -13.7 Q-3.7 -13.7 -3.7 -14.05 L-3.6 -14.45 -3.45 -14.65 -3.4 -14.75 -4.0 -15.05 -3.95 -15.2 -6.05 -15.6 -6.1 -15.6 -6.2 -15.65 -6.5 -15.65 -6.6 -15.65 -8.35 -16.0 -8.4 -16.1 Q-8.4 -16.3 -7.95 -16.3 L-5.4 -16.0 -2.5 -15.65 -2.65 -15.45 -2.1 -16.75 -0.55 -19.4 Q-0.15 -19.4 0.6 -18.8 L0.5 -18.7 M1.5 -10.8 L1.4 -10.65 1.1 -10.35 1.05 -10.25 -0.35 -11.35 -3.0 -12.8 -2.6 -12.9 -0.5 -11.85 1.5 -10.85 1.5 -10.8 M2.75 -9.0 L3.05 -9.0 3.6 -8.9 5.25 -8.85 5.3 -8.7 Q5.3 -8.35 3.95 -8.35 L3.75 -8.35 3.05 -6.75 2.7 -5.9 3.25 -5.4 3.55 -4.55 1.45 -2.55 Q-0.05 -0.85 -0.65 -0.85 L0.0 -1.5 0.35 -1.75 Q1.7 -2.8 2.25 -4.65 L2.3 -5.2 2.3 -6.1 Q2.4 -7.4 3.25 -8.6 L2.75 -9.0 M-8.25 -9.65 L-8.4 -8.45 -7.4 -6.95 -9.25 -7.65 -10.1 -8.6 -10.85 -9.7 -10.55 -9.9 Q-9.65 -9.2 -9.15 -9.2 L-8.25 -9.65" fill="#472f16" fill-rule="evenodd" stroke="none"/>
    <path d="M1.55 -23.75 Q1.4 -23.5 0.9 -23.5 0.2 -23.5 0.0 -24.55 0.0 -25.75 1.0 -25.75 L1.65 -25.6 Q1.0 -25.45 1.0 -24.65 0.95 -23.8 1.55 -23.75 M8.0 -20.25 L7.7 -20.5 7.6 -20.5 7.5 -20.55 7.25 -20.6 6.9 -20.65 6.85 -20.65 6.75 -20.65 6.7 -20.65 6.5 -20.65 6.45 -20.65 5.2 -20.15 Q4.9 -19.9 4.9 -19.4 L5.0 -18.9 Q4.85 -18.75 4.6 -18.75 L4.1 -19.4 Q4.1 -21.05 6.3 -21.05 7.95 -21.05 8.0 -20.25 M3.7 -15.2 L3.85 -14.4 Q3.85 -13.35 2.7 -13.35 1.45 -13.35 1.5 -14.3 1.5 -14.9 1.8 -15.25 L1.75 -15.05 Q1.75 -14.15 2.7 -14.15 3.7 -14.15 3.7 -15.1 L3.7 -15.2 M7.8 -13.25 L8.0 -13.45 Q8.75 -13.45 8.75 -12.65 8.75 -12.0 8.0 -12.0 L7.6 -12.25 Q7.95 -12.35 7.95 -12.75 L7.8 -13.25 M8.35 -5.8 L8.4 -5.8 Q9.1 -5.8 9.1 -6.45 9.1 -7.1 8.45 -7.1 L8.2 -7.1 8.75 -7.25 Q9.7 -7.25 9.7 -6.55 9.7 -5.7 8.75 -5.7 L8.35 -5.8 M-0.5 -8.9 L0.05 -8.7 Q0.55 -8.7 0.55 -9.2 L0.75 -8.75 Q0.75 -8.05 0.0 -8.05 -0.6 -8.05 -0.55 -8.6 L-0.5 -8.9 M4.15 -3.1 Q4.55 -3.1 4.65 -2.4 4.65 -1.45 3.75 -1.45 L3.1 -2.05 Q3.1 -3.1 4.15 -3.1 M3.7 -2.7 Q3.2 -2.7 3.2 -2.2 L3.7 -1.7 Q4.15 -1.7 4.15 -2.15 4.2 -2.7 3.7 -2.7 M-3.2 -21.5 L-3.1 -21.25 Q-3.1 -20.7 -3.75 -20.7 -4.1 -20.7 -4.9 -21.5 -4.9 -22.1 -4.3 -22.15 L-4.45 -21.8 Q-4.4 -21.2 -3.9 -21.2 -3.35 -21.2 -3.2 -21.5 M-7.5 -13.0 L-7.35 -12.75 Q-7.35 -12.3 -7.85 -12.3 -10.2 -12.3 -10.2 -13.7 L-9.95 -14.3 -9.85 -14.1 -9.75 -13.95 Q-8.95 -12.75 -8.1 -12.75 -7.65 -12.75 -7.5 -13.0 M-2.75 -6.25 L-2.45 -5.85 Q-2.45 -5.55 -3.25 -5.1 L-4.4 -4.65 Q-5.85 -4.65 -5.85 -5.5 L-5.65 -5.9 Q-5.2 -5.45 -4.45 -5.45 -3.15 -5.45 -2.75 -6.25" fill="#684420" fill-rule="evenodd" stroke="none"/>
    <path d="M1.65 -25.6 L1.95 -25.65 Q2.85 -25.65 2.9 -24.65 2.9 -23.6 2.2 -23.6 L1.6 -23.75 1.55 -23.75 Q0.95 -23.8 1.0 -24.65 1.0 -25.45 1.65 -25.6 M1.4 -24.85 Q1.4 -24.3 2.05 -24.3 2.6 -24.3 2.6 -24.9 2.55 -25.45 2.05 -25.45 L1.8 -25.4 Q1.4 -25.3 1.4 -24.85 M5.0 -18.9 L4.9 -19.4 Q4.9 -19.9 5.2 -20.15 L4.9 -19.55 5.15 -19.3 5.3 -19.1 Q7.75 -19.1 8.25 -19.85 L8.25 -19.65 Q8.25 -18.5 5.95 -18.5 5.25 -18.5 5.0 -18.9 M1.8 -15.25 Q2.05 -15.65 2.7 -15.65 L3.45 -15.45 3.7 -15.2 3.7 -15.1 Q3.7 -14.15 2.7 -14.15 1.75 -14.15 1.75 -15.05 L1.8 -15.25 M7.6 -12.25 L7.35 -12.2 Q6.65 -12.2 6.65 -12.8 6.65 -13.35 7.4 -13.35 L7.8 -13.25 7.95 -12.75 Q7.95 -12.35 7.6 -12.25 M8.2 -7.1 L8.45 -7.1 Q9.1 -7.1 9.1 -6.45 9.1 -5.8 8.4 -5.8 L8.35 -5.8 Q7.75 -5.85 7.75 -6.4 7.75 -6.95 8.2 -7.1 M0.55 -9.2 Q0.55 -8.7 0.05 -8.7 L-0.5 -8.9 -0.55 -9.35 Q-0.6 -9.8 -0.1 -9.8 0.5 -9.8 0.55 -9.25 L0.55 -9.2 M3.7 -2.7 Q4.2 -2.7 4.15 -2.15 4.15 -1.7 3.7 -1.7 L3.2 -2.2 Q3.2 -2.7 3.7 -2.7 M-4.3 -22.15 L-3.7 -22.45 -3.15 -21.85 -3.2 -21.5 Q-3.35 -21.2 -3.9 -21.2 -4.4 -21.2 -4.45 -21.8 L-4.3 -22.15 M-3.9 -22.1 L-4.0 -22.0 -3.95 -21.85 -3.65 -21.8 -3.5 -21.85 -3.45 -22.05 -3.7 -22.3 -3.9 -22.1 M-8.8 -14.9 L-8.25 -14.4 -7.4 -13.45 -7.5 -13.0 Q-7.65 -12.75 -8.1 -12.75 -8.95 -12.75 -9.75 -13.95 L-9.45 -13.95 -9.25 -13.95 Q-8.7 -14.05 -8.7 -14.5 L-8.8 -14.9 M-9.95 -14.3 L-10.3 -14.9 -9.85 -15.35 -9.15 -15.15 -9.8 -15.25 -10.25 -14.8 -9.95 -14.3 M-5.4 -8.05 L-4.8 -8.1 -4.3 -8.1 Q-2.85 -8.1 -2.6 -7.0 -2.6 -6.55 -2.75 -6.25 -3.15 -5.45 -4.45 -5.45 -5.2 -5.45 -5.65 -5.9 -6.15 -6.3 -6.35 -7.15 L-6.1 -7.75 -6.2 -7.4 Q-6.2 -6.55 -4.55 -6.55 -3.25 -6.55 -3.25 -7.25 -3.25 -8.05 -5.35 -8.05 L-5.4 -8.05" fill="#f19c1f" fill-rule="evenodd" stroke="none"/>
    <path d="M1.4 -24.85 Q1.4 -25.3 1.8 -25.4 L2.05 -25.45 Q2.55 -25.45 2.6 -24.9 2.6 -24.3 2.05 -24.3 1.4 -24.3 1.4 -24.85 M5.2 -20.15 L6.45 -20.65 6.5 -20.65 6.7 -20.65 6.75 -20.65 6.85 -20.65 6.9 -20.65 7.25 -20.6 7.5 -20.55 7.6 -20.5 7.7 -20.5 8.0 -20.25 8.15 -20.05 8.25 -19.85 Q7.75 -19.1 5.3 -19.1 L5.15 -19.3 4.9 -19.55 5.2 -20.15 M-3.9 -22.1 L-3.7 -22.3 -3.45 -22.05 -3.5 -21.85 -3.65 -21.8 -3.95 -21.85 -4.0 -22.0 -3.9 -22.1 M-9.15 -15.15 L-8.85 -14.9 -8.8 -14.9 -8.7 -14.5 Q-8.7 -14.05 -9.25 -13.95 L-9.45 -13.95 -9.75 -13.95 -9.85 -14.1 -9.95 -14.3 -10.25 -14.8 -9.8 -15.25 -9.15 -15.15 M-6.1 -7.75 L-5.4 -8.05 -5.35 -8.05 Q-3.25 -8.05 -3.25 -7.25 -3.25 -6.55 -4.55 -6.55 -6.2 -6.55 -6.2 -7.4 L-6.1 -7.75" fill="#f3de1d" fill-rule="evenodd" stroke="none"/>
  </g>
</svg>
