<?xml version="1.0" encoding="UTF-8" standalone="no"?>
<svg
   xmlns:dc="http://purl.org/dc/elements/1.1/"
   xmlns:cc="http://creativecommons.org/ns#"
   xmlns:rdf="http://www.w3.org/1999/02/22-rdf-syntax-ns#"
   xmlns:svg="http://www.w3.org/2000/svg"
   xmlns="http://www.w3.org/2000/svg"
   xmlns:sodipodi="http://sodipodi.sourceforge.net/DTD/sodipodi-0.dtd"
   xmlns:inkscape="http://www.inkscape.org/namespaces/inkscape"
   height="33.0px"
   width="30.55px"
   version="1.1"
   id="svg6"
   sodipodi:docname="2543.svg"
   inkscape:version="0.92.1 r15371">
  <metadata
     id="metadata12">
    <rdf:RDF>
      <cc:Work
         rdf:about="">
        <dc:format>image/svg+xml</dc:format>
        <dc:type
           rdf:resource="http://purl.org/dc/dcmitype/StillImage" />
        <dc:title></dc:title>
      </cc:Work>
    </rdf:RDF>
  </metadata>
  <defs
     id="defs10" />
  <sodipodi:namedview
     pagecolor="#ffffff"
     bordercolor="#666666"
     borderopacity="1"
     objecttolerance="10"
     gridtolerance="10"
     guidetolerance="10"
     inkscape:pageopacity="0"
     inkscape:pageshadow="2"
     inkscape:window-width="1920"
     inkscape:window-height="1016"
     id="namedview8"
     showgrid="false"
     inkscape:zoom="14.30303"
     inkscape:cx="31.86262"
     inkscape:cy="14.816341"
     inkscape:window-x="0"
     inkscape:window-y="27"
     inkscape:window-maximized="1"
     inkscape:current-layer="svg6" />
  <g
     transform="matrix(1.0, 0.0, 0.0, 1.0, 14.4, 31.35)"
     id="g4">
    <path
       d="M7.95 -30.65 Q9.15 -31.1 10.45 -31.35 L10.7 -31.3 10.85 -31.25 11.6 -30.65 11.75 -30.45 11.8 -30.25 11.85 -30.15 12.1 -29.1 12.6 -29.1 12.8 -29.05 14.2 -28.35 15.0 -27.65 15.1 -27.4 15.1 -27.2 14.85 -26.5 15.5 -25.5 15.5 -25.45 Q15.8 -24.85 15.6 -24.25 L15.45 -24.1 Q14.35 -23.0 12.7 -22.7 L10.55 -22.15 10.6 -22.15 8.2 -21.1 11.95 -18.2 Q13.15 -17.3 14.05 -15.9 L14.85 -14.4 15.25 -13.55 Q16.55 -11.0 16.0 -8.2 15.45 -5.3 13.7 -3.15 11.9 -1.05 9.3 -0.05 L9.3 -0.1 Q5.4 1.6 1.05 1.65 L-2.7 1.3 Q-7.65 0.1 -11.25 -3.5 L-12.15 -4.6 -13.5 -7.15 Q-14.1 -8.55 -14.3 -10.0 -14.7 -13.25 -13.05 -15.95 -11.8 -18.05 -9.95 -19.55 L-9.95 -19.6 -7.05 -21.35 Q-2.95 -23.4 1.7 -23.85 3.25 -28.95 7.95 -30.65"
       fill="#430101"
       fill-rule="evenodd"
       stroke="none"
       id="path2" />
  </g>
  <g
     transform="translate(15.125636,16.544703)"
     id="g26">
    <path
       d="m 11.8,-13.75 1.3,0.65 0.7,0.6 -0.3,0.9 0.75,1.2 0.05,0.8 q -1,1 -2.5,1.25 l -2.2,0.55 -3.1,1.45 4.35,3.4 Q 12,-2.1 12.8,-0.8 L 13.6,0.65 14,1.5 q 1.2,2.4 0.7,5.05 -0.5,2.75 -2.2,4.8 -1.7,2 -4.2,2.95 Q 4.5,15.95 0.25,16 L -3.4,15.65 Q -8.2,14.5 -11.7,11 L -12.55,9.95 -13.85,7.5 -14.6,4.75 q -0.4,-3.05 1.15,-5.6 1.25,-2 3,-3.5 1.3,-1.05 2.8,-1.7 4.2,-2.1 8.9,-2.5 1.45,-5.1 6.05,-6.8 l 2.45,-0.65 0.75,0.6 0.05,0.2 0.3,1.45 h 0.95"
       id="path14"
       inkscape:connector-curvature="0"
       style="fill:#000000;fill-rule:evenodd;stroke:none" />
    <path
       d="m 2.45,-10.2 0.35,-0.95 1.9,-2.2 0.8,-0.55 q 1.9,-1.2 4.1,-1.65 l 0.45,0.35 -0.05,2.1 0.9,-0.15 q 1.65,-0.25 2.4,0.8 l -0.4,0.85 1,1.45 -0.05,0.1 q -0.05,0.4 -0.55,0.6 l -1.6,0.6 -2.3,0.4 L 8.4,-8 8.3,-7.95 8.25,-8 7.8,-8.15 6.55,-8.1 q -3.5,1.8 -4.2,-1.6 l 0.05,-0.1 0.05,-0.4 m 3.5,4 0.9,0.8 3.65,2.9 q 0.7,0.4 1.2,1 L 12.35,-0.55 11.8,-1.35 11.95,2 10.9,4.5 Q 10,6.15 8.45,7.05 q -3.3,1.9 -7,2.5 -5.55,0.9 -9.9,-1.9 -4.7,-3.1 -4.55,-8.25 l 1.75,-2.3 2.4,-2 1.35,-0.8 q 4.15,-2.1 8.9,-2.35 l 0.4,1.6 q 2.15,1.85 4.45,0.5 L 5.95,-6.2 m 3.2,-7.7 -1.15,0.55 q -2.4,1.3 -3.1,3.7 l -0.8,0.7 -0.05,0.2 0.1,0.3 q 1,0.3 1.9,-0.25 L 6.8,-8.2 H 7.7 L 7.8,-8.4 7,-9.3 q 1.75,-1.2 4.1,-1 l 0.15,-0.15 0.05,-0.35 q -0.55,-0.3 -0.1,-0.4 l 0.15,-0.2 0.05,-0.3 q -1.7,-0.6 -3.7,0.4 l 0.8,-0.55 q 1.3,-1.1 0.65,-2.05 m -8.9,17 Q 1.15,2.15 1.1,0.85 0.95,-4.3 -4.3,-5.65 q -5.15,1.4 -5.75,6.7 -0.4,3.7 3.3,3.55 3.8,1.8 7,-1.5"
       id="path16"
       inkscape:connector-curvature="0"
       style="fill:#ffea95;fill-rule:evenodd;stroke:none" />
    <path
       d="M 2.45,-10.2 2.4,-9.8 2.35,-9.7 q 0.7,3.4 4.2,1.6 L 7.8,-8.15 8.25,-8 l 0.05,0.05 -2.65,1.5 0.3,0.25 0.3,0.25 Q 3.95,-4.6 1.8,-6.45 l -0.4,-1.6 h 0.2 l 0.85,-2.15 m 9.9,9.65 0.85,1.35 0.25,0.55 V 1.4 l 0.15,0.3 q 1.35,3.15 0.2,6.3 -0.75,2.15 -2.55,3.8 L 9.75,13 q -1.65,0.9 -3.45,1.45 -2.4,0.9 -4.95,0.9 l -4.65,-0.2 q -2.45,-0.6 -4.6,-1.85 -1.9,-1.1 -3.45,-2.65 l -1.7,-2.1 q -1.4,-2.4 -1.2,-5.2 l 0.4,-2.15 0.05,-0.1 0.8,-1.7 q -0.15,5.15 4.55,8.25 4.35,2.8 9.9,1.9 3.7,-0.6 7,-2.5 Q 10,6.15 10.9,4.5 L 11.95,2 11.8,-1.35 l 0.55,0.8 M 9.15,-13.9 q 0.65,0.95 -0.65,2.05 l -0.8,0.55 q 2,-1 3.7,-0.4 l -0.05,0.3 -0.15,0.2 q -0.45,0.1 0.1,0.4 l -0.05,0.35 -0.15,0.15 q -2.35,-0.2 -4.1,1 l 0.8,0.9 -0.1,0.2 H 6.8 L 6.05,-8.7 q -0.9,0.55 -1.9,0.25 l -0.1,-0.3 0.05,-0.2 0.8,-0.7 q 0.7,-2.4 3.1,-3.7 l 1.15,-0.55"
       id="path18"
       inkscape:connector-curvature="0"
       style="fill:#ddbc95;fill-rule:evenodd;stroke:none" />
    <path
       d="m 0.25,3.1 q -3.2,3.3 -7,1.5 -3.7,0.15 -3.3,-3.55 0.6,-5.3 5.75,-6.7 5.25,1.35 5.4,6.5 0.05,1.3 -0.85,2.25"
       id="path20"
       inkscape:connector-curvature="0"
       style="fill:#fff3ce;fill-rule:evenodd;stroke:none" />
    <path
       d="m 0.8,-5.3 h 0.05 l 0.15,2.1 0.3,-0.05 1.35,0.1 0.1,-1.05 v -0.05 l 0.05,-0.1 h 0.05 l 0.1,-0.05 0.1,0.05 0.05,0.05 0.3,1.4 q 0.9,0.35 1.7,1.15 0.75,0.8 0.3,1.65 Q 5.3,0.05 5.15,0 4.65,-0.2 4.35,-0.7 L 4.1,-1 3.45,-1.45 3.4,-0.05 v 0.6 L 3.55,3.45 3.7,3.5 Q 5.2,4.1 5.55,5.65 6.05,7.4 4.95,8.9 4.15,10 3,10.5 L 2.8,11.95 2.6,12.1 Q 1.85,12.05 1.9,11.2 V 10.85 L 1.2,10.9 H 0.7 L 0.5,12.2 0.2,12.35 Q -0.4,12.2 -0.4,11.5 l 0.05,-0.8 Q -1.3,10.4 -2.1,9.7 -3.05,8.9 -2.45,7.9 l 0.3,-0.05 0.8,0.9 0.45,0.4 0.65,0.3 L 0,4.05 Q -2.25,3.85 -2.95,1.65 L -3,0.8 q 0.1,-1.9 1.7,-3.1 l 1.5,-0.8 q 0,-1.15 0.3,-2.2 L 0.65,-5.35 0.8,-5.3 m 0.3,3.35 V 1 L 1.05,2.95 2.5,3.15 V 1.65 L 2.55,-1.8 1.1,-1.95 M 2.45,4.15 1,4.05 0.8,7.35 0.7,9.65 2,9.6 2.4,4.85 2.5,4.15 H 2.45 M 3.15,9.1 Q 4.55,8.25 4.5,6.55 4.45,5.2 3.55,4.6 L 3.4,6.9 3.25,8.45 3.15,9.1 M 0.05,2.9 0.2,-1.75 q -1.25,0.4 -1.75,1.6 -0.85,2.1 1.2,3.1 L 0.05,2.9"
       id="path22"
       inkscape:connector-curvature="0"
       style="fill:#006600;fill-rule:evenodd;stroke:none" />
    <path
       d="M 6,-8.55 6.75,-7.5 6.2,-6.5 6.3,-7.7 5.6,-8.25 5.1,-7.95 5,-7.8 H 4.85 L 3.85,-8.55 2.3,-9.3 1.9,-10 q 0.8,0.05 1.45,0.5 l 1.2,0.65 q 0.9,-2.3 3.15,-3.5 L 5.4,-9.2 7.9,-10.05 7.3,-9.6 5.5,-8.7 6,-8.55 M 6,-6.2 5.2,-6.25 Q 4.6,-6.6 5.05,-6.95 L 6,-6.6 q 0.3,0.3 0,0.4 M 1.65,-8.25 q 0.25,1.55 1.6,2.4 L 4.1,-5.5 Q 2.05,-5.55 1.45,-7.5 1.3,-8 1.45,-8.4 l 0.2,0.15 M 7.5,6.05 7.35,3.4 6.25,3.55 7.8,3.15 7.4,3.4 7.8,5.8 V 5.85 H 9.45 L 9.5,4.95 9.65,6.35 9.45,5.95 7.5,6.05 M 10.45,5 10.65,5.65 10.7,5.6 h 0.9 L 11.5,3.55 q 0.8,1.1 0.4,2.5 L 11.75,6.2 11.65,6 11.6,5.85 10.65,5.9 10.4,6.75 10.3,4.75 10.45,5 M 11.2,2.9 11.15,2.8 Q 11.1,1.1 10.55,-0.2 11.7,1.2 11.4,3 h 0.5 L 10.95,3.35 10.85,3.25 11.25,3 11.2,2.9 M 8.8,-1.9 9.3,-0.55 10.6,-0.3 9.35,-0.2 9.2,0.5 8.8,-1.9 M 6.3,-0.4 7.35,-0.6 7.85,-0.45 7.6,-1.8 h 0.1 l 0.35,0.85 0.2,0.8 L 8.2,0.35 7.9,-0.3 6.55,0.05 7.05,2.4 7.6,2.55 5.85,2.8 6.9,2.45 6.15,0 6.3,-0.4"
       id="path24"
       inkscape:connector-curvature="0"
       style="fill:#000000;fill-rule:evenodd;stroke:none" />
  </g>
</svg>
