<?xml version="1.0" encoding="UTF-8" standalone="no"?>
<svg xmlns:xlink="http://www.w3.org/1999/xlink" height="25.7px" width="44.15px" xmlns="http://www.w3.org/2000/svg">
  <g transform="matrix(1.0, 0.0, 0.0, 1.0, 19.8, 25.4)">
    <path d="M8.15 -25.4 Q9.5 -25.6 20.5 -19.65 L20.55 -19.6 Q24.3 -18.45 24.35 -15.45 L24.35 -12.1 Q24.35 -9.05 23.85 -7.7 L23.85 -7.45 Q24.0 -5.2 10.7 -3.3 L10.6 -3.3 Q1.25 -0.7 -1.1 -0.6 L-4.25 0.3 -4.75 0.25 -5.5 0.0 -5.95 -0.15 -6.15 -0.3 -6.1 -0.25 -6.7 -0.65 -19.3 -8.0 -19.65 -8.35 -19.8 -8.8 -19.8 -9.95 -19.65 -10.4 -19.65 -10.45 -19.3 -10.8 -19.3 -10.85 6.1 -24.65 6.15 -24.65 Q6.75 -25.3 8.1 -25.4 L8.15 -25.4" fill="#000000" fill-rule="evenodd" stroke="none"/>
    <path d="M9.95 -15.2 Q10.25 -14.55 11.1 -14.55 12.75 -14.55 13.0 -15.75 L13.05 -16.3 Q13.0 -17.4 12.0 -17.4 9.8 -17.4 9.8 -16.1 9.8 -15.55 9.95 -15.2 M19.65 -15.8 L17.45 -14.55 12.9 -11.9 12.9 -11.85 12.85 -11.8 5.9 -7.75 5.4 -7.5 -3.2 -2.45 -5.2 -1.25 -5.8 -1.5 -5.85 -1.55 -18.7 -9.05 -18.7 -10.15 6.7 -23.95 6.75 -23.9 21.7 -17.0 19.65 -15.8 M-5.25 -1.25 L-5.3 -1.2 -5.6 -1.4 -5.25 -1.25 M8.15 -18.05 Q8.55 -18.75 8.55 -19.15 8.55 -20.4 7.25 -20.4 6.55 -20.4 5.85 -19.65 5.15 -19.0 5.15 -18.5 L5.25 -17.95 Q5.5 -17.15 6.7 -17.15 7.45 -17.15 8.1 -18.05 L8.15 -18.05 M1.3 -16.7 Q2.0 -16.85 2.0 -17.45 2.0 -18.3 0.75 -18.3 -0.2 -18.3 -0.2 -17.45 -0.3 -16.7 0.65 -16.65 L0.75 -16.65 1.3 -16.7 M0.35 -13.65 L0.3 -13.65 -0.25 -13.1 -0.3 -12.95 -0.3 -12.9 Q-0.3 -12.0 0.5 -12.0 L1.5 -12.3 1.9 -12.6 Q2.55 -13.1 2.55 -13.55 2.55 -14.55 1.65 -14.55 L0.6 -13.9 0.35 -13.65 M8.4 -12.45 Q8.45 -13.35 7.55 -13.35 6.6 -13.35 6.6 -12.3 L6.7 -11.85 Q6.9 -11.45 7.55 -11.45 8.4 -11.45 8.4 -12.45 M3.75 -12.0 Q3.7 -11.8 3.8 -11.65 3.9 -11.3 4.4 -11.3 5.25 -11.3 5.25 -12.2 5.25 -12.9 4.55 -12.9 L3.75 -12.0 M1.95 -10.2 Q0.9 -10.2 0.9 -9.35 0.8 -8.55 1.65 -8.55 2.7 -8.55 2.7 -9.4 2.7 -10.2 1.95 -10.2 M4.0 -8.8 L3.6 -8.0 4.1 -7.85 Q5.0 -7.85 5.0 -8.9 5.0 -9.3 4.55 -9.3 L4.0 -8.8 M-4.45 -11.65 Q-4.1 -12.0 -4.1 -12.65 -4.1 -13.65 -5.0 -13.65 -5.35 -13.65 -5.8 -13.1 L-6.3 -12.3 -6.3 -12.05 -6.2 -11.75 Q-6.0 -11.4 -5.4 -11.4 L-4.45 -11.65 M-2.7 -14.95 Q-2.55 -15.2 -2.55 -15.6 -2.55 -16.35 -3.3 -16.35 -4.35 -16.35 -4.35 -15.5 L-4.25 -15.0 -3.6 -14.6 -3.5 -14.6 Q-2.95 -14.65 -2.7 -14.95 M-12.0 -9.35 Q-11.1 -9.55 -11.1 -10.15 -11.1 -10.95 -12.6 -10.95 -13.65 -10.95 -13.65 -10.15 -13.7 -9.65 -13.4 -9.4 L-13.0 -9.3 -12.9 -9.3 -12.0 -9.35 M-2.95 -6.75 Q-2.05 -6.75 -1.85 -7.85 -1.85 -8.55 -2.55 -8.55 -4.05 -8.55 -4.05 -7.6 L-4.05 -7.15 Q-3.9 -6.8 -3.1 -6.75 L-3.0 -6.75 -2.95 -6.75 M-7.95 -6.45 Q-7.8 -6.75 -7.8 -7.2 L-8.4 -7.8 -9.0 -7.35 -9.35 -6.75 -9.3 -6.4 Q-9.15 -6.05 -8.7 -6.05 L-8.6 -6.05 -8.55 -6.05 -8.5 -6.05 Q-8.1 -6.1 -7.95 -6.45 M-4.7 -4.2 Q-4.7 -3.6 -3.95 -3.6 -3.35 -3.6 -3.35 -4.1 -3.35 -4.95 -3.95 -4.95 -4.7 -4.95 -4.7 -4.2" fill="#fefdde" fill-rule="evenodd" stroke="none"/>
    <path d="M13.0 -15.75 Q12.75 -14.55 11.1 -14.55 10.25 -14.55 9.95 -15.2 10.0 -16.4 12.15 -16.4 12.8 -16.4 13.0 -15.75 M8.15 -18.05 L8.1 -18.05 Q7.45 -17.15 6.7 -17.15 5.5 -17.15 5.25 -17.95 L5.65 -18.45 Q6.3 -19.1 7.05 -19.1 7.9 -19.1 8.15 -18.05 M0.65 -16.65 L0.35 -16.7 Q0.1 -16.85 0.15 -17.25 0.15 -17.85 0.8 -17.85 1.55 -17.85 1.5 -17.25 L1.3 -16.7 0.75 -16.65 0.65 -16.65 M1.5 -12.3 L0.5 -12.0 Q-0.3 -12.0 -0.3 -12.9 L-0.3 -12.95 -0.25 -13.1 0.3 -13.65 0.35 -13.65 0.65 -13.7 Q1.35 -13.7 1.55 -12.75 L1.5 -12.3 M7.05 -12.0 L7.05 -12.35 Q7.25 -12.35 7.25 -12.45 L7.5 -12.15 7.25 -11.9 7.05 -12.0 M3.75 -12.0 L4.55 -12.9 Q5.25 -12.9 5.25 -12.2 5.25 -11.3 4.4 -11.3 3.9 -11.3 3.8 -11.65 3.7 -11.8 3.75 -12.0 M4.0 -8.8 L4.55 -9.3 Q5.0 -9.3 5.0 -8.9 5.0 -7.85 4.1 -7.85 L3.6 -8.0 4.0 -8.8 M-6.3 -12.05 L-6.0 -12.4 Q-5.55 -12.9 -5.1 -12.9 L-4.4 -12.2 -4.45 -11.65 -5.4 -11.4 Q-6.0 -11.4 -6.2 -11.75 L-6.3 -12.05 M-2.7 -14.95 Q-2.95 -14.65 -3.5 -14.6 L-3.6 -14.6 -4.25 -15.0 Q-4.2 -15.8 -3.5 -15.8 -2.75 -15.8 -2.7 -14.95 M-13.4 -9.4 Q-13.35 -10.35 -12.3 -10.35 L-11.7 -9.75 -12.0 -9.35 -12.9 -9.3 -13.0 -9.3 -13.4 -9.4 M-2.95 -6.75 L-3.0 -6.75 -3.1 -6.75 Q-3.9 -6.8 -4.05 -7.15 -4.0 -7.95 -3.15 -7.95 -2.55 -7.95 -2.55 -7.4 L-2.75 -6.75 -2.95 -6.75 M-9.3 -6.4 Q-9.25 -7.35 -8.4 -7.35 L-7.85 -6.75 -7.95 -6.45 Q-8.1 -6.1 -8.5 -6.05 L-8.55 -6.05 -8.6 -6.05 -8.7 -6.05 Q-9.15 -6.05 -9.3 -6.4" fill="#495ca5" fill-rule="evenodd" stroke="none"/>
    <path d="M9.95 -15.2 Q9.8 -15.55 9.8 -16.1 9.8 -17.4 12.0 -17.4 13.0 -17.4 13.05 -16.3 L13.0 -15.75 Q12.8 -16.4 12.15 -16.4 10.0 -16.4 9.95 -15.2 M5.25 -17.95 L5.15 -18.5 Q5.15 -19.0 5.85 -19.65 6.55 -20.4 7.25 -20.4 8.55 -20.4 8.55 -19.15 8.55 -18.75 8.15 -18.05 7.9 -19.1 7.05 -19.1 6.3 -19.1 5.65 -18.45 L5.25 -17.95 M1.5 -12.3 L1.55 -12.75 Q1.35 -13.7 0.65 -13.7 L0.35 -13.65 0.6 -13.9 1.65 -14.55 Q2.55 -14.55 2.55 -13.55 2.55 -13.1 1.9 -12.6 L1.5 -12.3 M1.95 -10.2 Q2.7 -10.2 2.7 -9.4 2.7 -8.55 1.65 -8.55 0.8 -8.55 0.9 -9.35 0.9 -10.2 1.95 -10.2" fill="#668add" fill-rule="evenodd" stroke="none"/>
    <path d="M17.45 -14.55 L19.65 -15.8 19.55 -15.3 19.6 -14.9 Q19.8 -14.55 20.4 -14.55 L21.0 -15.05 Q21.25 -15.6 21.6 -15.6 L22.0 -15.6 Q22.25 -14.2 22.05 -11.55 L22.1 -11.2 21.85 -11.25 Q17.75 -11.25 16.35 -7.0 L16.4 -6.4 16.45 -6.3 12.55 -5.6 12.65 -5.95 12.65 -6.15 12.6 -6.15 12.95 -6.15 Q15.6 -6.15 15.6 -9.05 15.6 -10.05 14.6 -10.05 13.6 -10.05 12.45 -9.1 11.7 -8.5 11.45 -7.9 10.8 -8.55 10.25 -8.55 9.1 -8.55 7.35 -6.65 6.95 -7.65 5.95 -7.65 L5.9 -7.75 12.85 -11.8 12.9 -11.7 Q12.9 -10.65 15.4 -10.65 18.3 -10.65 18.3 -13.55 18.3 -14.45 17.45 -14.55 M-3.2 -2.45 L5.4 -7.5 5.45 -7.45 1.5 -4.4 Q1.5 -3.65 2.25 -3.65 3.4 -3.65 5.4 -4.8 L6.0 -5.15 5.4 -4.4 5.5 -3.9 5.5 -3.85 1.7 -2.7 0.25 -2.2 0.5 -2.85 Q0.5 -3.3 -0.05 -3.3 -1.05 -3.3 -3.2 -2.45 M19.55 -13.7 Q18.45 -13.7 18.45 -12.65 L18.55 -12.05 Q18.8 -11.55 19.4 -11.55 21.45 -11.55 21.45 -12.65 21.45 -13.7 19.55 -13.7" fill="#79828e" fill-rule="evenodd" stroke="none"/>
    <path d="M19.65 -15.8 L21.7 -17.0 6.75 -23.9 Q7.15 -24.5 8.35 -24.6 9.5 -24.7 20.1 -18.95 23.35 -18.05 23.45 -15.65 L23.45 -12.3 Q23.45 -9.15 22.9 -8.0 L22.95 -7.65 Q22.95 -6.25 10.65 -4.5 1.05 -1.85 -1.15 -1.8 L-4.35 -0.9 -5.2 -1.25 -3.2 -2.45 Q-1.05 -3.3 -0.05 -3.3 0.5 -3.3 0.5 -2.85 L0.25 -2.2 1.7 -2.7 5.5 -3.85 5.5 -3.9 5.4 -4.4 6.0 -5.15 5.4 -4.8 Q3.4 -3.65 2.25 -3.65 1.5 -3.65 1.5 -4.4 L5.45 -7.45 5.95 -7.65 Q6.95 -7.65 7.35 -6.65 9.1 -8.55 10.25 -8.55 10.8 -8.55 11.45 -7.9 11.7 -8.5 12.45 -9.1 13.6 -10.05 14.6 -10.05 15.6 -10.05 15.6 -9.05 15.6 -6.15 12.95 -6.15 L12.6 -6.15 11.95 -6.3 12.65 -6.15 12.65 -5.95 12.55 -5.6 16.45 -6.3 16.4 -6.4 16.35 -7.0 Q17.75 -11.25 21.85 -11.25 L22.1 -11.2 22.05 -11.55 Q22.25 -14.2 22.0 -15.6 L21.6 -15.6 Q21.25 -15.6 21.0 -15.05 L20.4 -14.55 Q19.8 -14.55 19.6 -14.9 L19.55 -15.3 19.65 -15.8 M12.9 -11.85 L12.9 -11.9 17.45 -14.55 Q18.3 -14.45 18.3 -13.55 18.3 -10.65 15.4 -10.65 12.9 -10.65 12.9 -11.7 L12.9 -11.85 M19.55 -13.7 Q21.45 -13.7 21.45 -12.65 21.45 -11.55 19.4 -11.55 18.8 -11.55 18.55 -12.05 L18.45 -12.65 Q18.45 -13.7 19.55 -13.7 M22.1 -8.6 L22.15 -8.7 22.15 -8.75 22.15 -8.95 20.65 -7.65 19.85 -7.05 21.3 -7.55 21.55 -7.7 21.75 -7.9 22.1 -8.5 22.1 -8.6" fill="#485159" fill-rule="evenodd" stroke="none"/>
    <path d="M1.3 -16.7 L1.5 -17.25 Q1.55 -17.85 0.8 -17.85 0.15 -17.85 0.15 -17.25 0.1 -16.85 0.35 -16.7 L0.65 -16.65 Q-0.3 -16.7 -0.2 -17.45 -0.2 -18.3 0.75 -18.3 2.0 -18.3 2.0 -17.45 2.0 -16.85 1.3 -16.7 M8.4 -12.45 Q8.4 -11.45 7.55 -11.45 6.9 -11.45 6.7 -11.85 L6.6 -12.3 Q6.6 -13.35 7.55 -13.35 8.45 -13.35 8.4 -12.45 M7.05 -12.0 L7.25 -11.9 7.5 -12.15 7.25 -12.45 Q7.25 -12.35 7.05 -12.35 L7.05 -12.0 M-4.45 -11.65 L-4.4 -12.2 -5.1 -12.9 Q-5.55 -12.9 -6.0 -12.4 L-6.3 -12.05 -6.3 -12.3 -5.8 -13.1 Q-5.35 -13.65 -5.0 -13.65 -4.1 -13.65 -4.1 -12.65 -4.1 -12.0 -4.45 -11.65 M-4.25 -15.0 L-4.35 -15.5 Q-4.35 -16.35 -3.3 -16.35 -2.55 -16.35 -2.55 -15.6 -2.55 -15.2 -2.7 -14.95 -2.75 -15.8 -3.5 -15.8 -4.2 -15.8 -4.25 -15.0 M-13.4 -9.4 Q-13.7 -9.65 -13.65 -10.15 -13.65 -10.95 -12.6 -10.95 -11.1 -10.95 -11.1 -10.15 -11.1 -9.55 -12.0 -9.35 L-11.7 -9.75 -12.3 -10.35 Q-13.35 -10.35 -13.4 -9.4 M-4.05 -7.15 L-4.05 -7.6 Q-4.05 -8.55 -2.55 -8.55 -1.85 -8.55 -1.85 -7.85 -2.05 -6.75 -2.95 -6.75 L-2.75 -6.75 -2.55 -7.4 Q-2.55 -7.95 -3.15 -7.95 -4.0 -7.95 -4.05 -7.15 M-9.3 -6.4 L-9.35 -6.75 -9.0 -7.35 -8.4 -7.8 -7.8 -7.2 Q-7.8 -6.75 -7.95 -6.45 L-7.85 -6.75 -8.4 -7.35 Q-9.25 -7.35 -9.3 -6.4 M-4.7 -4.2 Q-4.7 -4.95 -3.95 -4.95 -3.35 -4.95 -3.35 -4.1 -3.35 -3.6 -3.95 -3.6 -4.7 -3.6 -4.7 -4.2" fill="#7d8cc6" fill-rule="evenodd" stroke="none"/>
    <path d="M5.4 -7.5 L5.9 -7.75 5.95 -7.65 5.45 -7.45 5.4 -7.5 M12.85 -11.8 L12.9 -11.85 12.9 -11.7 12.85 -11.8 M16.4 -6.4 L16.45 -6.3 16.4 -6.4 M12.65 -6.15 L11.95 -6.3 12.6 -6.15 12.65 -6.15 M22.1 -8.6 L22.1 -8.5 21.75 -7.9 21.55 -7.7 21.3 -7.55 19.85 -7.05 20.65 -7.65 22.15 -8.95 22.15 -8.75 22.15 -8.7 22.1 -8.6" fill="#5f8ba9" fill-rule="evenodd" stroke="none"/>
    <path d="M-5.85 -1.55 L-5.8 -1.5 -5.2 -1.25 -4.35 -0.9 -5.25 -1.25 -5.6 -1.4 -5.85 -1.55" fill="#b3c2ff" fill-rule="evenodd" stroke="none"/>
    <path d="M9.75 -20.15 Q9.75 -19.4 8.25 -17.85 6.5 -16.05 4.85 -16.05 1.85 -16.05 1.85 -18.05 1.85 -19.65 3.95 -20.7 5.8 -21.6 7.95 -21.6 9.6 -21.6 9.75 -20.15" fill="#668add" fill-opacity="0.3019608" fill-rule="evenodd" stroke="none"/>
    <path d="M10.35 -15.3 L9.85 -14.3 Q9.3 -13.5 8.6 -13.5 7.8 -13.5 7.5 -14.2 L7.35 -14.95 Q7.35 -15.3 7.9 -15.85 8.5 -16.5 9.15 -16.5 10.4 -16.5 10.35 -15.3" fill="#668add" fill-opacity="0.3019608" fill-rule="evenodd" stroke="none"/>
    <path d="M15.65 -15.15 Q15.65 -13.5 13.9 -13.5 12.6 -13.5 12.1 -14.45 11.85 -14.9 11.85 -15.4 11.85 -16.95 14.15 -16.95 15.65 -16.95 15.65 -15.15" fill="#668add" fill-opacity="0.3019608" fill-rule="evenodd" stroke="none"/>
    <path d="M14.25 -17.45 Q14.25 -15.45 12.2 -15.45 11.7 -15.45 11.05 -16.25 10.5 -17.0 10.5 -17.25 10.5 -18.65 13.05 -18.65 14.15 -18.65 14.25 -17.45" fill="#668add" fill-opacity="0.3019608" fill-rule="evenodd" stroke="none"/>
    <path d="M6.65 -12.5 Q6.65 -11.95 6.0 -11.25 5.25 -10.4 4.2 -10.4 2.45 -10.4 2.15 -12.05 2.15 -15.0 4.35 -15.0 6.65 -15.0 6.65 -12.5" fill="#668add" fill-opacity="0.3019608" fill-rule="evenodd" stroke="none"/>
    <path d="M1.85 -13.95 Q1.85 -11.9 0.15 -11.9 -1.1 -11.9 -1.2 -13.3 -1.2 -15.75 0.55 -15.75 1.9 -15.75 1.85 -13.95" fill="#668add" fill-opacity="0.3019608" fill-rule="evenodd" stroke="none"/>
    <path d="M3.15 -16.55 Q3.15 -14.55 0.0 -14.55 -2.0 -14.55 -1.65 -16.65 -1.65 -17.0 -2.0 -17.2 -2.0 -17.4 -0.65 -18.15 0.8 -18.9 1.4 -18.9 2.7 -18.9 3.15 -16.55" fill="#668add" fill-opacity="0.3019608" fill-rule="evenodd" stroke="none"/>
    <path d="M-2.25 -15.1 Q-2.25 -12.65 -4.35 -12.65 -5.7 -12.65 -6.0 -15.45 L-5.45 -16.2 -4.35 -16.7 Q-2.25 -16.7 -2.25 -15.1" fill="#668add" fill-opacity="0.3019608" fill-rule="evenodd" stroke="none"/>
    <path d="M-3.35 -11.45 Q-3.35 -10.2 -4.5 -10.2 -6.0 -10.2 -6.0 -11.2 -6.0 -12.65 -4.5 -12.65 -3.55 -12.65 -3.35 -11.45" fill="#668add" fill-opacity="0.3019608" fill-rule="evenodd" stroke="none"/>
    <path d="M0.3 -7.65 Q-0.3 -6.75 -1.1 -6.75 -2.15 -6.75 -3.05 -9.3 -3.05 -10.4 -1.4 -10.4 0.8 -10.4 0.8 -8.75 L0.3 -7.65" fill="#668add" fill-opacity="0.3019608" fill-rule="evenodd" stroke="none"/>
    <path d="M5.25 -9.55 Q5.25 -7.65 3.2 -7.65 1.8 -7.65 1.7 -10.25 1.7 -11.45 3.85 -11.45 5.5 -11.45 5.25 -9.55" fill="#668add" fill-opacity="0.3019608" fill-rule="evenodd" stroke="none"/>
    <path d="M-11.25 -10.9 L-10.95 -10.4 Q-10.95 -9.3 -12.25 -9.3 -13.25 -9.3 -13.4 -10.35 -13.4 -11.4 -12.25 -11.4 -11.7 -11.4 -11.25 -10.9" fill="#668add" fill-opacity="0.3019608" fill-rule="evenodd" stroke="none"/>
    <path d="M-5.3 -7.95 L-5.15 -7.45 Q-5.15 -7.05 -5.65 -6.45 -6.3 -5.7 -7.1 -5.7 -8.4 -5.7 -8.25 -6.85 -8.15 -8.4 -6.15 -8.4 -5.6 -8.4 -5.3 -7.95" fill="#668add" fill-opacity="0.3019608" fill-rule="evenodd" stroke="none"/>
    <path d="M-3.75 -4.05 Q-3.75 -2.75 -5.0 -2.75 -6.25 -2.75 -6.2 -4.0 -6.2 -5.55 -5.1 -5.55 -3.9 -5.55 -3.75 -4.05" fill="#668add" fill-opacity="0.3019608" fill-rule="evenodd" stroke="none"/>
    <path d="M1.95 -7.8 Q1.95 -6.9 1.1 -6.9 0.1 -6.9 0.3 -7.8 0.3 -8.6 1.1 -8.6 2.0 -8.6 1.95 -7.8" fill="#668add" fill-opacity="0.3019608" fill-rule="evenodd" stroke="none"/>
    <path d="M13.05 -15.4 Q13.05 -14.55 12.3 -14.55 11.5 -14.55 11.15 -15.05 11.0 -15.3 11.0 -15.6 11.0 -16.5 11.85 -16.5 12.95 -16.5 13.05 -15.4" fill="#668add" fill-opacity="0.3019608" fill-rule="evenodd" stroke="none"/>
    <path d="M18.0 -16.25 Q18.0 -15.2 16.95 -15.2 16.45 -15.2 16.2 -15.65 L16.05 -16.1 Q16.05 -17.15 17.1 -17.15 18.0 -17.15 18.0 -16.25" fill="#668add" fill-opacity="0.3019608" fill-rule="evenodd" stroke="none"/>
  </g>
</svg>
