<?xml version="1.0" encoding="UTF-8" standalone="no"?>
<svg xmlns:xlink="http://www.w3.org/1999/xlink" height="24.6px" width="17.6px" xmlns="http://www.w3.org/2000/svg">
  <g transform="matrix(1.0, 0.0, 0.0, 1.0, 8.85, 13.15)">
    <path d="M-8.25 -6.1 L-4.55 -12.15 3.25 -13.15 -3.0 -7.3 2.4 -1.45 -1.85 1.15 -3.0 -7.3 -8.25 -6.1" fill="#ffffff" fill-rule="evenodd" stroke="none"/>
    <path d="M2.4 -1.45 L8.75 -4.35 6.4 6.35 2.4 -1.45 M-8.8 2.6 L-8.85 2.55 -8.25 -6.1 -3.0 -7.3 -1.85 1.15 -8.8 2.6" fill="#aeff17" fill-rule="evenodd" stroke="none"/>
    <path d="M3.25 -13.15 L8.75 -4.35 2.4 -1.45 3.25 -13.15" fill="#95e600" fill-rule="evenodd" stroke="none"/>
    <path d="M3.25 -13.15 L2.4 -1.45 -3.0 -7.3 3.25 -13.15 M6.4 6.35 L-0.4 11.45 -0.5 11.35 -1.85 1.15 2.4 -1.45 6.4 6.35" fill="#85cc00" fill-rule="evenodd" stroke="none"/>
    <path d="M-0.5 11.35 L-5.8 8.45 -8.8 2.6 -1.85 1.15 -0.5 11.35" fill="#6faa00" fill-rule="evenodd" stroke="none"/>
    <path d="M-0.4 11.45 L-0.5 11.35 M-8.8 2.6 L-8.85 2.55" fill="none" stroke="#000404" stroke-linecap="round" stroke-linejoin="round" stroke-width="0.05"/>
  </g>
</svg>
