<?xml version="1.0" encoding="UTF-8" standalone="no"?>
<svg xmlns:xlink="http://www.w3.org/1999/xlink" height="26.3px" width="25.1px" xmlns="http://www.w3.org/2000/svg">
  <g transform="matrix(1.0, 0.0, 0.0, 1.0, 12.55, 25.05)">
    <path d="M-9.1 -18.05 L-8.7 -18.5 -8.4 -16.95 -8.35 -16.6 -7.5 -16.55 -7.45 -16.55 -7.85 -13.75 -7.85 -13.7 -9.0 -5.4 -9.05 -7.25 Q-9.05 -9.9 -8.65 -12.6 L-8.25 -15.05 -10.1 -13.05 -9.1 -18.05 M-4.9 -0.25 L-3.2 -6.15 -3.0 0.1 -4.9 -0.25 M9.45 -16.45 L8.65 -15.2 9.6 -9.1 9.85 -7.45 9.1 -9.45 Q8.7 -10.55 8.45 -11.6 L8.45 -11.7 8.35 -12.15 8.0 -13.9 7.6 -16.05 7.75 -16.15 8.95 -17.1 9.25 -17.35 9.45 -16.5 9.45 -16.45 M4.6 -14.9 L3.75 -13.95 Q4.95 -9.45 3.25 -4.9 L3.2 -11.4 3.25 -11.4 3.2 -12.9 3.2 -14.15 2.45 -15.05 2.85 -15.8 3.6 -15.0 3.65 -15.0 4.05 -15.35 4.25 -15.3 4.55 -15.25 4.8 -15.2 4.6 -14.95 4.6 -14.9 M-1.8 -13.65 L-2.1 -13.65 -2.3 -12.8 -2.75 -11.6 -2.7 -11.35 -3.15 -9.6 -3.5 -10.05 -3.45 -10.25 -3.2 -11.95 -2.95 -13.6 -3.05 -13.65 -3.55 -13.9 -4.95 -14.7 -3.7 -14.6 -2.6 -14.55 -1.15 -14.45 -1.8 -13.65" fill="#b90808" fill-rule="evenodd" stroke="none"/>
    <path d="M8.95 -17.1 Q7.0 -19.25 7.0 -19.55 7.0 -20.0 7.45 -20.15 L8.8 -18.45 9.15 -17.9 9.2 -17.85 9.3 -17.35 9.25 -17.35 8.95 -17.1 M6.55 -22.05 L3.65 -21.3 3.2 -21.8 Q3.2 -22.9 4.85 -23.05 L6.45 -22.1 6.55 -22.05 M1.5 -23.95 L1.15 -23.2 0.35 -21.7 Q-0.4 -21.7 -0.65 -22.95 L-0.15 -24.05 0.0 -24.05 1.5 -23.95 M-3.95 -23.4 Q-3.45 -23.25 -3.0 -22.9 L-2.2 -22.0 Q-2.2 -21.4 -2.85 -21.4 L-5.4 -22.05 -6.1 -22.35 -3.95 -23.4 M-7.55 -21.2 L-6.4 -21.35 -6.05 -21.1 Q-5.95 -21.4 -5.95 -20.9 L-8.55 -19.8 -8.6 -19.8 -8.25 -20.4 -8.0 -20.7 -7.65 -21.1 -7.55 -21.2 M-8.4 -16.95 L-7.65 -17.7 Q-6.35 -18.75 -5.55 -18.95 L-5.2 -18.6 -7.5 -16.55 -8.35 -16.6 -8.4 -16.95 M-7.85 -13.75 L-6.9 -14.85 Q-6.75 -15.15 -6.75 -14.7 -6.15 -16.65 -5.65 -17.05 L-5.3 -16.7 -6.25 -13.5 -6.5 -12.7 -6.65 -12.3 -7.0 -12.1 -7.2 -12.2 -7.15 -12.6 -7.55 -11.05 -8.1 -9.15 -7.85 -9.5 Q-7.55 -9.4 -7.55 -9.1 L-8.35 -6.4 Q-9.2 -3.9 -9.55 -3.55 -10.05 -3.65 -10.05 -4.05 -10.05 -4.65 -9.25 -6.75 L-9.05 -7.25 -9.0 -5.4 -7.85 -13.7 -7.85 -13.75 M-1.2 0.25 L-1.25 -4.6 Q-1.25 -10.55 -0.55 -11.5 L-0.1 -11.0 Q-0.1 -6.75 -0.25 -4.7 L-0.1 -1.6 Q-0.15 -0.55 -0.45 0.25 L-1.1 0.25 -1.2 0.25 M9.6 -9.1 L11.15 -4.2 10.2 -3.0 9.1 -5.7 8.2 -8.65 8.7 -8.15 8.85 -8.25 8.85 -9.0 Q8.4 -9.65 8.05 -11.3 L8.0 -11.5 8.45 -11.7 8.45 -11.6 Q8.7 -10.55 9.1 -9.45 L9.85 -7.45 9.6 -9.1 M7.6 -11.5 L7.3 -11.75 7.3 -11.7 7.1 -12.15 6.85 -12.75 6.65 -13.45 6.55 -13.85 7.6 -11.5 M6.45 -14.4 L6.25 -15.45 Q6.25 -17.2 7.3 -17.2 L7.75 -16.15 7.6 -16.05 8.0 -13.9 7.4 -15.75 Q6.9 -15.25 6.9 -14.25 L7.0 -13.85 6.6 -14.45 6.45 -14.45 6.45 -14.4 M4.55 -15.25 L4.35 -17.75 Q4.35 -18.0 4.7 -18.1 L6.15 -12.45 6.1 -12.15 Q6.15 -11.95 5.65 -11.95 5.0 -11.95 4.6 -14.85 L4.6 -14.9 4.6 -14.95 4.8 -15.2 4.55 -15.25 M3.2 -11.4 L2.55 -11.2 Q1.35 -11.2 0.9 -14.25 L0.4 -12.65 0.15 -13.1 0.15 -13.2 Q0.15 -14.45 -0.15 -14.9 L-0.25 -14.6 -0.4 -17.0 -0.3 -17.4 0.1 -17.5 Q0.95 -17.5 1.0 -15.3 1.15 -15.6 1.6 -15.65 L1.4 -15.6 1.7 -13.45 Q1.95 -12.05 2.55 -12.05 2.9 -12.05 2.9 -12.6 L2.65 -14.5 3.2 -12.9 3.25 -11.4 3.2 -11.4 M-0.2 -14.4 L-1.6 -13.75 -1.8 -13.65 -1.15 -14.45 -0.2 -14.4 M-2.3 -12.8 L-2.3 -12.85 -2.7 -11.35 -2.75 -11.6 -2.3 -12.8 M-3.45 -10.25 Q-5.2 -6.35 -7.3 -5.7 -7.05 -7.6 -3.3 -12.0 L-3.2 -11.95 -3.45 -10.25 M-3.05 -13.65 L-3.3 -13.35 -3.55 -13.9 -3.05 -13.65 M-3.7 -14.6 L-3.7 -14.65 Q-3.15 -17.25 -2.55 -17.25 -2.0 -17.25 -2.0 -16.65 -2.0 -16.05 -2.5 -14.8 L-2.6 -14.55 -3.7 -14.6 M3.65 -15.0 L1.95 -17.9 2.0 -18.25 2.35 -18.35 Q3.05 -18.35 4.25 -15.3 L4.05 -15.35 3.65 -15.0 M5.55 -8.3 Q6.6 -8.3 6.75 -3.15 L6.35 -1.35 6.25 -1.35 Q6.25 -3.0 5.25 -6.55 L5.25 -8.25 5.55 -8.3 M1.65 -11.15 L2.0 -11.2 Q3.2 -11.2 3.2 -7.0 L3.05 -5.5 2.65 -5.35 Q2.15 -6.0 1.6 -10.55 L1.65 -11.15 M-2.3 -7.1 L-2.6 -11.25 Q-2.6 -12.1 -2.15 -12.35 L-2.0 -9.05 -2.1 -7.15 -2.3 -7.1" fill="#fe7a7a" fill-rule="evenodd" stroke="none"/>
    <path d="M-6.25 -13.5 L-6.05 -14.1 -5.9 -14.45 -4.85 -16.4 -5.1 -15.55 -5.0 -15.6 -4.8 -15.35 -6.15 -11.9 -6.3 -11.85 -6.6 -12.15 -6.5 -12.7 -6.25 -13.5 M8.2 -8.65 L8.15 -8.95 7.85 -10.85 7.85 -10.95 7.85 -11.0 8.0 -11.5 8.05 -11.3 Q8.4 -9.65 8.85 -9.0 L8.85 -8.25 8.7 -8.15 8.2 -8.65 M8.35 -12.15 L8.2 -11.8 7.65 -11.5 7.6 -11.5 6.55 -13.85 6.45 -14.4 6.45 -14.45 6.6 -14.45 7.0 -13.85 6.9 -14.25 Q6.9 -15.25 7.4 -15.75 L8.0 -13.9 8.35 -12.15 M0.15 -13.1 L-0.2 -14.4 -0.25 -14.6 -0.15 -14.9 Q0.15 -14.45 0.15 -13.2 L0.15 -13.1 M1.6 -15.65 L1.65 -15.65 Q2.1 -15.65 2.65 -14.5 L2.9 -12.6 Q2.9 -12.05 2.55 -12.05 1.95 -12.05 1.7 -13.45 L1.4 -15.6 1.6 -15.65" fill="#ffffff" fill-rule="evenodd" stroke="none"/>
    <path d="M1.65 -24.95 Q3.65 -24.75 5.3 -23.95 L7.1 -22.9 7.25 -22.8 Q9.9 -20.85 10.2 -18.15 L10.2 -18.05 10.5 -16.7 10.5 -16.65 12.5 -6.6 12.5 -6.55 12.55 -5.75 Q12.65 -2.75 8.6 -0.6 L8.6 -0.65 Q5.05 1.25 0.0 1.25 L-0.4 1.25 -0.45 1.25 -1.1 1.25 -1.2 1.25 -3.05 1.1 -3.1 1.05 -5.0 0.7 -5.05 0.7 Q-7.05 0.2 -8.65 -0.65 L-8.7 -0.65 Q-12.7 -2.75 -12.55 -5.75 L-12.45 -6.8 -12.45 -6.7 -12.3 -7.25 -10.05 -18.15 -9.5 -20.1 -9.4 -20.3 -9.0 -20.95 -9.0 -21.0 -8.75 -21.3 -8.7 -21.35 -8.35 -21.75 -8.3 -21.8 -8.25 -21.9 -7.05 -22.9 -7.0 -22.95 -6.6 -23.2 -4.25 -24.35 Q-2.35 -25.05 -0.1 -25.05 L0.05 -25.05 1.65 -24.95 M9.15 -17.9 L9.15 -18.05 Q8.85 -20.35 6.55 -22.05 L6.45 -22.1 4.85 -23.05 Q3.3 -23.8 1.5 -23.95 L0.0 -24.05 -0.15 -24.05 -3.95 -23.4 -6.1 -22.35 -6.5 -22.1 -7.55 -21.2 -7.65 -21.1 -8.0 -20.7 -8.25 -20.4 -8.6 -19.8 -8.55 -19.8 Q-9.0 -19.0 -9.1 -18.05 L-10.1 -13.05 -11.4 -6.9 -11.5 -6.55 -11.6 -5.75 Q-11.6 -3.3 -8.25 -1.5 -6.75 -0.7 -4.9 -0.25 L-3.0 0.1 -1.2 0.25 -1.1 0.25 -0.45 0.25 -0.05 0.25 Q4.75 0.25 8.1 -1.5 11.5 -3.3 11.5 -5.75 L11.45 -6.4 9.45 -16.45 9.45 -16.5 9.3 -17.35 9.2 -17.85 9.15 -17.9" fill="#000000" fill-rule="evenodd" stroke="none"/>
    <path d="M9.15 -17.9 L8.8 -18.45 7.45 -20.15 Q7.0 -20.0 7.0 -19.55 7.0 -19.25 8.95 -17.1 L7.75 -16.15 7.3 -17.2 Q6.25 -17.2 6.25 -15.45 L6.45 -14.4 6.55 -13.85 6.65 -13.45 6.85 -12.75 7.1 -12.15 7.3 -11.7 7.3 -11.75 7.6 -11.5 7.65 -11.5 8.2 -11.8 8.35 -12.15 8.45 -11.7 8.0 -11.5 7.85 -11.0 7.85 -10.95 7.85 -10.85 8.15 -8.95 8.2 -8.65 9.1 -5.7 10.2 -3.0 11.15 -4.2 9.6 -9.1 8.65 -15.2 9.45 -16.45 11.45 -6.4 11.5 -5.75 Q11.5 -3.3 8.1 -1.5 4.75 0.25 -0.05 0.25 L-0.45 0.25 Q-0.15 -0.55 -0.1 -1.6 L-0.25 -4.7 Q-0.1 -6.75 -0.1 -11.0 L-0.55 -11.5 Q-1.25 -10.55 -1.25 -4.6 L-1.2 0.25 -3.0 0.1 -3.2 -6.15 -4.9 -0.25 Q-6.75 -0.7 -8.25 -1.5 -11.6 -3.3 -11.6 -5.75 L-11.5 -6.55 -11.4 -6.9 -10.1 -13.05 -8.25 -15.05 -8.65 -12.6 Q-9.05 -9.9 -9.05 -7.25 L-9.25 -6.75 Q-10.05 -4.65 -10.05 -4.05 -10.05 -3.65 -9.55 -3.55 -9.2 -3.9 -8.35 -6.4 L-7.55 -9.1 Q-7.55 -9.4 -7.85 -9.5 L-8.1 -9.15 -7.55 -11.05 -7.15 -12.6 -7.2 -12.2 -7.0 -12.1 -6.65 -12.3 -6.5 -12.7 -6.6 -12.15 -6.3 -11.85 -6.15 -11.9 -4.8 -15.35 -5.0 -15.6 -5.1 -15.55 -4.85 -16.4 -5.9 -14.45 -6.05 -14.1 -6.25 -13.5 -5.3 -16.7 -5.65 -17.05 Q-6.15 -16.65 -6.75 -14.7 -6.75 -15.15 -6.9 -14.85 L-7.85 -13.75 -7.45 -16.55 -7.5 -16.55 -5.2 -18.6 -5.55 -18.95 Q-6.35 -18.75 -7.65 -17.7 L-8.4 -16.95 -8.7 -18.5 -9.1 -18.05 Q-9.0 -19.0 -8.55 -19.8 L-5.95 -20.9 Q-5.95 -21.4 -6.05 -21.1 L-6.4 -21.35 -7.55 -21.2 -6.5 -22.1 -6.1 -22.35 -5.4 -22.05 -2.85 -21.4 Q-2.2 -21.4 -2.2 -22.0 L-3.0 -22.9 Q-3.45 -23.25 -3.95 -23.4 L-0.15 -24.05 -0.65 -22.95 Q-0.4 -21.7 0.35 -21.7 L1.15 -23.2 1.5 -23.95 Q3.3 -23.8 4.85 -23.05 3.2 -22.9 3.2 -21.8 L3.65 -21.3 6.55 -22.05 Q8.85 -20.35 9.15 -18.05 L9.15 -17.9 M4.6 -14.9 L4.6 -14.85 Q5.0 -11.95 5.65 -11.95 6.15 -11.95 6.1 -12.15 L6.15 -12.45 4.7 -18.1 Q4.35 -18.0 4.35 -17.75 L4.55 -15.25 4.25 -15.3 Q3.05 -18.35 2.35 -18.35 L2.0 -18.25 1.95 -17.9 3.65 -15.0 3.6 -15.0 2.85 -15.8 2.45 -15.05 3.2 -14.15 3.2 -12.9 2.65 -14.5 Q2.1 -15.65 1.65 -15.65 L1.6 -15.65 Q1.15 -15.6 1.0 -15.3 0.95 -17.5 0.1 -17.5 L-0.3 -17.4 -0.4 -17.0 -0.25 -14.6 -0.2 -14.4 0.15 -13.1 0.4 -12.65 0.9 -14.25 Q1.35 -11.2 2.55 -11.2 L3.2 -11.4 3.25 -4.9 Q4.95 -9.45 3.75 -13.95 L4.6 -14.9 M-1.8 -13.65 L-1.6 -13.75 -0.2 -14.4 -1.15 -14.45 -2.6 -14.55 -2.5 -14.8 Q-2.0 -16.05 -2.0 -16.65 -2.0 -17.25 -2.55 -17.25 -3.15 -17.25 -3.7 -14.65 L-3.7 -14.6 -4.95 -14.7 -3.55 -13.9 -3.3 -13.35 -3.05 -13.65 -2.95 -13.6 -3.2 -11.95 -3.3 -12.0 Q-7.05 -7.6 -7.3 -5.7 -5.2 -6.35 -3.45 -10.25 L-3.5 -10.05 -3.15 -9.6 -2.7 -11.35 -2.3 -12.85 -2.3 -12.8 -2.1 -13.65 -1.8 -13.65 M1.65 -11.15 L1.6 -10.55 Q2.15 -6.0 2.65 -5.35 L3.05 -5.5 3.2 -7.0 Q3.2 -11.2 2.0 -11.2 L1.65 -11.15 M5.55 -8.3 L5.25 -8.25 5.25 -6.55 Q6.25 -3.0 6.25 -1.35 L6.35 -1.35 6.75 -3.15 Q6.6 -8.3 5.55 -8.3 M-2.3 -7.1 L-2.1 -7.15 -2.0 -9.05 -2.15 -12.35 Q-2.6 -12.1 -2.6 -11.25 L-2.3 -7.1" fill="url(#gradient0)" fill-rule="evenodd" stroke="none"/>
    <path d="M9.25 -17.35 L9.3 -17.35 9.45 -16.5 9.25 -17.35" fill="url(#gradient1)" fill-rule="evenodd" stroke="none"/>
  </g>
  <defs>
    <radialGradient cx="0" cy="0" gradientTransform="matrix(0.0295, 0.0, 0.0, 0.0295, 0.25, -23.65)" gradientUnits="userSpaceOnUse" id="gradient0" r="819.2" spreadMethod="pad">
      <stop offset="0.0" stop-color="#fe8989"/>
      <stop offset="0.44313725490196076" stop-color="#fe2a2a"/>
      <stop offset="1.0" stop-color="#ac0202"/>
    </radialGradient>
    <radialGradient cx="0" cy="0" gradientTransform="matrix(0.0265, 0.0, 0.0, 0.0265, -1.8, -20.0)" gradientUnits="userSpaceOnUse" id="gradient1" r="819.2" spreadMethod="pad">
      <stop offset="0.0" stop-color="#fe8989"/>
      <stop offset="0.44313725490196076" stop-color="#fe2a2a"/>
      <stop offset="1.0" stop-color="#ac0202"/>
    </radialGradient>
  </defs>
</svg>
