<?xml version="1.0" encoding="UTF-8" standalone="no"?>
<svg xmlns:xlink="http://www.w3.org/1999/xlink" height="22.6px" width="51.1px" xmlns="http://www.w3.org/2000/svg">
  <g transform="matrix(1.0, 0.0, 0.0, 1.0, 25.65, 21.5)">
    <path d="M17.0 -16.85 L16.95 -16.85 22.45 -18.4 22.9 -18.4 24.65 -18.1 Q25.05 -18.05 25.3 -17.7 L25.45 -16.95 25.3 -16.05 25.1 -15.6 25.1 -15.35 24.85 -14.75 24.3 -14.4 19.5 -13.5 15.65 -11.65 Q11.85 -9.0 8.3 -6.0 L8.35 -6.05 6.65 -4.45 6.65 -4.5 6.05 -3.9 8.9 -0.55 9.1 0.15 8.8 0.85 8.1 1.1 -9.35 1.05 -10.05 0.75 -10.35 0.05 -10.05 -0.65 -6.8 -3.85 -9.4 -5.65 -9.7 -5.4 -10.4 -5.05 -10.8 -4.95 -11.2 -5.0 -13.2 -5.85 -13.25 -5.85 -13.35 -5.9 -15.25 -6.7 Q-15.6 -6.85 -15.75 -7.15 L-15.8 -7.2 Q-20.4 -4.8 -24.6 -8.2 L-24.9 -8.65 Q-26.65 -13.3 -24.3 -16.15 L-24.0 -16.35 -21.95 -17.6 -21.9 -17.6 Q-19.95 -18.65 -18.5 -18.65 L-18.45 -18.65 Q-13.45 -18.4 -8.95 -16.15 L-2.4 -19.1 -2.3 -19.85 -2.0 -20.45 -1.5 -20.95 -1.35 -21.05 -1.3 -21.1 Q-1.0 -21.4 -0.6 -21.4 L0.1 -21.4 0.25 -21.45 0.7 -21.5 1.1 -21.3 1.35 -21.15 1.85 -21.0 2.4 -20.55 2.8 -19.9 2.95 -19.5 2.9 -19.1 2.9 -19.0 2.95 -18.95 3.4 -18.7 6.05 -16.05 6.2 -15.9 6.25 -15.9 14.8 -16.3 14.75 -16.3 17.0 -16.85 M-20.85 -11.35 Q-16.8 -9.95 -12.75 -11.8 L-11.75 -12.4 -11.6 -12.45 -11.65 -12.55 -11.9 -12.95 Q-15.9 -14.5 -19.95 -14.45 L-20.9 -13.15 -20.85 -11.35" fill="#000000" fill-rule="evenodd" stroke="none"/>
    <path d="M11.95 -13.45 L12.0 -12.4 13.65 -13.05 12.85 -12.05 15.3 -12.45 Q11.4 -9.8 7.8 -6.75 L6.1 -5.15 Q6.6 -6.2 6.45 -7.1 L5.7 -7.3 8.15 -9.9 2.05 -3.85 4.2 -1.8 -0.15 0.1 -9.2 0.1 -5.1 -3.95 -4.85 -3.95 Q-5.15 -2.6 -6.2 -2.0 L-7.3 -1.25 1.95 -1.15 1.5 -2.95 1.85 -3.6 -2.35 -4.05 Q3.2 -6.5 7.85 -10.4 L7.4 -11.3 7.25 -11.55 Q6.5 -12.9 5.15 -13.7 L4.6 -14.05 11.35 -14.0 9.6 -13.0 10.15 -12.85 11.95 -13.45 M15.25 -13.55 L17.45 -14.7 17.8 -15.3 23.0 -16.85 22.9 -17.4 24.6 -17.1 24.45 -16.2 23.7 -16.1 24.25 -15.35 19.25 -14.4 19.9 -14.7 15.25 -13.55 M1.15 -14.6 L-2.85 -14.85 -3.8 -15.3 -5.15 -15.3 -6.35 -15.95 -1.35 -18.4 -1.15 -19.7 -0.75 -19.15 -0.2 -19.4 -0.65 -20.15 -0.45 -20.35 0.4 -20.35 1.0 -19.25 0.8 -18.2 1.4 -18.95 1.05 -20.2 1.7 -20.0 2.1 -19.35 1.75 -18.2 2.25 -18.1 2.7 -16.25 1.3 -15.05 1.15 -14.6 M-0.65 -13.5 L6.4 -11.15 Q5.05 -9.4 3.0 -8.6 L2.05 -8.1 0.1 -7.55 -2.05 -7.85 Q-1.65 -8.05 -1.3 -8.3 L-5.05 -7.95 -5.85 -10.35 -1.45 -10.3 0.1 -11.35 -0.65 -13.5 M4.1 -14.75 L4.3 -15.25 3.65 -16.6 3.2 -16.8 2.85 -17.95 5.5 -15.3 4.1 -14.75 M5.45 -3.15 L8.25 0.15 5.5 0.1 5.45 -3.15 M-22.4 -15.25 L-21.95 -15.3 -22.5 -14.9 -22.4 -15.25 M-22.85 -12.9 L-21.75 -13.45 -21.7 -10.6 -22.85 -12.9 M-20.35 -15.4 L-14.6 -16.05 -10.0 -14.05 -8.95 -14.25 -9.4 -12.95 -10.4 -12.5 -11.05 -13.7 Q-15.6 -15.6 -20.35 -15.4 M-23.8 -8.95 L-21.9 -9.1 -21.55 -9.1 -16.9 -8.75 -20.05 -7.9 -15.05 -8.65 -16.0 -8.1 Q-20.1 -5.9 -23.8 -8.95 M-1.75 -17.75 L-4.05 -16.6 -3.2 -16.25 -2.3 -16.05 -1.2 -17.45 -1.75 -17.75 M-12.75 -6.75 L-14.75 -7.6 -11.85 -7.8 -11.1 -8.65 -13.5 -8.9 -11.1 -9.2 -10.55 -8.55 -10.75 -7.95 Q-11.3 -6.45 -12.75 -6.75 M-12.65 -6.7 L-11.4 -6.55 -10.2 -7.1 -9.75 -9.9 -9.7 -10.9 -8.6 -8.9 -9.5 -7.05 -10.0 -6.25 -10.7 -5.9 -12.65 -6.7" fill="#000000" fill-rule="evenodd" stroke="none"/>
    <path d="M13.65 -13.05 L12.0 -12.4 11.95 -13.45 13.05 -13.0 17.8 -15.3 17.45 -14.7 15.25 -13.55 13.65 -13.05 M11.35 -14.0 L4.6 -14.05 5.15 -13.7 Q6.5 -12.9 7.25 -11.55 L6.4 -11.15 -0.65 -13.5 -2.85 -14.85 1.15 -14.6 3.45 -14.55 5.8 -14.9 15.15 -15.3 17.35 -15.85 11.35 -14.0 M7.4 -11.3 L7.85 -10.4 Q3.2 -6.5 -2.35 -4.05 L1.85 -3.6 1.5 -2.95 1.95 -1.15 -7.3 -1.25 -6.2 -2.0 Q-5.15 -2.6 -4.85 -3.95 L-5.15 -3.95 -9.5 -7.05 -8.6 -8.9 -9.7 -10.9 -9.75 -9.9 -10.2 -7.1 -11.4 -6.55 -12.65 -6.7 -12.75 -6.75 Q-11.3 -6.45 -10.75 -7.95 L-10.55 -8.55 -11.1 -9.2 -12.4 -10.05 -16.9 -8.75 -21.55 -9.1 -23.2 -10.45 -21.9 -9.1 -23.8 -8.95 Q-25.35 -13.0 -23.35 -15.45 L-22.4 -15.25 -22.5 -14.9 -22.85 -12.9 -21.7 -10.6 Q-16.85 -8.65 -12.1 -10.9 L-10.8 -11.65 -10.4 -12.5 -9.4 -12.95 -8.95 -14.25 -10.0 -14.05 -14.6 -16.05 -21.3 -16.7 Q-19.6 -17.6 -18.35 -17.6 -13.3 -17.35 -8.85 -15.0 L-6.35 -15.95 -5.15 -15.3 -5.85 -10.35 -5.05 -7.95 -7.7 -7.5 -5.1 -6.1 0.1 -7.55 2.05 -8.1 2.45 -8.25 1.4 -7.05 7.4 -11.3 M-1.0 -2.6 L-4.65 -3.15 -4.85 -2.75 Q-3.65 -1.3 -1.85 -1.85 L-1.1 -2.0 -1.0 -2.6" fill="#666666" fill-rule="evenodd" stroke="none"/>
    <path d="M17.8 -15.3 L13.05 -13.0 11.95 -13.45 10.15 -12.85 9.6 -13.0 11.35 -14.0 17.35 -15.85 22.9 -17.4 23.0 -16.85 17.8 -15.3 M-2.85 -14.85 L-0.65 -13.5 0.1 -11.35 -1.45 -10.3 -5.85 -10.35 -5.15 -15.3 -3.8 -15.3 -2.85 -14.85 M-0.65 -20.15 L-0.2 -19.4 -0.75 -19.15 -1.15 -19.7 -0.65 -20.15 M-22.5 -14.9 L-21.95 -15.3 -22.4 -15.25 -23.35 -15.45 -21.3 -16.7 -14.6 -16.05 -20.35 -15.4 -21.75 -13.45 -22.85 -12.9 -22.5 -14.9 M-1.75 -17.75 L-1.2 -17.45 -2.3 -16.05 -3.2 -16.25 -4.05 -16.6 -1.75 -17.75 M-1.0 -2.6 L-1.1 -2.0 -1.85 -1.85 Q-3.65 -1.3 -4.85 -2.75 L-4.65 -3.15 -1.0 -2.6" fill="#ffffff" fill-rule="evenodd" stroke="none"/>
    <path d="M13.65 -13.05 L15.25 -13.55 19.9 -14.7 19.25 -14.4 15.3 -12.45 12.85 -12.05 13.65 -13.05 M7.25 -11.55 L7.4 -11.3 1.4 -7.05 2.45 -8.25 2.05 -8.1 3.0 -8.6 Q5.05 -9.4 6.4 -11.15 L7.25 -11.55 M-0.15 0.1 L4.2 -1.8 2.05 -3.85 8.15 -9.9 5.7 -7.3 6.45 -7.1 Q6.6 -6.2 6.1 -5.15 L4.8 -3.95 5.45 -3.15 5.5 0.1 -0.15 0.1 M3.45 -14.55 L1.15 -14.6 1.3 -15.05 2.7 -16.25 2.25 -18.1 2.85 -17.95 3.2 -16.8 3.65 -16.6 4.3 -15.25 4.1 -14.75 3.45 -14.55 M1.05 -20.2 L1.4 -18.95 0.8 -18.2 1.0 -19.25 0.4 -20.35 0.7 -20.45 1.05 -20.2 M0.1 -7.55 L-5.1 -6.1 -7.7 -7.5 -5.05 -7.95 -1.3 -8.3 Q-1.65 -8.05 -2.05 -7.85 L0.1 -7.55 M-15.05 -8.65 L-20.05 -7.9 -16.9 -8.75 -12.4 -10.05 -11.1 -9.2 -13.5 -8.9 -15.05 -8.65 M-21.55 -9.1 L-21.9 -9.1 -23.2 -10.45 -21.55 -9.1" fill="#cccccc" fill-rule="evenodd" stroke="none"/>
    <path d="M5.8 -14.9 L3.45 -14.55 4.1 -14.75 5.5 -15.3 5.8 -14.9" fill="url(#gradient0)" fill-rule="evenodd" stroke="none"/>
    <path d="M-4.85 -3.95 L-5.1 -3.95 -5.15 -3.95 -4.85 -3.95" fill="url(#gradient1)" fill-rule="evenodd" stroke="none"/>
  </g>
  <defs>
    <linearGradient gradientTransform="matrix(0.0074, -2.0E-4, 1.0E-4, 0.0036, -0.3, -17.35)" gradientUnits="userSpaceOnUse" id="gradient0" spreadMethod="pad" x1="-819.2" x2="819.2">
      <stop offset="0.0" stop-color="#f8bc0c"/>
      <stop offset="1.0" stop-color="#ffffff"/>
    </linearGradient>
    <linearGradient gradientTransform="matrix(0.0104, -3.0E-4, 1.0E-4, 0.0031, -0.6, -1.6)" gradientUnits="userSpaceOnUse" id="gradient1" spreadMethod="pad" x1="-819.2" x2="819.2">
      <stop offset="0.0" stop-color="#f8bc0c"/>
      <stop offset="1.0" stop-color="#ffffff"/>
    </linearGradient>
  </defs>
</svg>
