<?xml version="1.0" encoding="UTF-8" standalone="no"?>
<svg
   xmlns:dc="http://purl.org/dc/elements/1.1/"
   xmlns:cc="http://creativecommons.org/ns#"
   xmlns:rdf="http://www.w3.org/1999/02/22-rdf-syntax-ns#"
   xmlns:svg="http://www.w3.org/2000/svg"
   xmlns="http://www.w3.org/2000/svg"
   xmlns:sodipodi="http://sodipodi.sourceforge.net/DTD/sodipodi-0.dtd"
   xmlns:inkscape="http://www.inkscape.org/namespaces/inkscape"
   height="26.302801"
   width="38.099979"
   version="1.1"
   id="svg26"
   sodipodi:docname="2408.svg"
   inkscape:version="0.92.1 r15371">
  <metadata
     id="metadata32">
    <rdf:RDF>
      <cc:Work
         rdf:about="">
        <dc:format>image/svg+xml</dc:format>
        <dc:type
           rdf:resource="http://purl.org/dc/dcmitype/StillImage" />
        <dc:title></dc:title>
      </cc:Work>
    </rdf:RDF>
  </metadata>
  <defs
     id="defs30" />
  <sodipodi:namedview
     pagecolor="#ffffff"
     bordercolor="#666666"
     borderopacity="1"
     objecttolerance="10"
     gridtolerance="10"
     guidetolerance="10"
     inkscape:pageopacity="0"
     inkscape:pageshadow="2"
     inkscape:window-width="1920"
     inkscape:window-height="1016"
     id="namedview28"
     showgrid="false"
     inkscape:object-nodes="false"
     inkscape:pagecheckerboard="true"
     fit-margin-top="0"
     fit-margin-left="0"
     fit-margin-right="0"
     fit-margin-bottom="0"
     inkscape:zoom="11.69873"
     inkscape:cx="29.190501"
     inkscape:cy="7.9751179"
     inkscape:window-x="0"
     inkscape:window-y="27"
     inkscape:window-maximized="1"
     inkscape:current-layer="svg26" />
  <g
     transform="matrix(1.1173015,0,0,1.1173015,19.217586,24.962039)"
     id="g4">
    <path
       style="fill:#000000;fill-rule:evenodd;stroke:none"
       inkscape:connector-curvature="0"
       d="m 12,-11.5 q 1.5,0.85 2.45,2.35 l 0.05,0.25 0.6,2.4 1.35,0.65 0.35,0.35 0.1,0.5 -0.8,3.35 L 15.8,-1.2 14.1,0.2 13.85,0.3 13.5,0.35 12.05,0.1 10.8,0.65 10.25,0.75 8.95,0.4 7.65,0.85 H 7.2 L 5.45,0.5 4.5,0.85 4.15,0.9 3.8,0.75 3.15,0.35 2.4,0.6 H 2.1 L 1.75,0.5 1.15,0.1 0.15,0.5 -0.25,0.55 -0.6,0.45 -2.2,-0.8 -7,1.1 -7.35,1.2 -7.7,1.1 -8.4,0.65 -9.75,0.9 h -0.4 l -0.35,-0.2 -1.65,-1.8 q -0.2,-0.2 -0.2,-0.55 l 0.1,-1.05 v -0.1 l 0.15,-0.6 0.5,-7.15 -2.45,-6.05 -2.9,-2.15 -0.25,-0.35 v -0.5 l 0.25,-0.5 0.05,-0.05 0.65,-0.45 0.15,-0.05 q 9.6,-3.05 19.15,-0.6 1.9,0.45 1.85,1.85 l -0.15,0.45 -0.35,0.3 -2.1,0.75 0.25,0.1 0.2,0.25 1.65,2.95 0.1,0.4 -0.15,0.4 -0.3,0.3 -3.55,1.55 0.35,0.45 0.65,0.45 2.2,0.4 2,-0.75 q 1.7,-0.75 3.5,-0.75 1.55,-0.05 2.8,0.65"
       id="path2" />
  </g>
  <g
     transform="matrix(0.94644556,-0.05846597,0.05846597,0.94644556,19.60362,16.369027)"
     id="g24">
    <path
       d="m -15.85,-12.15 -3.5,-3 0.1,-0.2 0.65,-0.4 q 11.55,-2.85 22.65,0.75 1.45,0.45 1.4,1.45 l -5.5,1.55 -2.05,2.1 q -3,0.4 -1.4,-1.65 l -2.65,2.55 3.55,-0.4 -3.35,2.5 2.2,-0.6 1.35,0.65 -2.55,1.35 2.3,0.05 -0.45,2.4 3.4,-0.55 0.95,0.8 -2.55,1.3 1.35,1.65 2.2,-0.65 2,-1.55 2.9,-0.85 q 1.85,-0.7 3.8,-0.6 1.65,0.05 2.95,0.85 1.55,1 2.35,2.7 -0.5,1.3 -1.65,2.15 -1.65,1.2 -3.4,1.75 L 7.35,4.3 3.9,3.55 Q 1.95,2.8 -0.05,2.75 -1.95,2.6 -3.95,3.2 l -3.6,1.15 -1.7,0.2 q -1.05,-0.9 -1.3,-2.2 -0.2,-0.95 0.15,-1.9 L -8.95,-2.1 -6,-3.5 q -2.2,-1.3 -2.6,-3.8 -0.25,-1.25 0.15,-2.6 l 0.35,-1.15 2.9,-1.45 q -4.65,-1.25 -9.5,0 l -1.15,0.35 m 14.95,6.8 0.4,0.8 L -2,-4.6 q -1.1,-2.2 1.1,-0.75 m 8.15,3.15 q -0.9,0.4 -0.9,1 0,0.6 0.9,1.05 0.8,0.4 2.1,0.4 l 2.15,-0.4 q 0.8,-0.45 0.8,-1.05 0,-0.6 -0.8,-1 L 9.35,-2.65 7.25,-2.2 M -2.6,-9.4 q 1.55,0.35 0.3,0.85 -1.3,0.5 -0.3,-0.85"
       id="path14"
       inkscape:connector-curvature="0"
       style="fill:#996600;fill-rule:evenodd;stroke:none" />
    <path
       d="m -14.45,5.15 0.1,0.3 -0.35,-0.05 0.2,-0.45 0.05,0.2 M -11.4,7.4 -5.15,6.8 -2.1,6.55 5.75,8.6 q 5.35,0.9 10.5,-1.3 2.95,-1.25 0.6,-3.1 l 0.05,-0.65 1.95,1 -1.2,4 -2.15,1.5 -2,-0.5 -1.9,0.8 L 9.8,9.75 7.9,10.25 5.55,9.55 4.05,10 2.95,9.2 1.65,9.5 0.6,8.75 -1.15,9.25 -3.4,7.35 -9.85,9.45 -11,8.65 l -2,0.3 -1.8,-2.2 1.6,0.8 1.8,-0.15"
       id="path16"
       inkscape:connector-curvature="0"
       style="fill:#000000;fill-rule:evenodd;stroke:none" />
    <path
       d="m -15.85,-12.15 1.15,-0.35 q 4.85,-1.25 9.5,0 l -2.9,1.45 -0.35,1.15 q -0.4,1.35 -0.15,2.6 0.4,2.5 2.6,3.8 l -2.95,1.4 -1.45,2.55 q -0.35,0.95 -0.15,1.9 0.25,1.3 1.3,2.2 l 1.7,-0.2 3.6,-1.15 q 2,-0.6 3.9,-0.45 2,0.05 3.95,0.8 L 7.35,4.3 11.2,3.95 Q 12.95,3.4 14.6,2.2 15.75,1.35 16.25,0.05 L 16.9,3.55 16.85,4.2 15.2,6.85 -2.45,5.05 -5.15,6.8 -11.4,7.4 -12.1,7.3 Q -13.75,7 -14.35,5.45 l -0.1,-0.3 1.25,-9.35 -2.65,-7.95 m 20.1,10.1 -2,1.55 -2.2,0.65 -1.35,-1.65 2.55,-1.3 3,0.75 M 0.3,-3.6 l -3.4,0.55 0.45,-2.4 -2.3,-0.05 2.55,-1.35 -1.35,-0.65 -2.2,0.6 3.35,-2.5 -3.55,0.4 2.65,-2.55 q -1.6,2.05 1.4,1.65 l 2.05,-2.1 2.9,0.9 1.75,3.75 -5.5,2 Q -3.1,-6.8 -2,-4.6 l 1.5,0.05 0.8,0.95 m -2.9,-5.8 q -1,1.35 0.3,0.85 1.25,-0.5 -0.3,-0.85"
       id="path18"
       inkscape:connector-curvature="0"
       style="fill:#583701;fill-rule:evenodd;stroke:none" />
    <path
       d="m -14.35,5.45 q 0.6,1.55 2.25,1.85 l 0.7,0.1 -1.8,0.15 -1.6,-0.8 0.1,-1.35 0.35,0.05 m 9.2,1.35 2.7,-1.75 17.65,1.8 1.65,-2.65 Q 19.2,6.05 16.25,7.3 11.1,9.5 5.75,8.6 L -2.1,6.55 -5.15,6.8"
       id="path20"
       inkscape:connector-curvature="0"
       style="fill:#999999;fill-rule:evenodd;stroke:none" />
    <path
       d="m 7.25,-2.2 2.1,-0.45 2.15,0.45 q 0.8,0.4 0.8,1 0,0.6 -0.8,1.05 l -2.15,0.4 q -1.3,0 -2.1,-0.4 -0.9,-0.45 -0.9,-1.05 0,-0.6 0.9,-1"
       id="path22"
       inkscape:connector-curvature="0"
       style="fill:#ffffcc;fill-rule:evenodd;stroke:none" />
  </g>
</svg>
