<?xml version="1.0" encoding="UTF-8" standalone="no"?>
<svg xmlns:xlink="http://www.w3.org/1999/xlink" height="22.0px" width="20.4px" xmlns="http://www.w3.org/2000/svg">
  <g transform="matrix(1.0, 0.0, 0.0, 1.0, 10.1, 20.9)">
    <path d="M5.3 -19.4 L5.3 -19.45 Q7.5 -18.05 8.8 -15.65 L8.8 -15.7 10.2 -12.1 Q10.45 -10.7 10.2 -9.35 L10.0 -8.95 8.45 -7.75 Q6.95 -7.0 5.45 -6.75 L5.75 -6.0 5.75 -6.05 Q6.85 -3.1 4.7 -0.85 L4.65 -0.85 Q2.55 1.3 -0.4 1.1 L-0.5 1.1 Q-2.85 0.75 -4.55 -0.95 L-4.65 -1.1 Q-5.1 -1.7 -5.35 -2.45 L-5.55 -4.1 -5.55 -4.15 Q-5.4 -5.7 -4.55 -7.0 L-5.35 -7.1 -5.5 -7.15 -7.35 -7.8 Q-9.45 -8.75 -9.9 -10.3 -10.45 -11.85 -9.3 -13.9 -8.15 -16.1 -6.55 -17.6 -4.5 -19.55 -1.7 -20.35 L1.2 -20.85 1.4 -20.85 Q3.45 -20.7 5.3 -19.4" fill="#000000" fill-rule="evenodd" stroke="none"/>
    <path d="M-2.8 -7.5 Q-0.9 -9.45 1.75 -8.6 4.0 -7.95 4.8 -5.65 5.7 -3.3 3.95 -1.5 2.15 0.3 -0.35 0.15 -2.4 -0.15 -3.85 -1.6 -1.2 -0.95 0.6 -2.9 L1.45 -4.2 2.05 -5.9 1.55 -6.4 Q-0.9 -6.15 -3.1 -7.15 L-2.8 -7.5" fill="#cccccc" fill-rule="evenodd" stroke="none"/>
    <path d="M-2.8 -7.5 L-3.1 -7.15 Q-0.9 -6.15 1.55 -6.4 L2.05 -5.9 1.45 -4.2 0.6 -2.9 Q-1.2 -0.95 -3.85 -1.6 L-4.4 -2.75 -4.55 -4.0 Q-4.35 -6.0 -2.8 -7.5" fill="#ffffff" fill-rule="evenodd" stroke="none"/>
    <path d="M1.3 -19.8 L1.3 -19.2 3.4 -16.9 Q1.5 -16.5 1.85 -14.45 2.0 -13.7 2.45 -13.15 3.3 -11.95 4.45 -11.7 4.0 -9.1 1.35 -8.5 L-2.8 -8.15 -5.2 -8.05 -6.95 -8.7 Q-10.2 -10.1 -8.45 -13.4 -7.4 -15.45 -5.9 -16.8 L-5.35 -16.4 Q-4.1 -15.6 -2.55 -15.75 -1.15 -15.95 -1.0 -17.2 -0.8 -18.5 -1.4 -19.35 L1.3 -19.8 M-5.0 -12.3 L-5.1 -11.6 Q-4.4 -9.1 -1.45 -9.1 -0.75 -9.1 -0.25 -9.5 0.25 -10.0 0.3 -10.7 0.4 -13.7 -2.75 -13.55 -4.3 -13.6 -5.0 -12.3" fill="#6699cc" fill-rule="evenodd" stroke="none"/>
    <path d="M-1.4 -19.35 Q-0.8 -18.5 -1.0 -17.2 -1.15 -15.95 -2.55 -15.75 -4.1 -15.6 -5.35 -16.4 L-5.9 -16.8 Q-4.0 -18.6 -1.4 -19.35 M4.45 -11.7 Q3.3 -11.95 2.45 -13.15 2.0 -13.7 1.85 -14.45 1.5 -16.5 3.4 -16.9 L3.9 -15.55 Q4.55 -13.6 4.6 -11.7 L4.45 -11.7 M-5.0 -12.3 Q-4.3 -13.6 -2.75 -13.55 0.4 -13.7 0.3 -10.7 0.25 -10.0 -0.25 -9.5 -0.75 -9.1 -1.45 -9.1 -4.4 -9.1 -5.1 -11.6 L-5.0 -12.3" fill="#ffffff" fill-rule="evenodd" stroke="none"/>
    <path d="M3.4 -16.9 L1.3 -19.2 1.3 -19.8 Q3.1 -19.65 4.75 -18.55 6.75 -17.3 7.9 -15.15 8.8 -13.55 9.2 -11.85 9.45 -10.65 9.2 -9.55 8.7 -8.95 8.0 -8.6 5.85 -7.5 3.6 -7.65 1.15 -7.6 -1.2 -7.7 L-5.2 -8.05 -2.8 -8.15 1.35 -8.5 Q4.0 -9.1 4.45 -11.7 L4.6 -11.7 Q5.65 -11.3 6.75 -12.25 L6.95 -13.1 6.85 -14.05 Q5.9 -16.5 3.4 -16.9" fill="#666699" fill-rule="evenodd" stroke="none"/>
    <path d="M3.4 -16.9 Q5.9 -16.5 6.85 -14.05 L6.95 -13.1 6.75 -12.25 Q5.65 -11.3 4.6 -11.7 4.55 -13.6 3.9 -15.55 L3.4 -16.9" fill="#cccccc" fill-rule="evenodd" stroke="none"/>
  </g>
</svg>
