<?xml version="1.0" encoding="UTF-8" standalone="no"?>
<svg xmlns:xlink="http://www.w3.org/1999/xlink" height="19.7px" width="22.8px" xmlns="http://www.w3.org/2000/svg">
  <g transform="matrix(1.0, 0.0, 0.0, 1.0, 11.3, 19.05)">
    <path d="M0.65 -12.65 Q1.7 -13.8 2.95 -13.6 L4.65 -12.1 3.3 -9.4 1.9 -8.95 6.1 -8.55 6.55 -8.2 Q7.8 -8.15 8.9 -7.4 L10.1 -7.7 Q11.7 -6.95 11.5 -5.35 10.35 -3.5 8.4 -2.9 L9.3 -1.5 8.65 -0.25 8.25 -0.1 7.15 0.45 Q5.95 0.9 4.65 0.45 L2.75 0.25 Q2.05 0.0 1.5 -0.4 -0.95 -2.25 -2.3 -5.05 -3.1 -3.7 -4.55 -3.1 -5.85 -3.3 -6.75 -4.1 -6.7 -5.45 -6.25 -6.75 L-7.9 -7.3 Q-8.85 -7.6 -9.55 -8.25 -11.9 -10.65 -11.1 -13.85 -10.2 -17.55 -6.75 -18.7 -3.75 -19.7 -1.2 -17.7 L1.6 -13.85 -0.45 -12.85 -0.7 -11.05 0.65 -12.65" fill="#430101" fill-opacity="0.8" fill-rule="evenodd" stroke="none"/>
    <path d="M-2.9 -9.15 L-2.95 -8.95 Q-4.65 -6.85 -7.05 -7.55 -9.3 -8.25 -10.4 -10.2 -11.2 -11.6 -10.85 -13.25 -10.25 -16.25 -7.6 -17.65 -5.05 -18.85 -2.4 -18.15 L-1.85 -17.65 1.1 -14.1 0.65 -13.65 Q0.0 -13.0 -0.95 -13.4 L-2.8 -16.55 -3.45 -15.9 -4.05 -15.05 -5.35 -13.35 -4.95 -14.3 Q-4.85 -14.65 -5.65 -14.75 L-6.3 -15.0 -5.05 -15.05 -6.35 -15.25 -5.0 -15.4 -6.0 -16.3 -3.85 -16.55 -4.85 -17.15 -3.45 -17.5 -4.75 -17.75 -5.3 -17.8 -6.3 -17.5 -5.75 -16.9 -7.6 -16.7 -5.9 -15.65 -7.75 -15.45 -6.4 -14.2 -7.75 -14.15 -7.9 -13.95 -7.9 -13.9 -8.55 -13.5 -8.55 -13.05 -8.65 -13.1 -8.8 -13.1 -8.95 -12.6 -8.65 -11.95 -9.2 -12.15 -8.65 -10.3 -8.9 -11.55 -8.1 -11.45 -8.25 -12.2 -7.45 -12.2 -7.75 -13.0 -7.0 -13.15 -7.65 -13.95 -5.95 -13.9 -7.25 -15.15 -6.7 -15.2 -5.5 -14.5 -4.95 -14.3 -6.05 -12.65 -6.55 -11.75 -6.9 -11.05 -6.3 -10.45 -5.7 -10.15 -3.3 -9.35 -2.9 -9.15 M-3.25 -8.2 L-2.7 -8.6 -2.8 -8.45 -3.25 -8.2" fill="#ffd5ea" fill-rule="evenodd" stroke="none"/>
    <path d="M-4.05 -15.05 L-3.45 -15.9 -2.8 -16.55 -0.95 -13.4 Q0.0 -13.0 0.65 -13.65 L1.1 -14.1 -1.85 -17.65 -2.4 -18.15 Q-5.05 -18.85 -7.6 -17.65 -10.25 -16.25 -10.85 -13.25 -11.2 -11.6 -10.4 -10.2 -9.3 -8.25 -7.05 -7.55 -4.65 -6.85 -2.95 -8.95 L-2.9 -9.15 -3.0 -9.3 -3.3 -9.4 -6.3 -10.45 -6.9 -11.05 -6.55 -11.75 -6.05 -12.65 -4.95 -14.3 -5.5 -14.5 -6.7 -15.2 -6.35 -15.25 -5.05 -15.05 -6.3 -15.0 -5.65 -14.75 Q-4.85 -14.65 -4.95 -14.3 L-5.35 -13.35 -6.35 -11.3 -6.65 -10.8 -3.2 -9.5 -3.0 -9.45 -1.95 -9.1 -2.7 -8.6 -3.25 -8.2 -3.95 -7.8 -4.0 -7.7 -3.95 -7.5 Q-5.6 -6.8 -6.1 -5.05 L-6.4 -4.15 -4.35 -3.65 -3.0 -5.05 -2.6 -5.6 -2.5 -5.6 -2.0 -5.55 -1.6 -4.6 -1.55 -4.6 0.85 -1.15 1.35 -0.55 Q2.4 0.0 3.65 -0.1 L4.55 -0.1 7.65 -0.5 8.45 -0.9 8.35 -1.7 8.1 -2.5 7.35 -2.6 6.85 -1.5 5.55 -0.45 6.05 -1.05 8.05 -4.2 8.5 -6.6 8.5 -6.75 8.25 -7.25 7.65 -7.6 6.15 -7.55 6.05 -8.1 0.85 -8.4 -0.35 -5.95 -0.75 -5.45 -1.45 -4.8 -1.45 -4.9 -1.4 -4.9 -0.45 -6.05 -0.25 -6.45 -0.25 -6.5 -0.2 -6.55 0.65 -9.1 -0.2 -8.4 0.6 -9.4 -0.1 -9.95 -1.6 -10.7 -1.25 -11.3 Q-0.95 -12.05 -1.15 -12.9 -1.6 -14.75 -3.1 -16.05 L-4.05 -15.05 M0.65 -12.65 Q1.7 -13.8 2.95 -13.6 L4.65 -12.1 3.3 -9.4 1.9 -8.95 6.1 -8.55 6.55 -8.2 Q7.8 -8.15 8.9 -7.4 L10.1 -7.7 Q11.7 -6.95 11.5 -5.35 10.35 -3.5 8.4 -2.9 L9.3 -1.5 8.65 -0.25 8.25 -0.1 7.15 0.45 Q5.95 0.9 4.65 0.45 L2.75 0.25 Q2.05 0.0 1.5 -0.4 -0.95 -2.25 -2.3 -5.05 -3.1 -3.7 -4.55 -3.1 -5.85 -3.3 -6.75 -4.1 -6.7 -5.45 -6.25 -6.75 L-7.9 -7.3 Q-8.85 -7.6 -9.55 -8.25 -11.9 -10.65 -11.1 -13.85 -10.2 -17.55 -6.75 -18.7 -3.75 -19.7 -1.2 -17.7 L1.6 -13.85 -0.45 -12.85 -0.7 -11.05 0.65 -12.65 M8.7 -6.8 L8.35 -4.8 7.85 -3.5 Q9.65 -3.7 10.6 -5.3 L11.1 -6.3 10.4 -7.1 9.95 -7.25 8.7 -6.8 M3.45 -11.05 L3.95 -12.45 Q1.3 -13.6 0.0 -11.1 L-0.35 -10.4 0.65 -9.4 Q2.5 -9.4 3.45 -11.05 M-2.75 -13.4 L-2.75 -13.5 -2.15 -14.4 -2.75 -13.4 M-1.6 -10.65 L-2.1 -10.2 -3.0 -9.45 -1.6 -10.65 M-4.55 -10.7 L-4.05 -11.6 -3.4 -12.45 -4.55 -10.7 M-2.0 -7.8 L-1.45 -8.5 -1.85 -7.7 -2.5 -6.65 -3.15 -6.85 -3.65 -7.0 -3.9 -7.45 -3.8 -7.5 -2.6 -6.9 -2.0 -7.8" fill="#000000" fill-rule="evenodd" stroke="none"/>
    <path d="M-0.25 -6.45 L-0.45 -6.05 -0.5 -6.1 -0.25 -6.45 M-0.35 -5.95 L0.85 -8.4 6.05 -8.1 6.15 -7.55 7.65 -7.6 8.25 -7.25 8.5 -6.75 8.5 -6.6 8.05 -4.2 Q5.8 -4.4 3.7 -5.15 L3.05 -5.45 1.9 -5.95 Q2.75 -5.1 3.9 -4.6 L5.1 -3.95 1.9 -4.75 Q0.65 -5.1 -0.35 -5.95" fill="#ff99cc" fill-rule="evenodd" stroke="none"/>
    <path d="M-3.3 -9.35 L-5.7 -10.15 -6.3 -10.45 -3.3 -9.4 -3.3 -9.35 M-5.35 -13.35 L-4.05 -15.05 -3.1 -16.05 Q-1.6 -14.75 -1.15 -12.9 -0.95 -12.05 -1.25 -11.3 L-1.6 -10.7 -3.2 -9.5 -6.65 -10.8 -6.35 -11.3 -5.35 -13.35 M5.55 -0.45 L6.85 -1.5 7.35 -2.6 8.1 -2.5 8.35 -1.7 8.45 -0.9 7.65 -0.5 4.55 -0.1 5.55 -0.45 M-2.6 -5.6 L-3.0 -5.05 -4.35 -3.65 -6.4 -4.15 -6.1 -5.05 Q-5.6 -6.8 -3.95 -7.5 L-3.9 -7.45 -3.65 -7.0 -3.15 -6.85 -2.75 -6.55 -2.9 -6.1 -2.6 -5.6 M3.45 -11.05 Q2.5 -9.4 0.65 -9.4 L-0.35 -10.4 0.0 -11.1 Q1.3 -13.6 3.95 -12.45 L3.45 -11.05 M8.7 -6.8 L9.95 -7.25 10.4 -7.1 11.1 -6.3 10.6 -5.3 Q9.65 -3.7 7.85 -3.5 L8.35 -4.8 8.7 -6.8 M-2.75 -13.4 L-2.15 -14.4 -2.75 -13.5 -2.75 -13.4 M-4.55 -10.7 L-3.4 -12.45 -4.05 -11.6 -4.55 -10.7" fill="#ffcc99" fill-rule="evenodd" stroke="none"/>
    <path d="M-0.45 -6.05 L-1.4 -4.9 -0.5 -6.1 -0.45 -6.05 M-1.45 -4.8 L-0.75 -5.45 -0.35 -5.95 Q0.65 -5.1 1.9 -4.75 L5.1 -3.95 3.9 -4.6 Q2.75 -5.1 1.9 -5.95 L3.05 -5.45 3.7 -5.15 Q5.8 -4.4 8.05 -4.2 L6.05 -1.05 5.55 -0.45 4.55 -0.1 3.65 -0.1 Q2.4 0.0 1.35 -0.55 L0.85 -1.15 -1.55 -4.6 -1.55 -4.7 -1.45 -4.8" fill="#e1626f" fill-rule="evenodd" stroke="none"/>
    <path d="M-6.7 -15.2 L-7.25 -15.15 -5.95 -13.9 -7.65 -13.95 -7.0 -13.15 -7.75 -13.0 -7.45 -12.2 -8.25 -12.2 -8.1 -11.45 -8.9 -11.55 -8.65 -10.3 -9.2 -12.15 -8.65 -11.95 -8.95 -12.6 -8.8 -13.1 -8.65 -13.1 -8.55 -13.05 -8.55 -13.5 -7.9 -13.9 -7.9 -13.95 -7.75 -14.15 -6.4 -14.2 -7.75 -15.45 -5.9 -15.65 -7.6 -16.7 -5.75 -16.9 -6.3 -17.5 -5.3 -17.8 -4.75 -17.75 -3.45 -17.5 -4.85 -17.15 -3.85 -16.55 -6.0 -16.3 -5.0 -15.4 -6.35 -15.25 -6.7 -15.2" fill="#ffffff" fill-rule="evenodd" stroke="none"/>
    <path d="M-2.9 -9.15 L-3.3 -9.35 -3.3 -9.4 -3.0 -9.3 -2.9 -9.15 M-1.6 -10.7 L-0.1 -9.95 0.6 -9.4 -0.2 -8.4 0.65 -9.1 -0.2 -6.55 -0.25 -6.55 0.1 -8.15 -0.35 -8.2 -1.8 -6.7 -1.85 -7.7 -1.45 -8.5 -2.0 -7.8 -2.8 -8.45 -2.7 -8.6 -1.95 -9.1 -3.0 -9.45 -3.2 -9.5 -1.6 -10.7 M-2.5 -5.6 L-2.6 -5.6 -2.9 -6.1 -2.5 -5.6 M-3.95 -7.5 L-4.0 -7.7 -3.95 -7.8 -3.8 -7.5 -3.9 -7.45 -3.95 -7.5 M-1.6 -10.65 L-3.0 -9.45 -2.1 -10.2 -1.6 -10.65" fill="#ffff00" fill-rule="evenodd" stroke="none"/>
    <path d="M-0.25 -6.5 L-0.25 -6.45 -0.5 -6.1 -1.4 -4.9 -1.45 -4.9 -1.45 -4.8 -1.55 -4.7 -1.6 -4.6 -2.0 -5.55 -2.5 -5.6 -2.9 -6.1 -2.75 -6.55 -3.15 -6.85 -2.5 -6.65 -1.85 -7.7 -1.8 -6.7 -0.35 -8.2 0.1 -8.15 -0.25 -6.55 -0.25 -6.5 M-3.95 -7.8 L-3.25 -8.2 -2.8 -8.45 -2.0 -7.8 -2.6 -6.9 -3.8 -7.5 -3.95 -7.8" fill="#e4b80a" fill-rule="evenodd" stroke="none"/>
    <path d="M-0.2 -6.55 L-0.25 -6.5 -0.25 -6.55 -0.2 -6.55 M-1.55 -4.6 L-1.6 -4.6 -1.55 -4.7 -1.55 -4.6" fill="#cea80f" fill-rule="evenodd" stroke="none"/>
  </g>
</svg>
