<?xml version="1.0" encoding="UTF-8" standalone="no"?>
<svg xmlns:xlink="http://www.w3.org/1999/xlink" height="27.1px" width="39.3px" xmlns="http://www.w3.org/2000/svg">
  <g transform="matrix(1.0, 0.0, 0.0, 1.0, 20.7, 21.3)">
    <path d="M10.35 -21.25 L10.45 -21.25 Q11.8 -21.3 13.2 -20.45 L13.2 -20.4 14.7 -19.2 Q17.0 -16.85 16.2 -14.7 L16.0 -13.5 16.0 -13.45 Q16.6 -12.3 15.8 -11.35 L15.75 -11.3 15.5 -10.95 16.9 -9.8 Q19.2 -7.45 18.4 -5.3 18.1 -4.45 18.2 -4.1 L18.2 -4.05 Q18.8 -2.9 18.0 -1.95 L17.95 -1.9 17.45 -1.4 17.4 -1.35 15.6 -0.55 15.0 -0.15 14.95 -0.1 14.9 -0.05 14.5 0.05 14.45 0.05 12.65 0.5 12.45 0.6 12.4 0.6 11.8 0.7 Q10.5 1.3 8.65 1.6 L7.6 2.05 7.5 2.1 7.05 2.15 7.0 2.15 5.7 2.25 5.6 2.3 4.95 2.5 Q1.75 4.05 -0.3 4.3 L-0.35 4.3 -5.4 5.65 -5.7 5.75 -6.1 5.8 -6.65 5.75 -6.7 5.75 Q-8.55 5.9 -10.55 3.15 L-10.6 3.1 -10.65 3.0 -11.6 2.05 Q-12.65 1.25 -12.65 0.2 L-13.15 0.3 -13.45 0.4 -13.85 0.45 -14.4 0.4 -14.45 0.4 Q-16.3 0.55 -18.3 -2.2 L-18.35 -2.25 -18.4 -2.35 -19.35 -3.3 Q-20.5 -4.15 -20.4 -5.25 L-20.4 -5.3 Q-20.45 -6.4 -19.95 -7.8 L-20.25 -8.15 -20.3 -8.15 -20.55 -8.5 -20.6 -8.55 -20.7 -9.05 -20.7 -9.1 Q-20.8 -10.4 -19.6 -11.45 L-19.6 -11.6 -19.6 -11.65 Q-19.6 -12.6 -19.05 -13.05 L-19.0 -13.05 Q-18.55 -13.55 -17.55 -13.55 L-16.15 -13.35 -16.05 -13.4 -15.15 -13.65 Q-15.0 -14.65 -14.05 -15.5 L-14.05 -15.65 -14.05 -15.7 Q-14.05 -16.65 -13.5 -17.1 L-13.45 -17.1 Q-13.0 -17.6 -12.0 -17.6 L-10.6 -17.4 -10.5 -17.45 -5.4 -18.8 -5.2 -18.9 5.45 -20.55 10.35 -21.25 M15.3 -11.05 L15.35 -11.05 15.3 -10.9 15.25 -10.8 15.5 -10.95 15.3 -11.05" fill="#000000" fill-rule="evenodd" stroke="none"/>
    <path d="M-8.65 -4.9 L-8.95 -4.9 Q-9.75 -4.9 -10.55 -5.6 L-11.1 -6.1 -11.2 -6.25 -11.85 -7.1 -12.0 -7.3 -13.1 -8.35 Q-13.6 -8.7 -13.65 -9.2 L-13.65 -9.3 -13.45 -10.8 -13.3 -11.45 -13.25 -11.55 -13.25 -11.6 -13.15 -11.85 -13.35 -12.5 -13.65 -12.8 -13.95 -13.15 -13.95 -13.2 Q-13.9 -14.25 -12.7 -15.05 L-12.85 -15.7 Q-12.85 -16.35 -12.05 -16.35 L-10.65 -16.05 -10.2 -16.25 -5.05 -17.65 8.85 -19.8 10.3 -20.0 11.6 -19.8 Q12.7 -19.4 13.75 -18.3 15.45 -16.6 14.95 -15.1 14.45 -13.6 14.8 -12.95 15.15 -12.4 14.55 -11.95 L14.25 -12.15 12.5 -11.4 12.0 -11.35 12.75 -12.05 14.75 -12.7 12.5 -12.15 11.05 -11.15 11.2 -11.1 11.0 -10.9 10.8 -11.05 9.95 -10.85 9.6 -10.85 9.35 -10.85 6.35 -10.6 5.75 -10.5 4.65 -10.15 5.35 -10.5 9.55 -11.75 10.05 -11.9 10.35 -12.0 10.05 -12.05 9.5 -12.0 Q7.1 -11.9 4.25 -10.45 L2.05 -9.9 0.9 -9.5 0.2 -9.2 -0.5 -8.85 -0.35 -8.85 0.05 -8.75 0.0 -8.7 0.35 -8.6 Q0.85 -8.6 1.2 -8.85 L1.25 -8.95 1.15 -9.05 2.3 -9.45 3.3 -9.7 4.25 -9.95 4.0 -9.85 4.2 -9.8 4.65 -9.9 5.3 -10.2 5.65 -10.1 5.9 -10.1 6.45 -10.2 6.85 -10.3 7.15 -10.3 9.05 -10.35 8.0 -9.9 6.25 -9.6 4.8 -9.0 3.4 -8.8 4.2 -8.95 3.85 -9.0 3.8 -9.0 0.05 -8.0 -0.6 -7.8 -1.5 -7.5 -3.05 -7.05 -4.4 -6.55 -5.15 -6.25 -5.4 -6.15 -5.55 -6.1 -5.75 -6.05 -7.0 -5.8 Q-8.5 -5.5 -8.75 -5.2 L-8.8 -5.1 -8.65 -4.9 M12.8 -11.1 L12.0 -10.55 10.0 -10.05 9.2 -9.95 9.4 -10.1 10.25 -10.25 12.8 -11.1 M2.9 -8.3 L2.25 -8.05 2.5 -8.2 2.9 -8.3 M7.25 -14.0 L6.85 -14.05 Q6.45 -14.05 6.45 -13.65 L6.5 -13.3 Q6.65 -13.0 7.15 -13.0 L7.25 -13.0 Q7.85 -13.05 7.85 -13.55 7.85 -13.95 7.25 -14.0 M7.75 -16.3 L7.7 -16.1 7.7 -16.0 7.3 -15.75 7.3 -15.9 7.75 -16.3 M8.2 -16.75 L8.05 -16.6 8.0 -16.55 8.15 -16.75 8.2 -16.75 M5.0 -13.45 L4.85 -13.45 Q4.3 -13.45 4.3 -12.95 4.3 -12.45 4.85 -12.45 5.25 -12.45 5.4 -12.7 L5.4 -12.95 Q5.4 -13.4 5.0 -13.45 M1.55 -12.95 Q1.55 -13.4 0.95 -13.4 -0.6 -13.4 -0.6 -12.7 -0.6 -12.35 -0.15 -12.35 1.55 -12.35 1.55 -12.95 M10.25 -13.5 Q12.05 -13.5 12.05 -14.05 12.05 -14.55 11.1 -14.55 9.8 -14.55 9.8 -13.95 9.8 -13.5 10.25 -13.5 M14.1 -16.7 Q14.1 -17.1 13.7 -17.1 13.35 -17.1 13.35 -16.7 13.35 -16.3 13.7 -16.3 14.1 -16.3 14.1 -16.7 M11.6 -19.15 L11.2 -18.8 Q10.75 -19.65 9.7 -19.65 8.8 -19.65 8.7 -18.9 L8.55 -18.9 8.25 -18.6 7.65 -18.75 7.05 -18.6 6.8 -18.65 Q5.8 -18.65 5.65 -17.9 L5.2 -17.65 5.0 -17.45 4.95 -17.55 5.1 -18.05 Q5.1 -18.8 4.2 -18.8 3.55 -18.8 3.55 -18.05 L3.6 -17.65 3.7 -17.5 3.5 -17.5 3.0 -17.7 Q2.9 -18.5 2.2 -18.5 0.2 -18.15 -0.5 -17.45 L-1.95 -17.4 Q-3.05 -17.45 -3.05 -16.6 L-3.0 -16.45 Q-3.4 -17.05 -4.8 -17.05 -5.6 -17.05 -6.25 -16.65 L-6.55 -16.75 -8.85 -16.25 -10.2 -15.7 -10.0 -15.7 -9.15 -15.9 -9.05 -15.75 -8.55 -16.2 -7.75 -15.5 -7.75 -15.4 -7.45 -15.5 -6.7 -15.3 -6.75 -15.05 -6.65 -14.7 -6.45 -14.25 -5.9 -13.85 Q-5.6 -13.85 -5.5 -14.3 L-5.15 -13.95 -5.0 -13.7 -5.0 -13.55 -4.8 -13.35 -3.45 -13.8 -2.9 -13.5 -2.55 -13.7 -2.55 -13.85 Q-2.5 -14.2 -2.6 -14.35 L-2.4 -14.45 -2.0 -14.1 -1.7 -14.1 Q-1.1 -14.1 -0.9 -14.4 L-0.45 -14.1 -0.05 -14.05 0.15 -14.05 0.65 -14.5 0.7 -14.85 0.5 -15.3 0.35 -15.5 0.8 -15.45 1.05 -15.45 1.2 -15.45 1.2 -15.4 Q1.35 -14.85 2.35 -14.85 L3.2 -15.0 3.5 -15.45 3.55 -15.75 3.7 -15.8 4.05 -16.0 4.15 -15.9 4.45 -15.6 4.35 -15.6 4.1 -15.25 4.2 -14.85 4.25 -14.8 2.8 -14.6 2.65 -14.55 Q2.15 -14.4 2.15 -14.1 L2.2 -13.9 2.65 -13.85 Q4.95 -13.85 4.95 -14.4 L4.95 -14.5 Q5.8 -14.5 5.95 -15.0 L6.4 -15.0 7.0 -15.25 7.1 -15.35 7.1 -15.25 7.1 -15.2 7.8 -14.65 8.05 -14.65 8.55 -14.65 Q9.4 -14.8 9.4 -15.5 L9.4 -15.65 Q11.5 -15.75 11.5 -16.5 L11.45 -16.65 10.55 -16.85 10.6 -17.2 10.55 -17.45 10.6 -17.8 10.6 -17.85 10.75 -17.85 10.7 -17.6 11.4 -16.9 11.75 -16.95 12.3 -16.75 Q12.8 -16.75 12.8 -17.2 L12.65 -17.6 12.85 -17.9 Q12.3 -19.15 11.6 -19.15 M-5.3 -5.05 L-5.3 -4.9 -0.15 -6.1 -1.3 -5.8 -1.95 -5.55 -5.25 -4.75 -5.25 -4.7 -5.1 -4.55 -5.1 -4.5 Q0.65 -6.0 1.25 -6.25 L-2.05 -5.3 -2.05 -5.15 2.65 -6.0 Q5.55 -6.7 5.55 -7.2 L5.3 -7.45 3.5 -7.05 3.3 -7.0 5.8 -7.7 5.7 -7.6 5.8 -7.45 6.4 -7.6 5.95 -7.4 Q6.25 -7.25 6.4 -7.25 7.55 -7.25 11.3 -8.75 L12.05 -8.9 11.6 -8.45 11.75 -8.35 14.35 -9.1 13.8 -9.35 13.75 -9.35 15.05 -9.7 14.65 -10.0 15.95 -8.9 Q17.65 -7.2 17.15 -5.7 16.65 -4.2 17.0 -3.55 17.35 -3.0 16.75 -2.55 L16.45 -2.75 14.7 -2.0 14.2 -1.95 14.95 -2.65 16.95 -3.3 14.7 -2.75 13.25 -1.75 13.4 -1.7 13.2 -1.5 13.0 -1.65 11.8 -1.45 8.55 -1.2 6.85 -0.75 Q7.75 -1.35 12.55 -2.6 L12.25 -2.65 Q9.65 -2.65 6.45 -1.05 2.85 -0.25 1.7 0.55 L1.85 0.55 2.25 0.65 2.2 0.7 2.55 0.8 Q3.1 0.8 3.45 0.45 L3.35 0.35 4.5 -0.05 6.55 -0.6 6.2 -0.45 6.4 -0.4 7.5 -0.8 7.85 -0.7 9.05 -0.9 11.25 -0.95 Q10.2 -0.35 8.45 -0.2 6.4 0.7 5.6 0.6 L6.4 0.45 6.0 0.4 Q5.5 0.4 -0.85 2.35 L-2.2 2.85 -3.55 3.35 Q-6.6 3.85 -6.6 4.3 L-6.45 4.5 -6.75 4.5 Q-8.1 4.5 -9.65 2.3 -10.15 1.6 -10.9 1.05 -11.5 0.65 -11.45 0.1 L-11.4 -0.85 -11.25 -1.4 -11.1 -2.05 -11.0 -2.3 -10.95 -2.45 Q-11.0 -3.0 -11.5 -3.5 L-11.75 -3.75 -11.75 -3.8 Q-11.75 -4.5 -11.2 -5.05 L-10.95 -5.3 Q-10.4 -4.85 -9.85 -4.6 -10.35 -4.6 -10.35 -4.1 -10.35 -3.45 -9.65 -3.4 L-9.9 -2.5 -10.05 -1.75 -10.1 -1.2 -10.15 0.2 Q-10.15 1.2 -7.05 1.95 -7.05 3.45 -6.45 3.45 L-5.5 2.4 -5.3 2.15 -5.2 2.15 -4.5 1.7 -4.35 1.7 -3.05 1.1 -2.6 1.25 Q-2.0 1.25 -2.0 0.95 -2.0 0.25 -3.35 0.25 L-4.25 0.65 -4.9 0.65 Q-5.65 -1.55 -5.6 -2.25 L-5.55 -2.45 -5.65 -3.0 -6.15 -3.75 -6.35 -3.9 -6.6 -4.05 -6.65 -4.1 -7.25 -4.3 -7.9 -4.45 -7.75 -4.5 -6.65 -4.7 -5.3 -5.05 M15.0 -1.7 L14.2 -1.15 12.2 -0.65 11.4 -0.55 11.6 -0.7 Q13.05 -0.95 15.0 -1.7 M5.1 1.1 L4.45 1.35 4.7 1.2 5.1 1.1 M9.65 -7.1 L6.3 -5.85 6.4 -5.45 6.45 -5.4 Q4.35 -5.35 4.35 -4.7 L4.4 -4.5 4.85 -4.45 Q7.15 -4.45 7.15 -5.0 L7.15 -5.1 Q8.0 -5.1 8.15 -5.6 9.0 -5.6 9.3 -5.95 L9.3 -5.85 Q9.3 -5.25 10.25 -5.25 11.6 -5.25 11.6 -6.1 L11.6 -6.25 Q13.7 -6.35 13.7 -7.1 L13.65 -7.25 12.75 -7.45 12.8 -7.8 12.75 -8.0 11.0 -7.5 10.4 -7.4 9.65 -7.25 9.65 -7.1 M9.5 -6.35 L9.5 -6.5 9.95 -6.9 9.9 -6.7 9.9 -6.6 9.5 -6.35 M4.25 -9.95 L4.35 -10.0 4.25 -9.95 M1.85 -11.95 L1.95 -11.85 2.15 -11.7 Q2.85 -11.7 2.85 -12.35 2.85 -12.85 2.35 -12.85 1.55 -12.85 1.55 -12.25 L1.85 -11.95 M4.55 -5.45 Q5.25 -5.45 5.55 -5.75 L5.75 -6.1 4.65 -5.5 4.55 -5.45 M7.05 -4.05 Q6.5 -4.05 6.5 -3.55 6.5 -3.05 7.05 -3.05 7.6 -3.05 7.6 -3.55 7.6 -4.05 7.05 -4.05 M8.65 -4.25 L8.7 -3.9 Q8.85 -3.6 9.35 -3.6 10.05 -3.6 10.05 -4.15 10.05 -4.65 9.05 -4.65 8.65 -4.65 8.65 -4.25 M4.35 -2.3 Q5.05 -2.3 5.05 -2.95 5.05 -3.45 4.55 -3.45 3.75 -3.45 3.75 -2.85 L4.35 -2.3 M1.35 -2.45 Q1.35 -2.85 0.9 -2.85 -0.3 -2.85 -0.3 -2.25 L-0.25 -2.0 0.3 -1.95 Q1.35 -1.95 1.35 -2.45 M0.95 -3.6 L0.6 -3.65 Q0.0 -3.65 0.0 -3.25 L0.3 -2.95 Q1.05 -3.05 1.05 -3.4 L0.95 -3.6 M3.75 -3.55 Q3.75 -4.0 3.15 -4.0 1.6 -4.0 1.6 -3.3 1.6 -2.95 2.05 -2.95 3.75 -2.95 3.75 -3.55 M14.25 -4.65 Q14.25 -5.15 13.3 -5.15 12.0 -5.15 12.0 -4.55 12.0 -4.1 12.45 -4.1 14.25 -4.1 14.25 -4.65 M15.05 -8.5 L14.85 -8.9 Q14.15 -8.45 13.0 -8.05 L13.6 -7.5 13.95 -7.55 14.5 -7.35 Q15.0 -7.35 15.0 -7.8 L14.85 -8.2 15.05 -8.5 M10.35 -7.35 L10.4 -7.35 10.25 -7.2 10.2 -7.15 10.35 -7.35 M15.9 -7.7 Q15.55 -7.7 15.55 -7.3 15.55 -6.9 15.9 -6.9 16.3 -6.9 16.3 -7.3 16.3 -7.7 15.9 -7.7 M1.8 0.9 L1.65 0.85 Q0.8 0.9 -1.05 1.5 L-0.95 1.55 Q-1.7 1.6 -1.7 2.05 L-1.65 2.2 -1.45 2.25 Q-0.35 2.0 -0.35 1.7 L-0.4 1.55 1.8 0.9 M0.5 2.35 L0.4 2.4 0.25 2.45 0.5 2.35 M-8.55 -13.3 L-8.2 -13.25 -8.15 -13.25 -7.7 -13.35 -7.65 -13.4 -7.4 -13.4 -7.15 -13.5 -7.1 -13.7 -7.45 -14.1 -7.5 -14.45 -7.55 -14.55 -8.1 -14.9 -8.65 -14.65 -8.85 -14.7 -8.9 -14.65 -8.8 -14.65 -8.95 -14.6 -9.25 -14.4 -9.25 -14.3 -8.85 -14.1 -8.85 -14.05 -8.9 -13.85 -8.8 -13.45 -9.6 -13.75 -11.1 -13.95 -12.05 -14.0 Q-12.5 -14.0 -12.55 -13.6 L-12.55 -13.5 -12.45 -13.15 -11.85 -12.8 -11.9 -12.65 -12.25 -10.85 -12.35 -9.35 -12.35 -9.2 Q-12.35 -8.5 -10.9 -7.95 L-9.25 -7.45 -9.25 -7.4 -9.2 -6.9 -9.1 -6.35 -8.95 -6.1 -8.75 -5.95 -8.65 -5.95 -8.3 -6.2 -7.75 -6.9 -7.7 -7.0 -7.5 -7.25 -7.4 -7.25 -6.7 -7.7 -6.55 -7.7 -5.25 -8.3 -4.8 -8.15 Q-4.25 -8.15 -4.2 -8.4 L-4.2 -8.45 -4.2 -8.55 Q-4.3 -9.15 -5.55 -9.15 L-6.05 -8.95 -6.45 -8.75 -6.7 -8.75 -7.1 -8.75 -7.15 -9.0 -7.5 -10.05 -7.8 -11.65 Q-7.7 -12.6 -8.35 -13.15 L-8.55 -13.3 M-7.25 -15.85 L-7.4 -15.5 -7.85 -15.65 -7.65 -15.7 -7.25 -15.85 M-9.75 -14.25 L-9.15 -14.9 -9.2 -15.25 Q-9.35 -15.65 -9.95 -15.65 -11.1 -15.65 -11.1 -15.05 -11.1 -14.25 -9.75 -14.25 M-6.85 -13.3 L-7.05 -12.45 Q-7.1 -11.75 -6.4 -11.75 L-5.9 -11.85 Q-5.35 -11.9 -5.0 -12.3 L-5.25 -12.6 -5.45 -12.7 -5.55 -12.7 -5.55 -12.8 -5.6 -13.0 -5.65 -13.05 -6.0 -13.4 -6.5 -13.5 -6.85 -13.3 M-12.4 -16.0 L-12.45 -15.65 Q-12.1 -14.75 -11.4 -14.75 L-11.25 -14.8 -11.15 -15.25 Q-11.15 -16.05 -12.1 -16.05 L-12.4 -16.0 M-1.6 -13.05 Q-2.2 -13.05 -2.2 -12.65 L-1.9 -12.35 Q-1.15 -12.45 -1.15 -12.8 L-1.25 -13.0 -1.6 -13.05 M-0.9 -15.15 L-0.95 -15.2 -0.9 -15.2 -0.9 -15.15 M-2.9 -16.2 L-2.95 -16.2 -2.95 -16.25 -2.9 -16.2 M-14.2 -0.85 L-14.5 -0.85 Q-15.85 -0.85 -17.4 -3.05 L-18.65 -4.3 Q-19.25 -4.7 -19.2 -5.25 -19.25 -6.35 -18.7 -7.8 -18.75 -8.45 -19.5 -9.1 -19.5 -10.15 -18.25 -11.0 L-18.4 -11.65 Q-18.4 -12.3 -17.6 -12.3 L-16.2 -12.0 -15.75 -12.2 -14.15 -12.65 -13.85 -12.35 -13.6 -11.9 -13.65 -11.75 -13.95 -10.8 -14.1 -9.3 -14.15 -9.25 -14.35 -9.4 Q-15.4 -9.95 -17.6 -9.95 -18.1 -9.95 -18.1 -9.45 -18.1 -8.8 -17.4 -8.75 -17.9 -7.5 -17.9 -5.15 -17.9 -4.15 -14.8 -3.4 -14.8 -1.9 -14.2 -1.9 -14.0 -1.9 -13.25 -2.95 L-13.05 -3.2 -12.95 -3.2 -12.25 -3.65 -12.2 -3.65 -12.15 -3.55 -12.05 -3.35 -11.9 -3.25 -12.0 -2.9 Q-11.95 -2.35 -11.5 -2.25 L-11.6 -1.95 Q-14.35 -1.5 -14.35 -1.05 L-14.2 -0.85 M-13.35 -7.9 Q-12.65 -7.45 -12.25 -6.8 L-12.2 -6.8 -12.1 -6.6 Q-12.1 -6.25 -11.75 -6.15 L-11.25 -5.65 -12.0 -4.7 -12.65 -4.7 Q-13.4 -6.9 -13.35 -7.6 L-13.35 -7.9 M-15.55 -11.65 L-15.65 -11.7 -15.75 -11.65 -15.55 -11.65 M-15.25 -6.3 L-15.9 -8.45 -14.4 -8.15 -15.05 -6.15 -15.25 -6.3 M-2.45 -11.4 L-1.9 -11.35 -1.4 -11.4 Q-0.85 -11.5 -0.85 -11.85 -0.85 -12.25 -1.3 -12.25 -2.5 -12.25 -2.5 -11.65 L-2.45 -11.4 M-3.6 -11.4 Q-3.7 -11.05 -4.1 -11.0 L-4.2 -11.0 -4.35 -11.0 Q-4.35 -10.65 -4.0 -10.65 -3.6 -10.65 -3.45 -10.8 L-3.35 -11.05 Q-3.35 -11.3 -3.6 -11.4 M-3.7 -12.1 L-3.6 -11.8 -3.3 -11.75 -3.05 -12.05 -3.4 -12.4 -3.7 -12.1 M-1.8 -7.0 L-1.95 -6.95 -1.7 -7.05 -1.8 -7.0 M-3.25 -7.9 L-3.15 -7.85 Q-3.9 -7.8 -3.9 -7.35 L-3.85 -7.2 -3.65 -7.15 Q-2.65 -7.4 -2.55 -7.65 L-2.55 -7.7 -2.6 -7.85 Q-1.2 -7.95 -0.4 -8.5 L-0.55 -8.55 -3.25 -7.9 M-5.4 -11.0 L-5.95 -11.65 Q-6.55 -11.65 -6.55 -10.85 -6.6 -10.2 -6.0 -10.2 -5.4 -10.2 -5.4 -11.0 M-6.35 -7.35 L-6.45 -6.95 -6.45 -6.9 -6.4 -6.75 Q-6.3 -6.3 -5.8 -6.3 L-5.75 -6.3 Q-5.15 -6.3 -5.15 -6.95 L-5.15 -7.25 -5.5 -7.55 -5.7 -7.6 -6.35 -7.35 M-9.5 -10.2 L-9.7 -10.35 -10.35 -12.5 -8.85 -12.2 -9.5 -10.2 M-7.75 -1.85 L-7.9 -2.35 -8.15 -3.1 -7.35 -2.95 -6.65 -2.8 -6.65 -2.65 -6.8 -2.05 -7.3 -0.8 -7.5 -0.95 -7.75 -1.85 M-0.85 -2.65 L-1.2 -3.0 -1.5 -2.7 -1.4 -2.4 -1.1 -2.35 -0.85 -2.65 M-3.2 -1.6 L-3.75 -2.25 Q-4.35 -2.25 -4.35 -1.45 -4.4 -0.8 -3.8 -0.8 -3.2 -0.8 -3.2 -1.6 M-4.3 -4.1 Q-4.75 -4.1 -4.85 -3.3 L-4.85 -3.05 -4.8 -2.75 Q-4.75 -2.35 -4.2 -2.35 L-3.7 -2.45 Q-3.15 -2.5 -2.8 -2.9 L-3.05 -3.2 -3.25 -3.3 -3.35 -3.3 -3.35 -3.4 -3.4 -3.6 -3.45 -3.65 -3.6 -3.85 -4.3 -4.1 M-2.15 -1.6 Q-2.15 -1.25 -1.8 -1.25 -1.2 -1.25 -1.15 -1.65 L-1.4 -2.0 Q-1.55 -1.6 -2.0 -1.6 L-2.15 -1.6 M-2.95 2.45 Q-2.95 1.8 -3.5 1.8 -4.25 1.8 -4.25 2.45 -4.2 3.1 -3.6 3.1 -2.95 3.1 -2.95 2.45" fill="#ccbe88" fill-rule="evenodd" stroke="none"/>
    <path d="M14.55 -11.95 Q15.15 -12.4 14.8 -12.95 14.45 -13.6 14.95 -15.1 15.45 -16.6 13.75 -18.3 12.7 -19.4 11.6 -19.8 L10.3 -20.0 8.85 -19.8 -5.05 -17.65 -10.2 -16.25 -10.65 -16.05 -12.05 -16.35 Q-12.85 -16.35 -12.85 -15.7 L-12.7 -15.05 Q-13.9 -14.25 -13.95 -13.2 L-13.95 -13.15 -13.65 -12.8 -13.35 -12.5 -13.15 -11.85 -13.25 -11.6 -13.25 -11.55 -13.3 -11.45 -13.45 -10.8 -13.65 -9.3 -13.65 -9.2 Q-13.6 -8.7 -13.1 -8.35 L-12.0 -7.3 -11.85 -7.1 -11.2 -6.25 -11.1 -6.1 -10.55 -5.6 Q-9.75 -4.9 -8.95 -4.9 L-8.65 -4.9 -8.35 -4.85 -8.15 -4.9 -7.85 -5.0 -7.3 -5.1 -6.75 -5.2 -6.6 -5.25 -6.5 -5.25 -6.45 -5.25 -5.7 -5.45 -4.5 -5.8 -2.85 -6.3 -2.7 -6.35 -0.75 -6.8 Q0.6 -7.25 2.25 -8.05 L2.9 -8.3 4.85 -8.5 5.15 -8.6 5.8 -8.9 6.05 -9.05 7.1 -9.2 Q8.3 -9.5 9.2 -9.95 L10.0 -10.05 12.0 -10.55 12.8 -11.1 12.85 -11.1 14.6 -11.9 14.55 -11.95 M14.15 -18.65 Q16.1 -16.7 15.5 -14.95 15.1 -13.7 15.3 -13.2 15.75 -12.4 15.15 -11.75 L15.1 -11.65 14.85 -11.45 13.8 -10.95 Q15.1 -10.55 16.35 -9.25 18.3 -7.3 17.7 -5.55 17.3 -4.3 17.5 -3.8 17.95 -3.0 17.35 -2.35 L17.3 -2.25 17.05 -2.05 15.25 -1.2 15.3 -1.3 14.55 -0.75 14.4 -0.7 12.4 -0.2 12.35 -0.15 11.55 -0.05 Q10.3 0.6 8.45 0.85 L7.3 1.35 7.05 1.4 5.3 1.6 5.35 1.6 4.7 1.8 Q1.55 3.3 -0.4 3.55 L-0.5 3.6 -0.45 3.55 -5.55 4.9 -5.95 5.05 -6.1 5.05 -6.5 5.0 -6.7 5.0 Q-8.25 5.05 -10.0 2.6 L-10.05 2.6 Q-10.45 1.95 -11.15 1.45 -11.95 0.85 -11.9 0.1 L-11.85 -0.75 -13.3 -0.45 -13.7 -0.3 -13.85 -0.3 -14.25 -0.35 -14.45 -0.35 Q-16.0 -0.3 -17.75 -2.75 L-17.8 -2.75 -18.9 -3.9 Q-19.7 -4.5 -19.65 -5.25 -19.7 -6.35 -19.15 -7.85 L-19.8 -8.7 -19.9 -8.9 -19.95 -9.1 Q-20.0 -10.25 -18.8 -11.15 L-18.85 -11.65 Q-18.9 -12.8 -17.55 -12.8 L-16.1 -12.55 -15.85 -12.65 -14.4 -13.1 -14.4 -13.15 Q-14.45 -14.3 -13.25 -15.2 L-13.3 -15.7 Q-13.35 -16.85 -12.0 -16.85 L-10.55 -16.6 -10.3 -16.7 -5.15 -18.1 -5.1 -18.15 5.6 -19.8 10.35 -20.5 Q11.6 -20.55 12.8 -19.8 L14.15 -18.65 M14.65 -10.0 L14.2 -10.2 12.95 -10.6 12.4 -10.2 12.35 -10.15 12.2 -10.1 10.2 -9.6 10.15 -9.55 9.35 -9.45 8.9 -9.25 Q8.35 -9.2 8.05 -8.95 L7.3 -8.75 6.25 -8.55 5.8 -8.35 5.5 -8.2 5.1 -8.05 4.85 -8.0 3.1 -7.8 3.15 -7.8 2.5 -7.6 Q-0.65 -6.1 -2.6 -5.85 L-2.7 -5.8 -2.65 -5.85 -4.45 -5.3 -5.3 -5.05 -6.65 -4.7 -7.75 -4.5 -7.9 -4.45 -8.15 -4.35 -8.3 -4.35 -8.7 -4.4 -8.9 -4.4 -9.85 -4.6 Q-10.4 -4.85 -10.95 -5.3 L-11.2 -5.05 Q-11.75 -4.5 -11.75 -3.8 L-11.75 -3.75 -11.5 -3.5 Q-11.0 -3.0 -10.95 -2.45 L-11.0 -2.3 -11.1 -2.05 -11.25 -1.4 -11.4 -0.85 -11.45 0.1 Q-11.5 0.65 -10.9 1.05 -10.15 1.6 -9.65 2.3 -8.1 4.5 -6.75 4.5 L-6.45 4.5 -6.15 4.55 -5.65 4.4 -0.65 3.1 -0.5 3.05 Q1.4 2.8 4.45 1.35 L5.1 1.1 7.05 0.9 8.25 0.35 Q10.1 0.1 11.4 -0.55 L12.2 -0.65 14.2 -1.15 15.0 -1.7 16.8 -2.5 16.75 -2.55 Q17.35 -3.0 17.0 -3.55 16.65 -4.2 17.15 -5.7 17.65 -7.2 15.95 -8.9 L14.65 -10.0 M-11.25 -9.85 Q-11.25 -11.0 -10.55 -11.0 L-8.85 -8.9 -8.85 -8.65 -8.8 -8.65 Q-7.8 -8.65 -7.65 -8.05 L-7.65 -7.9 -7.75 -7.4 Q-7.95 -7.05 -8.6 -7.05 -8.9 -7.05 -9.05 -7.4 L-9.2 -7.95 -9.2 -8.2 -9.2 -8.3 -9.15 -8.5 Q-10.65 -8.5 -11.1 -8.9 L-11.35 -9.25 -11.25 -9.85 M-14.1 -9.3 L-13.95 -10.8 -13.65 -11.75 -13.6 -11.9 -13.85 -12.35 -14.15 -12.65 -15.75 -12.2 -16.2 -12.0 -17.6 -12.3 Q-18.4 -12.3 -18.4 -11.65 L-18.25 -11.0 Q-19.5 -10.15 -19.5 -9.1 -18.75 -8.45 -18.7 -7.8 -19.25 -6.35 -19.2 -5.25 -19.25 -4.7 -18.65 -4.3 L-17.4 -3.05 Q-15.85 -0.85 -14.5 -0.85 L-14.2 -0.85 -13.9 -0.8 -13.4 -0.95 -11.75 -1.3 -11.6 -1.95 -11.5 -2.25 -11.4 -2.5 -11.9 -3.25 -12.05 -3.35 -12.15 -3.55 -12.2 -3.65 -12.2 -3.75 -12.0 -4.7 -11.25 -5.65 -11.75 -6.15 Q-12.1 -6.25 -12.1 -6.6 L-12.2 -6.8 -12.25 -6.8 Q-12.65 -7.45 -13.35 -7.9 L-13.35 -7.95 Q-14.1 -8.5 -14.1 -9.25 L-14.1 -9.3 M-14.7 -4.45 Q-17.5 -4.45 -16.8 -5.8 -16.8 -6.95 -16.1 -6.95 L-14.4 -4.85 -14.4 -4.6 -14.35 -4.6 Q-13.2 -4.6 -13.2 -3.85 -13.2 -3.0 -14.15 -3.0 -14.75 -3.0 -14.75 -4.25 L-14.7 -4.45 M-8.35 -1.6 L-6.65 0.5 -6.65 0.75 -6.6 0.75 Q-5.45 0.75 -5.45 1.5 -5.45 2.35 -6.4 2.35 -7.0 2.35 -7.0 1.1 L-6.95 0.9 Q-9.75 0.9 -9.05 -0.45 -9.05 -1.6 -8.35 -1.6" fill="#8e7d3e" fill-rule="evenodd" stroke="none"/>
    <path d="M11.6 -19.15 Q12.3 -19.15 12.85 -17.9 L12.65 -17.6 12.8 -17.2 Q12.8 -16.75 12.3 -16.75 L11.75 -16.95 11.4 -16.9 10.7 -17.6 10.75 -17.85 10.6 -17.85 10.6 -17.8 10.55 -17.45 10.6 -17.2 10.55 -16.85 11.45 -16.65 11.5 -16.5 Q11.5 -15.75 9.4 -15.65 L9.4 -15.5 Q9.4 -14.8 8.55 -14.65 L8.05 -14.65 7.8 -14.65 7.1 -15.2 7.1 -15.25 7.1 -15.35 7.0 -15.25 6.4 -15.0 5.95 -15.0 Q5.8 -14.5 4.95 -14.5 L4.95 -14.4 Q4.95 -13.85 2.65 -13.85 L2.2 -13.9 2.15 -14.1 Q2.15 -14.4 2.65 -14.55 L2.8 -14.6 4.25 -14.8 4.2 -14.85 4.1 -15.25 4.35 -15.6 4.45 -15.6 4.15 -15.9 4.05 -16.0 3.7 -15.8 3.55 -15.75 3.5 -15.45 3.2 -15.0 2.35 -14.85 Q1.35 -14.85 1.2 -15.4 L1.2 -15.45 1.05 -15.45 0.8 -15.45 0.35 -15.5 0.5 -15.3 0.7 -14.85 0.65 -14.5 0.15 -14.05 -0.05 -14.05 -0.45 -14.1 -0.9 -14.4 Q-1.1 -14.1 -1.7 -14.1 L-2.0 -14.1 -2.4 -14.45 -2.6 -14.35 Q-2.5 -14.2 -2.55 -13.85 L-2.55 -13.7 -2.9 -13.5 -3.45 -13.8 -4.8 -13.35 -5.0 -13.55 -5.0 -13.7 -5.15 -13.95 -5.5 -14.3 Q-5.6 -13.85 -5.9 -13.85 L-6.45 -14.25 -6.65 -14.7 -6.75 -15.05 -6.7 -15.3 -7.45 -15.5 -7.75 -15.4 -7.75 -15.5 -8.55 -16.2 -9.05 -15.75 -9.15 -15.9 -10.0 -15.7 -10.2 -15.7 -8.85 -16.25 -6.55 -16.75 -6.25 -16.65 Q-5.6 -17.05 -4.8 -17.05 -3.4 -17.05 -3.0 -16.45 L-3.05 -16.6 Q-3.05 -17.45 -1.95 -17.4 L-0.5 -17.45 Q0.2 -18.15 2.2 -18.5 2.9 -18.5 3.0 -17.7 L3.5 -17.5 3.7 -17.5 3.6 -17.65 3.55 -18.05 Q3.55 -18.8 4.2 -18.8 5.1 -18.8 5.1 -18.05 L4.95 -17.55 5.0 -17.45 5.2 -17.65 5.65 -17.9 Q5.8 -18.65 6.8 -18.65 L7.05 -18.6 7.65 -18.75 8.25 -18.6 8.55 -18.9 8.7 -18.9 Q8.8 -19.65 9.7 -19.65 10.75 -19.65 11.2 -18.8 L11.6 -19.15 M14.1 -16.7 Q14.1 -16.3 13.7 -16.3 13.35 -16.3 13.35 -16.7 13.35 -17.1 13.7 -17.1 14.1 -17.1 14.1 -16.7 M10.25 -13.5 Q9.8 -13.5 9.8 -13.95 9.8 -14.55 11.1 -14.55 12.05 -14.55 12.05 -14.05 12.05 -13.5 10.25 -13.5 M1.55 -12.95 Q1.55 -12.35 -0.15 -12.35 -0.6 -12.35 -0.6 -12.7 -0.6 -13.4 0.95 -13.4 1.55 -13.4 1.55 -12.95 M5.0 -13.45 Q5.4 -13.4 5.4 -12.95 L5.4 -12.7 Q5.25 -12.45 4.85 -12.45 4.3 -12.45 4.3 -12.95 4.3 -13.45 4.85 -13.45 L5.0 -13.45 M8.2 -16.75 L8.15 -16.75 8.0 -16.55 8.05 -16.6 8.2 -16.75 M7.75 -16.3 L7.3 -15.9 7.3 -15.75 7.7 -16.0 7.7 -16.1 7.75 -16.3 M7.25 -14.0 Q7.85 -13.95 7.85 -13.55 7.85 -13.05 7.25 -13.0 L7.15 -13.0 Q6.65 -13.0 6.5 -13.3 L6.45 -13.65 Q6.45 -14.05 6.85 -14.05 L7.25 -14.0 M9.65 -7.1 L9.65 -7.25 10.4 -7.4 11.0 -7.5 12.75 -8.0 12.8 -7.8 12.75 -7.45 13.65 -7.25 13.7 -7.1 Q13.7 -6.35 11.6 -6.25 L11.6 -6.1 Q11.6 -5.25 10.25 -5.25 9.3 -5.25 9.3 -5.85 L9.3 -5.95 Q9.0 -5.6 8.15 -5.6 8.0 -5.1 7.15 -5.1 L7.15 -5.0 Q7.15 -4.45 4.85 -4.45 L4.4 -4.5 4.35 -4.7 Q4.35 -5.35 6.45 -5.4 L6.4 -5.45 6.3 -5.85 9.65 -7.1 M9.5 -6.35 L9.9 -6.6 9.9 -6.7 9.95 -6.9 9.5 -6.5 9.5 -6.35 M1.85 -11.95 L1.55 -12.25 Q1.55 -12.85 2.35 -12.85 2.85 -12.85 2.85 -12.35 2.85 -11.7 2.15 -11.7 L1.95 -11.85 1.85 -11.95 M4.55 -5.45 L4.65 -5.5 5.75 -6.1 5.55 -5.75 Q5.25 -5.45 4.55 -5.45 M3.75 -3.55 Q3.75 -2.95 2.05 -2.95 1.6 -2.95 1.6 -3.3 1.6 -4.0 3.15 -4.0 3.75 -4.0 3.75 -3.55 M0.95 -3.6 L1.05 -3.4 Q1.05 -3.05 0.3 -2.95 L0.0 -3.25 Q0.0 -3.65 0.6 -3.65 L0.95 -3.6 M1.35 -2.45 Q1.35 -1.95 0.3 -1.95 L-0.25 -2.0 -0.3 -2.25 Q-0.3 -2.85 0.9 -2.85 1.35 -2.85 1.35 -2.45 M4.35 -2.3 L3.75 -2.85 Q3.75 -3.45 4.55 -3.45 5.05 -3.45 5.05 -2.95 5.05 -2.3 4.35 -2.3 M8.65 -4.25 Q8.65 -4.65 9.05 -4.65 10.05 -4.65 10.05 -4.15 10.05 -3.6 9.35 -3.6 8.85 -3.6 8.7 -3.9 L8.65 -4.25 M7.05 -4.05 Q7.6 -4.05 7.6 -3.55 7.6 -3.05 7.05 -3.05 6.5 -3.05 6.5 -3.55 6.5 -4.05 7.05 -4.05 M15.9 -7.7 Q16.3 -7.7 16.3 -7.3 16.3 -6.9 15.9 -6.9 15.55 -6.9 15.55 -7.3 15.55 -7.7 15.9 -7.7 M10.35 -7.35 L10.2 -7.15 10.25 -7.2 10.4 -7.35 10.35 -7.35 M15.05 -8.5 L14.85 -8.2 15.0 -7.8 Q15.0 -7.35 14.5 -7.35 L13.95 -7.55 13.6 -7.5 13.0 -8.05 Q14.15 -8.45 14.85 -8.9 L15.05 -8.5 M14.25 -4.65 Q14.25 -4.1 12.45 -4.1 12.0 -4.1 12.0 -4.55 12.0 -5.15 13.3 -5.15 14.25 -5.15 14.25 -4.65 M-7.25 -15.85 L-7.65 -15.7 -7.85 -15.65 -7.4 -15.5 -7.25 -15.85 M-8.8 -13.45 L-8.9 -13.85 -8.85 -14.05 -8.85 -14.1 -9.25 -14.3 -9.25 -14.4 -8.95 -14.6 -8.8 -14.65 -8.9 -14.65 -8.85 -14.7 -8.65 -14.65 -8.1 -14.9 -7.55 -14.55 -7.5 -14.45 -7.45 -14.1 -7.1 -13.7 -7.15 -13.5 -7.4 -13.4 -7.65 -13.4 -7.7 -13.35 -8.15 -13.25 -8.2 -13.25 -8.55 -13.3 -8.8 -13.45 M-9.75 -14.25 Q-11.1 -14.25 -11.1 -15.05 -11.1 -15.65 -9.95 -15.65 -9.35 -15.65 -9.2 -15.25 L-9.15 -14.9 -9.75 -14.25 M-6.85 -13.3 L-6.5 -13.5 -6.0 -13.4 -5.65 -13.05 -5.6 -13.0 -5.55 -12.8 -5.55 -12.7 -5.45 -12.7 -5.25 -12.6 -5.0 -12.3 Q-5.35 -11.9 -5.9 -11.85 L-6.4 -11.75 Q-7.1 -11.75 -7.05 -12.45 L-6.85 -13.3 M-2.9 -16.2 L-2.95 -16.25 -2.95 -16.2 -2.9 -16.2 M-0.9 -15.15 L-0.9 -15.2 -0.95 -15.2 -0.9 -15.15 M-1.6 -13.05 L-1.25 -13.0 -1.15 -12.8 Q-1.15 -12.45 -1.9 -12.35 L-2.2 -12.65 Q-2.2 -13.05 -1.6 -13.05 M-12.4 -16.0 L-12.1 -16.05 Q-11.15 -16.05 -11.15 -15.25 L-11.25 -14.8 -11.4 -14.75 Q-12.1 -14.75 -12.45 -15.65 L-12.4 -16.0 M-14.15 -9.25 L-14.1 -9.3 -14.1 -9.25 -14.15 -9.25 M-15.55 -11.65 L-15.75 -11.65 -15.65 -11.7 -15.55 -11.65 M-2.45 -11.4 L-2.5 -11.65 Q-2.5 -12.25 -1.3 -12.25 -0.85 -12.25 -0.85 -11.85 -0.85 -11.5 -1.4 -11.4 L-1.9 -11.35 -2.45 -11.4 M-3.6 -11.4 Q-3.35 -11.3 -3.35 -11.05 L-3.45 -10.8 Q-3.6 -10.65 -4.0 -10.65 -4.35 -10.65 -4.35 -11.0 L-4.2 -11.0 -4.1 -11.0 Q-3.7 -11.05 -3.6 -11.4 M-3.7 -12.1 L-3.4 -12.4 -3.05 -12.05 -3.3 -11.75 -3.6 -11.8 -3.7 -12.1 M-5.4 -11.0 Q-5.4 -10.2 -6.0 -10.2 -6.6 -10.2 -6.55 -10.85 -6.55 -11.65 -5.95 -11.65 L-5.4 -11.0 M-4.3 -4.1 L-3.6 -3.85 -3.45 -3.65 -3.4 -3.6 -3.35 -3.4 -3.35 -3.3 -3.25 -3.3 -3.05 -3.2 -2.8 -2.9 Q-3.15 -2.5 -3.7 -2.45 L-4.2 -2.35 Q-4.75 -2.35 -4.8 -2.75 L-4.85 -3.05 -4.85 -3.3 Q-4.75 -4.1 -4.3 -4.1 M-3.2 -1.6 Q-3.2 -0.8 -3.8 -0.8 -4.4 -0.8 -4.35 -1.45 -4.35 -2.25 -3.75 -2.25 L-3.2 -1.6 M-0.85 -2.65 L-1.1 -2.35 -1.4 -2.4 -1.5 -2.7 -1.2 -3.0 -0.85 -2.65 M-2.15 -1.6 L-2.0 -1.6 Q-1.55 -1.6 -1.4 -2.0 L-1.15 -1.65 Q-1.2 -1.25 -1.8 -1.25 -2.15 -1.25 -2.15 -1.6" fill="#e3e2ac" fill-rule="evenodd" stroke="none"/>
    <path d="M-8.65 -4.9 L-8.8 -5.1 -8.75 -5.2 Q-8.5 -5.5 -7.0 -5.8 L-5.75 -6.05 -5.55 -6.1 -5.4 -6.15 -5.15 -6.25 -4.4 -6.55 -3.05 -7.05 -1.5 -7.5 -0.6 -7.8 0.05 -8.0 3.8 -9.0 3.85 -9.0 4.2 -8.95 3.4 -8.8 4.8 -9.0 6.25 -9.6 8.0 -9.9 9.05 -10.35 7.15 -10.3 6.85 -10.3 6.45 -10.2 5.9 -10.1 5.65 -10.1 5.3 -10.2 4.65 -9.9 4.2 -9.8 4.0 -9.85 4.25 -9.95 3.3 -9.7 2.3 -9.45 1.15 -9.05 1.25 -8.95 1.2 -8.85 Q0.85 -8.6 0.35 -8.6 L0.0 -8.7 0.05 -8.75 -0.35 -8.85 -0.5 -8.85 0.2 -9.2 0.9 -9.5 2.05 -9.9 4.25 -10.45 Q7.1 -11.9 9.5 -12.0 L10.05 -12.05 10.35 -12.0 10.05 -11.9 9.55 -11.75 5.35 -10.5 4.65 -10.15 5.75 -10.5 6.35 -10.6 9.35 -10.85 9.6 -10.85 9.95 -10.85 10.8 -11.05 11.0 -10.9 11.2 -11.1 11.05 -11.15 12.5 -12.15 14.75 -12.7 12.75 -12.05 12.0 -11.35 12.5 -11.4 14.25 -12.15 14.55 -11.95 14.6 -11.9 12.85 -11.1 12.8 -11.1 10.25 -10.25 9.4 -10.1 9.2 -9.95 Q8.3 -9.5 7.1 -9.2 L6.05 -9.05 5.8 -8.9 5.15 -8.6 4.85 -8.5 2.9 -8.3 2.5 -8.2 2.25 -8.05 Q0.6 -7.25 -0.75 -6.8 L-2.7 -6.35 -2.85 -6.3 -4.5 -5.8 -5.7 -5.45 -6.45 -5.25 -6.5 -5.25 -6.6 -5.25 -6.75 -5.2 -7.3 -5.1 -7.85 -5.0 -8.15 -4.9 -8.35 -4.85 -8.65 -4.9 M-5.3 -5.05 L-4.45 -5.3 -2.65 -5.85 -2.7 -5.8 -2.6 -5.85 Q-0.65 -6.1 2.5 -7.6 L3.15 -7.8 3.1 -7.8 4.85 -8.0 5.1 -8.05 5.5 -8.2 5.8 -8.35 6.25 -8.55 7.3 -8.75 8.05 -8.95 Q8.35 -9.2 8.9 -9.25 L9.35 -9.45 10.15 -9.55 10.2 -9.6 12.2 -10.1 12.35 -10.15 12.4 -10.2 12.95 -10.6 14.2 -10.2 14.65 -10.0 15.05 -9.7 13.75 -9.35 13.8 -9.35 14.35 -9.1 11.75 -8.35 11.6 -8.45 12.05 -8.9 11.3 -8.75 Q7.55 -7.25 6.4 -7.25 6.25 -7.25 5.95 -7.4 L6.4 -7.6 5.8 -7.45 5.7 -7.6 5.8 -7.7 3.3 -7.0 3.5 -7.05 5.3 -7.45 5.55 -7.2 Q5.55 -6.7 2.65 -6.0 L-2.05 -5.15 -2.05 -5.3 1.25 -6.25 Q0.65 -6.0 -5.1 -4.5 L-5.1 -4.55 -5.25 -4.7 -5.25 -4.75 -1.95 -5.55 -1.3 -5.8 -0.15 -6.1 -5.3 -4.9 -5.3 -5.05 M16.75 -2.55 L16.8 -2.5 15.0 -1.7 Q13.05 -0.95 11.6 -0.7 L11.4 -0.55 Q10.1 0.1 8.25 0.35 L7.05 0.9 5.1 1.1 4.7 1.2 4.45 1.35 Q1.4 2.8 -0.5 3.05 L-0.65 3.1 -5.65 4.4 -6.15 4.55 -6.45 4.5 -6.6 4.3 Q-6.6 3.85 -3.55 3.35 L-2.2 2.85 -0.85 2.35 Q5.5 0.4 6.0 0.4 L6.4 0.45 5.6 0.6 Q6.4 0.7 8.45 -0.2 10.2 -0.35 11.25 -0.95 L9.05 -0.9 7.85 -0.7 7.5 -0.8 6.4 -0.4 6.2 -0.45 6.55 -0.6 4.5 -0.05 3.35 0.35 3.45 0.45 Q3.1 0.8 2.55 0.8 L2.2 0.7 2.25 0.65 1.85 0.55 1.7 0.55 Q2.85 -0.25 6.45 -1.05 9.65 -2.65 12.25 -2.65 L12.55 -2.6 Q7.75 -1.35 6.85 -0.75 L8.55 -1.2 11.8 -1.45 13.0 -1.65 13.2 -1.5 13.4 -1.7 13.25 -1.75 14.7 -2.75 16.95 -3.3 14.95 -2.65 14.2 -1.95 14.7 -2.0 16.45 -2.75 16.75 -2.55 M-9.85 -4.6 L-8.9 -4.4 -8.7 -4.4 -8.3 -4.35 -8.15 -4.35 -7.9 -4.45 -7.25 -4.3 -6.65 -4.1 -6.6 -4.05 -6.35 -3.9 -6.15 -3.75 -5.65 -3.0 -5.55 -2.45 -5.6 -2.25 Q-5.65 -1.55 -4.9 0.65 L-4.25 0.65 -3.35 0.25 Q-2.0 0.25 -2.0 0.95 -2.0 1.25 -2.6 1.25 L-3.05 1.1 -4.35 1.7 -4.5 1.7 -5.2 2.15 -5.3 2.15 -5.5 2.4 -6.45 3.45 Q-7.05 3.45 -7.05 1.95 -10.15 1.2 -10.15 0.2 L-10.1 -1.2 -10.05 -1.75 -9.9 -2.5 -9.65 -3.4 Q-10.35 -3.45 -10.35 -4.1 -10.35 -4.6 -9.85 -4.6 M4.25 -9.95 L4.35 -10.0 4.25 -9.95 M0.5 2.35 L0.25 2.45 0.4 2.4 0.5 2.35 M1.8 0.9 L-0.4 1.55 -0.35 1.7 Q-0.35 2.0 -1.45 2.25 L-1.65 2.2 -1.7 2.05 Q-1.7 1.6 -0.95 1.55 L-1.05 1.5 Q0.8 0.9 1.65 0.85 L1.8 0.9 M-8.55 -13.3 L-8.35 -13.15 Q-7.7 -12.6 -7.8 -11.65 L-7.5 -10.05 -7.15 -9.0 -7.1 -8.75 -6.7 -8.75 -6.45 -8.75 -6.05 -8.95 -5.55 -9.15 Q-4.3 -9.15 -4.2 -8.55 L-4.2 -8.45 -4.2 -8.4 Q-4.25 -8.15 -4.8 -8.15 L-5.25 -8.3 -6.55 -7.7 -6.7 -7.7 -7.4 -7.25 -7.5 -7.25 -7.7 -7.0 -7.75 -6.9 -8.3 -6.2 -8.65 -5.95 -8.75 -5.95 -8.95 -6.1 -9.1 -6.35 -9.2 -6.9 -9.25 -7.4 -9.25 -7.45 -10.9 -7.95 Q-12.35 -8.5 -12.35 -9.2 L-12.35 -9.35 -12.25 -10.85 -11.9 -12.65 -11.85 -12.8 -12.45 -13.15 -12.55 -13.5 -12.55 -13.6 Q-12.5 -14.0 -12.05 -14.0 L-11.1 -13.95 -9.6 -13.75 -8.8 -13.45 -8.55 -13.3 M-11.25 -9.85 L-11.35 -9.25 -11.1 -8.9 Q-10.65 -8.5 -9.15 -8.5 L-9.2 -8.3 -9.2 -8.2 -9.2 -7.95 -9.05 -7.4 Q-8.9 -7.05 -8.6 -7.05 -7.95 -7.05 -7.75 -7.4 L-7.65 -7.9 -7.65 -8.05 Q-7.8 -8.65 -8.8 -8.65 L-8.85 -8.65 -8.85 -8.9 -10.55 -11.0 Q-11.25 -11.0 -11.25 -9.85 M-14.2 -0.85 L-14.35 -1.05 Q-14.35 -1.5 -11.6 -1.95 L-11.75 -1.3 -13.4 -0.95 -13.9 -0.8 -14.2 -0.85 M-11.5 -2.25 Q-11.95 -2.35 -12.0 -2.9 L-11.9 -3.25 -11.4 -2.5 -11.5 -2.25 M-12.2 -3.65 L-12.25 -3.65 -12.95 -3.2 -13.05 -3.2 -13.25 -2.95 Q-14.0 -1.9 -14.2 -1.9 -14.8 -1.9 -14.8 -3.4 -17.9 -4.15 -17.9 -5.15 -17.9 -7.5 -17.4 -8.75 -18.1 -8.8 -18.1 -9.45 -18.1 -9.95 -17.6 -9.95 -15.4 -9.95 -14.35 -9.4 L-14.15 -9.25 -14.1 -9.25 Q-14.1 -8.5 -13.35 -7.95 L-13.35 -7.9 -13.35 -7.6 Q-13.4 -6.9 -12.65 -4.7 L-12.0 -4.7 -12.2 -3.75 -12.2 -3.65 M-15.25 -6.3 L-15.05 -6.15 -14.4 -8.15 -15.9 -8.45 -15.25 -6.3 M-14.7 -4.45 L-14.75 -4.25 Q-14.75 -3.0 -14.15 -3.0 -13.2 -3.0 -13.2 -3.85 -13.2 -4.6 -14.35 -4.6 L-14.4 -4.6 -14.4 -4.85 -16.1 -6.95 Q-16.8 -6.95 -16.8 -5.8 -17.5 -4.45 -14.7 -4.45 M-3.25 -7.9 L-0.55 -8.55 -0.4 -8.5 Q-1.2 -7.95 -2.6 -7.85 L-2.55 -7.7 -2.55 -7.65 Q-2.65 -7.4 -3.65 -7.15 L-3.85 -7.2 -3.9 -7.35 Q-3.9 -7.8 -3.15 -7.85 L-3.25 -7.9 M-1.8 -7.0 L-1.7 -7.05 -1.95 -6.95 -1.8 -7.0 M-9.5 -10.2 L-8.85 -12.2 -10.35 -12.5 -9.7 -10.35 -9.5 -10.2 M-6.35 -7.35 L-5.7 -7.6 -5.5 -7.55 -5.15 -7.25 -5.15 -6.95 Q-5.15 -6.3 -5.75 -6.3 L-5.8 -6.3 Q-6.3 -6.3 -6.4 -6.75 L-6.45 -6.9 -6.45 -6.95 -6.35 -7.35 M-7.75 -1.85 L-7.5 -0.95 -7.3 -0.8 -6.8 -2.05 -6.65 -2.65 -6.65 -2.8 -7.35 -2.95 -8.15 -3.1 -7.9 -2.35 -7.75 -1.85 M-8.35 -1.6 Q-9.05 -1.6 -9.05 -0.45 -9.75 0.9 -6.95 0.9 L-7.0 1.1 Q-7.0 2.35 -6.4 2.35 -5.45 2.35 -5.45 1.5 -5.45 0.75 -6.6 0.75 L-6.65 0.75 -6.65 0.5 -8.35 -1.6 M-2.95 2.45 Q-2.95 3.1 -3.6 3.1 -4.2 3.1 -4.25 2.45 -4.25 1.8 -3.5 1.8 -2.95 1.8 -2.95 2.45" fill="#b39d4d" fill-rule="evenodd" stroke="none"/>
    <path d="M-14.85 -13.35 L-13.65 -12.45 -13.75 -11.55 -13.75 -8.6 -13.2 -8.1 Q-12.35 -7.35 -11.8 -6.25 L-11.35 -6.05 -11.2 -6.0 -8.85 -4.7 Q-9.05 -4.2 -9.65 -4.7 -10.5 -5.3 -11.55 -5.1 L-12.0 -4.25 -11.65 -3.85 -11.7 -3.15 -12.45 -4.55 -12.25 -6.1 -14.45 -8.1 Q-15.05 -10.35 -14.35 -12.05 L-14.55 -12.25 Q-15.45 -13.0 -14.85 -13.35" fill="#000000" fill-rule="evenodd" stroke="none"/>
  </g>
</svg>
