<?xml version="1.0" encoding="UTF-8" standalone="no"?>
<svg xmlns:xlink="http://www.w3.org/1999/xlink" height="29.95px" width="29.0px" xmlns="http://www.w3.org/2000/svg">
  <g transform="matrix(1.0, 0.0, 0.0, 1.0, 15.75, 26.25)">
    <path d="M10.15 -14.8 L7.0 -19.95 3.65 -25.35 -12.25 -24.75 -12.25 -24.7 -12.35 -24.7 -12.45 -24.5 -12.4 -24.35 -14.25 -20.05 -15.0 -18.6 -14.4 -15.45 -14.4 -15.4 -13.3 -10.15 -13.35 -10.15 -13.1 -9.05 -13.05 -8.95 -12.4 -6.25 Q-12.2 -5.15 -12.4 -7.45 L-12.1 -9.35 -11.5 -9.1 -11.4 -9.05 -11.35 -8.85 Q-11.9 -8.65 -12.1 -8.3 L-11.35 -4.7 -11.15 -4.45 -9.95 -0.95 -9.9 0.5 -8.75 2.6 -8.65 2.65 -8.65 2.85 -7.75 2.65 -7.45 2.65 -7.05 2.55 -6.4 2.4 -6.45 2.25 -5.05 1.9 -5.05 2.15 -3.2 1.75 -3.45 1.4 -2.8 1.45 -2.75 1.45 -0.3 1.7 0.35 1.15 0.65 0.85 0.7 0.8 1.4 0.65 1.4 0.85 2.95 0.5 2.8 0.0 3.05 -0.05 3.5 0.1 3.5 0.15 3.8 0.15 4.35 0.15 4.35 0.2 4.5 0.15 4.7 0.15 5.75 -0.05 5.5 -0.55 6.05 -0.65 6.05 -0.25 7.1 -0.5 7.25 -0.35 9.05 -0.7 8.9 -0.9 9.15 -0.9 9.15 -0.75 10.2 -0.95 9.7 -2.7 11.2 -6.3 11.8 -6.45 11.3 -8.35 10.55 -9.45 9.7 -11.8 10.95 -11.75 11.55 -11.85 Q12.25 -12.1 12.25 -12.95 12.25 -13.65 11.7 -14.15 L10.15 -14.8 M4.2 -26.1 L4.55 -25.8 10.9 -15.5 11.95 -15.05 12.0 -15.0 Q13.05 -14.45 13.25 -13.45 L13.2 -13.0 12.8 -11.7 12.55 -11.25 12.05 -11.1 11.1 -11.0 12.75 -6.75 12.8 -6.25 12.55 -5.85 12.1 -5.55 12.0 -5.55 10.75 -2.7 11.2 -1.15 11.15 -0.6 10.85 -0.2 10.35 -0.05 9.75 0.0 9.3 0.15 6.5 0.6 6.2 0.8 3.85 1.0 3.65 1.2 3.2 1.4 1.15 1.65 0.45 2.35 0.15 2.55 -0.25 2.6 -2.5 2.35 -2.5 2.4 -3.05 2.6 Q-5.05 2.75 -7.0 3.5 L-7.05 3.5 Q-8.6 3.95 -9.1 3.3 L-9.25 3.15 -9.85 2.15 -10.45 0.65 -10.85 -0.6 -12.15 -5.0 -12.65 -5.15 -13.0 -5.7 -15.7 -18.4 -15.65 -18.95 -12.9 -25.1 -12.6 -25.45 -12.15 -25.65 3.75 -26.25 4.2 -26.1 M8.7 -6.0 L8.75 -6.0 8.85 -5.9 9.75 -6.05 9.0 -4.8 8.8 -4.4 8.6 -5.0 8.85 -5.6 8.7 -6.0 M10.9 -9.7 L11.05 -9.4 10.6 -10.4 10.9 -9.7 M10.8 -1.3 L10.8 -1.1 10.95 -1.1 10.8 -1.3 M12.55 -6.6 L12.4 -6.8 12.4 -6.6 12.55 -6.6 M-10.85 -2.0 L-10.6 -0.75 -10.65 -1.2 -10.85 -2.0 M-7.3 -0.75 L-7.4 -0.9 -7.2 -0.95 -7.3 -0.75" fill="#000000" fill-rule="evenodd" stroke="none"/>
    <path d="M-8.3 -22.8 L-8.3 -22.7 -8.25 -22.6 -7.85 -21.15 -7.3 -21.25 -6.75 -21.3 -5.2 -21.45 -3.45 -21.65 1.0 -22.05 1.15 -22.05 1.25 -21.9 1.4 -21.6 1.25 -21.9 1.0 -22.45 0.8 -22.8 0.75 -22.9 0.7 -23.1 1.9 -23.1 2.0 -22.9 2.95 -21.1 Q3.3 -20.2 3.9 -19.65 L6.7 -19.95 7.0 -19.95 10.15 -14.8 8.35 -15.0 8.2 -15.0 8.15 -15.0 7.3 -15.05 6.15 -15.1 Q4.8 -15.25 4.5 -15.55 L4.35 -15.9 3.0 -17.2 3.2 -17.75 3.25 -17.95 3.1 -18.4 2.25 -18.65 2.4 -18.65 2.3 -19.05 2.1 -19.65 1.8 -19.65 0.9 -19.65 -1.2 -19.45 -1.8 -19.6 -1.85 -19.65 -1.8 -19.8 -0.75 -20.15 0.1 -20.25 1.45 -20.35 1.85 -20.35 1.75 -20.65 1.5 -21.3 0.9 -21.2 0.75 -21.2 -0.35 -21.1 -0.55 -21.05 -5.15 -20.6 -6.75 -20.55 -6.9 -20.55 -7.1 -20.5 -7.65 -20.4 -7.6 -20.25 -7.55 -20.15 -7.1 -18.65 -6.9 -18.2 -6.85 -18.15 -7.05 -18.15 Q-8.0 -18.35 -8.65 -18.7 L-9.2 -18.55 Q-9.45 -18.95 -9.85 -18.95 L-10.15 -18.9 -10.2 -19.3 -9.95 -19.1 Q-9.5 -19.1 -9.5 -19.5 L-10.9 -22.45 -10.9 -22.6 -10.6 -22.6 -10.25 -22.65 -9.95 -22.65 -8.55 -22.75 -8.3 -22.8 M-0.75 -16.55 L-0.5 -16.6 -0.7 -16.55 -0.75 -16.55 M7.6 -12.9 L7.9 -12.95 7.95 -12.8 7.6 -12.9" fill="#ec2d2d" fill-rule="evenodd" stroke="none"/>
    <path d="M0.7 -23.1 L0.75 -22.9 0.8 -22.8 1.0 -22.45 1.25 -21.9 1.4 -21.6 1.25 -21.9 1.15 -22.05 1.0 -22.05 -3.45 -21.65 -5.2 -21.45 -6.75 -21.3 -7.3 -21.25 -7.85 -21.15 -8.25 -22.6 -8.3 -22.7 -8.3 -22.8 -7.4 -22.85 -4.1 -22.95 -3.9 -22.95 -3.55 -22.95 -3.1 -23.0 -2.85 -23.0 0.7 -23.1 M-6.85 -18.15 L-6.9 -18.2 -7.1 -18.65 -7.55 -20.15 -7.6 -20.25 -7.65 -20.4 -7.1 -20.5 -6.9 -20.55 -6.75 -20.55 -5.15 -20.6 -0.55 -21.05 -0.35 -21.1 0.75 -21.2 0.9 -21.2 1.5 -21.3 1.75 -20.65 1.85 -20.35 1.45 -20.35 0.1 -20.25 -0.75 -20.15 -1.8 -19.8 -1.85 -19.65 -1.8 -19.6 -1.2 -19.45 0.9 -19.65 1.8 -19.65 2.1 -19.65 2.3 -19.05 2.4 -18.65 2.25 -18.65 2.15 -18.65 1.65 -18.65 -0.95 -18.3 -1.1 -18.25 -3.4 -18.0 -3.45 -18.0 -5.1 -18.0 -6.85 -18.15" fill="#ffb509" fill-rule="evenodd" stroke="none"/>
    <path d="M-8.3 -22.8 L-8.55 -22.75 -9.95 -22.65 -10.25 -22.65 -10.6 -22.6 -10.9 -22.6 -11.35 -23.75 Q-11.8 -24.7 -12.2 -24.7 L-12.25 -24.75 3.65 -25.35 7.0 -19.95 6.7 -19.95 3.9 -19.65 Q3.3 -20.2 2.95 -21.1 L2.0 -22.9 1.9 -23.1 0.7 -23.1 -2.85 -23.0 -3.1 -23.0 -3.55 -22.95 -3.9 -22.95 -4.1 -22.95 -7.4 -22.85 -8.3 -22.8" fill="#edff44" fill-rule="evenodd" stroke="none"/>
    <path d="M-9.2 -18.55 L-8.65 -18.7 Q-8.0 -18.35 -7.05 -18.15 L-6.85 -18.15 -5.1 -18.0 -3.45 -18.0 -3.4 -18.0 -1.1 -18.25 -0.95 -18.3 1.65 -18.65 2.15 -18.65 2.25 -18.65 3.1 -18.4 3.25 -17.95 3.2 -17.75 3.0 -17.2 4.35 -15.9 4.5 -15.55 Q4.8 -15.25 6.15 -15.1 L7.3 -15.05 8.15 -15.0 8.2 -15.0 8.35 -15.0 10.15 -14.8 11.7 -14.15 9.9 -14.4 Q9.0 -14.4 8.75 -13.9 L8.65 -13.45 Q8.65 -13.1 9.4 -12.55 L9.5 -12.45 Q10.35 -11.85 11.55 -11.85 L10.95 -11.75 9.7 -11.8 9.15 -11.9 8.7 -12.05 Q8.1 -12.35 7.95 -12.8 L7.9 -12.95 7.6 -12.9 7.35 -12.85 6.3 -12.85 4.95 -13.15 4.3 -13.55 3.85 -13.9 3.8 -14.0 3.1 -14.65 2.4 -15.3 1.9 -15.65 1.7 -15.75 Q1.3 -15.75 0.7 -15.25 L0.05 -14.8 -0.2 -14.75 -0.3 -14.75 -0.75 -14.8 Q-1.4 -15.0 -1.4 -15.65 -1.4 -16.45 -0.7 -16.55 L-0.85 -16.5 0.0 -16.65 0.1 -16.5 0.45 -15.95 0.75 -15.85 2.05 -17.05 2.6 -17.75 2.6 -17.85 2.5 -18.1 1.8 -18.25 0.6 -18.1 -0.75 -17.95 -0.8 -17.95 -2.45 -17.95 -2.65 -17.45 -2.6 -17.25 Q-2.5 -16.6 -1.5 -16.5 L-1.0 -16.5 -1.65 -16.3 -2.05 -16.15 -2.5 -15.95 -4.05 -15.25 -4.35 -15.25 -4.6 -15.25 -5.9 -15.4 Q-7.1 -15.6 -7.9 -16.1 L-8.7 -16.6 -9.1 -16.95 -9.15 -17.05 -9.1 -17.2 -9.05 -17.3 -9.1 -18.15 -9.2 -18.55 M6.2 -15.1 L5.1 -15.25 4.95 -15.1 4.85 -14.7 Q4.85 -13.35 6.1 -13.25 L6.4 -13.25 Q7.05 -13.25 7.1 -13.8 L7.1 -13.9 6.3 -15.1 6.2 -15.1 M-3.7 -16.85 L-3.9 -17.3 Q-4.25 -17.7 -5.3 -17.7 L-5.8 -17.4 -5.85 -17.2 -5.75 -16.8 -5.7 -16.65 Q-5.15 -16.55 -4.9 -16.3 L-4.25 -16.25 -3.9 -16.3 -3.7 -16.8 -3.7 -16.85" fill="#ddeeff" fill-rule="evenodd" stroke="none"/>
    <path d="M-10.9 -22.6 L-10.9 -22.45 Q-11.0 -22.25 -11.3 -22.25 L-11.55 -22.45 -12.4 -24.35 -12.45 -24.5 -12.35 -24.7 -12.25 -24.7 -12.2 -24.7 Q-11.8 -24.7 -11.35 -23.75 L-10.9 -22.6 M11.55 -11.85 Q10.35 -11.85 9.5 -12.45 L9.4 -12.55 Q8.65 -13.1 8.65 -13.45 L8.75 -13.9 Q9.0 -14.4 9.9 -14.4 L11.7 -14.15 Q12.25 -13.65 12.25 -12.95 12.25 -12.1 11.55 -11.85 M-1.0 -16.5 L-1.5 -16.5 Q-2.5 -16.6 -2.6 -17.25 L-2.65 -17.45 -2.45 -17.95 -0.8 -17.95 -0.75 -17.95 0.6 -18.1 1.8 -18.25 2.5 -18.1 2.6 -17.85 2.6 -17.75 2.05 -17.05 0.75 -15.85 0.45 -15.95 0.1 -16.5 0.0 -16.65 -0.85 -16.5 -0.7 -16.55 -0.5 -16.6 -0.75 -16.55 -0.8 -16.55 -1.0 -16.5 M6.2 -15.1 L6.3 -15.1 7.1 -13.9 7.1 -13.8 Q7.05 -13.25 6.4 -13.25 L6.1 -13.25 Q4.85 -13.35 4.85 -14.7 L4.95 -15.1 5.1 -15.25 6.2 -15.1 M-3.7 -16.85 L-3.7 -16.8 -3.9 -16.3 -4.25 -16.25 -4.9 -16.3 Q-5.15 -16.55 -5.7 -16.65 L-5.75 -16.8 -5.85 -17.2 -5.8 -17.4 -5.3 -17.7 Q-4.25 -17.7 -3.9 -17.3 L-3.7 -16.85" fill="#ffffff" fill-rule="evenodd" stroke="none"/>
    <path d="M9.15 -11.9 L9.7 -11.8 10.55 -9.45 9.95 -10.0 9.7 -10.15 Q9.05 -11.1 8.65 -11.0 8.3 -10.9 8.55 -10.15 L7.6 -10.0 7.2 -10.45 7.65 -10.95 Q7.7 -11.45 8.2 -11.5 L9.15 -11.9 M-0.75 -14.8 L-0.3 -14.75 -0.2 -14.75 0.05 -14.45 0.15 -14.35 0.25 -14.05 0.35 -13.75 0.45 -13.4 0.7 -12.8 0.8 -12.25 0.95 -11.85 1.0 -11.55 Q1.15 -11.1 1.75 -11.15 L2.1 -11.25 2.3 -11.2 1.95 -11.0 1.35 -10.6 0.05 -10.9 -0.1 -10.9 0.0 -11.1 0.05 -11.1 Q0.65 -11.2 0.55 -11.6 L0.5 -11.65 0.3 -12.15 -0.1 -12.75 -0.2 -13.0 -0.3 -13.3 -0.45 -13.85 -0.75 -14.3 -0.75 -14.8 M2.4 -15.3 L3.1 -14.65 Q2.15 -14.0 2.25 -13.65 L2.3 -13.55 2.35 -13.4 3.0 -12.85 Q3.75 -12.4 4.2 -12.45 4.5 -12.5 4.6 -12.6 L4.7 -12.6 5.05 -12.65 5.15 -12.3 Q4.2 -12.2 3.25 -11.6 L3.2 -11.7 3.0 -12.2 2.35 -13.25 2.1 -13.5 1.9 -13.75 1.45 -14.55 Q1.3 -15.15 1.75 -15.5 L2.4 -15.3 M3.85 -13.9 L4.3 -13.55 4.15 -13.2 3.6 -13.5 3.55 -13.55 3.75 -13.75 3.85 -13.9 M6.3 -12.85 L7.35 -12.85 7.45 -12.35 7.3 -12.25 Q5.9 -11.55 6.25 -10.8 L6.3 -10.75 Q6.1 -10.55 6.2 -10.35 L6.25 -10.25 6.4 -9.85 6.3 -9.85 5.5 -9.75 4.8 -10.7 5.05 -10.8 5.7 -11.1 5.8 -11.15 Q6.35 -11.55 6.35 -11.9 L6.3 -12.85 M6.8 -8.95 L7.6 -6.45 7.7 -6.2 7.7 -5.8 7.4 -5.35 7.05 -5.5 Q6.7 -5.4 6.95 -4.6 L7.0 -4.6 5.65 -2.2 5.3 -1.7 5.35 -1.3 Q5.55 -0.95 6.0 -0.9 L6.0 -0.85 6.1 -0.9 7.25 -2.35 7.5 -2.9 8.35 -4.45 8.6 -5.0 8.8 -4.4 8.7 -4.15 7.7 -2.45 7.5 -2.1 7.45 -2.05 7.55 -1.65 Q7.75 -1.3 8.35 -1.3 8.95 -1.3 9.7 -2.7 L10.2 -0.95 9.15 -0.75 9.15 -0.9 8.9 -0.9 9.05 -0.7 7.25 -0.35 7.1 -0.5 6.05 -0.25 6.05 -0.65 5.5 -0.55 5.25 -1.05 5.25 -1.4 Q5.4 -2.85 4.4 -2.85 L4.25 -3.3 4.5 -3.4 Q5.8 -3.9 6.25 -4.5 L6.5 -5.25 6.5 -5.4 7.4 -5.55 7.1 -6.05 7.05 -6.1 6.25 -7.6 5.9 -8.85 6.8 -8.95 M8.45 -8.2 L8.15 -8.95 8.95 -8.9 9.75 -7.1 8.45 -8.2 M5.05 -5.75 L5.0 -5.7 4.55 -5.55 4.6 -5.25 4.65 -5.2 4.55 -5.05 4.45 -5.55 4.35 -5.75 3.8 -7.3 Q3.7 -8.0 2.75 -7.85 L2.55 -7.8 2.4 -7.75 2.3 -7.65 1.65 -7.85 1.05 -7.65 0.9 -7.4 1.05 -6.95 1.75 -5.05 1.1 -4.85 0.7 -5.7 0.65 -5.7 -0.65 -8.05 0.25 -8.35 0.75 -8.45 1.5 -8.7 2.45 -8.7 2.6 -8.7 3.7 -8.7 3.95 -8.7 4.4 -8.75 5.05 -5.75 M4.5 -5.0 L3.7 -4.45 3.5 -4.8 4.5 -5.0 M1.4 -3.15 L0.8 -2.25 0.7 -1.85 Q0.85 -0.2 1.9 -0.2 L2.65 -0.35 2.75 -0.25 3.05 -0.05 2.8 0.0 2.95 0.5 1.4 0.85 1.4 0.65 0.7 0.8 0.65 0.85 0.7 0.8 0.7 0.4 Q0.75 -0.5 0.05 -0.5 L-0.25 -0.5 -1.15 -0.55 -1.85 -1.8 -1.25 -2.85 -0.95 -2.95 -1.25 -1.95 Q-1.25 -0.9 -0.6 -0.9 L-0.4 -0.9 Q-0.05 -0.95 -0.05 -1.35 L0.15 -2.35 0.8 -3.15 1.4 -3.15 M2.95 -2.5 Q2.35 -2.2 2.3 -1.4 L2.15 -1.75 2.05 -2.15 Q2.2 -2.4 2.9 -2.7 L2.95 -2.5 M2.85 -10.15 L3.35 -10.3 3.75 -10.4 3.95 -10.15 4.2 -9.75 4.2 -9.6 3.45 -9.55 3.35 -9.55 2.85 -9.65 2.9 -9.7 2.95 -10.05 2.85 -10.15 M0.0 -9.35 L-0.2 -9.25 -0.25 -9.2 -1.15 -9.0 -1.1 -9.85 0.0 -9.85 0.2 -9.85 0.0 -9.45 0.0 -9.35 M-2.5 -8.7 L-3.65 -8.55 -3.65 -8.65 -4.2 -9.1 -4.25 -9.15 -4.25 -9.2 -4.25 -9.5 -4.5 -9.9 -4.45 -9.9 -4.35 -10.05 -2.85 -9.8 -2.3 -9.85 Q-2.6 -9.5 -2.5 -8.7 M-4.95 -8.3 L-6.45 -8.0 Q-6.9 -8.65 -7.2 -8.6 L-7.5 -8.45 -7.8 -7.65 -7.95 -7.4 -8.05 -7.35 -8.25 -6.9 Q-8.5 -6.15 -8.25 -5.15 L-8.35 -5.15 -8.5 -5.15 -8.5 -5.85 Q-8.5 -6.4 -9.15 -7.3 L-9.2 -7.55 -9.25 -7.55 -8.8 -8.55 -9.2 -8.9 Q-10.2 -8.6 -10.2 -7.3 -10.2 -6.75 -9.7 -5.95 L-9.95 -6.0 Q-11.15 -6.0 -11.15 -4.45 L-11.35 -4.7 -12.1 -8.3 Q-11.9 -8.65 -11.35 -8.85 L-11.4 -9.05 -11.35 -8.9 -11.35 -8.85 -11.3 -8.75 -11.35 -8.65 -11.9 -8.1 Q-11.95 -7.35 -11.25 -7.35 L-11.0 -7.35 -10.95 -7.4 Q-10.3 -7.6 -10.3 -8.7 -10.3 -9.05 -10.65 -9.75 L-10.55 -9.95 -10.35 -10.5 -10.2 -10.5 -9.9 -10.4 -9.8 -10.35 -9.75 -10.2 Q-9.45 -9.9 -8.85 -9.75 L-8.35 -9.6 -8.15 -9.55 -7.4 -9.4 -6.8 -9.6 -6.4 -9.5 -6.25 -9.4 -6.0 -9.25 -5.6 -9.0 -4.75 -8.85 -4.95 -8.4 -4.95 -8.3 M-7.65 -3.75 L-7.1 -2.9 -7.05 -2.85 -7.05 -2.8 -7.1 -2.7 -7.45 -2.65 -7.85 -2.95 -8.2 -2.85 -8.2 -2.7 -8.2 -2.65 -8.2 -2.7 -8.2 -2.6 Q-8.2 -0.75 -7.85 -0.2 L-7.5 -1.15 -7.45 -1.05 -7.05 -1.3 -7.05 -1.25 -7.1 -0.2 -6.75 0.9 -7.15 0.85 Q-8.8 0.85 -8.8 1.8 -8.8 2.55 -7.75 2.65 L-8.65 2.85 -8.65 2.65 -8.75 2.6 -9.9 0.5 -9.95 -0.95 -9.15 0.55 Q-8.6 0.55 -8.6 -0.5 L-9.2 -2.8 -9.25 -3.25 -9.05 -3.55 -8.7 -4.0 -8.45 -4.1 -7.65 -3.75 M-5.8 -6.6 L-4.9 -6.95 -3.8 -7.35 -3.5 -7.45 -3.3 -7.5 -2.3 -7.75 -2.25 -7.65 -1.6 -6.25 -1.5 -5.55 -1.45 -5.35 -1.15 -4.15 -1.25 -4.15 -1.8 -4.1 -2.35 -3.6 Q-2.85 -2.95 -2.85 -1.5 L-2.75 -0.05 Q-2.3 1.05 -0.25 1.15 L0.1 1.15 0.35 1.15 -0.3 1.7 -2.75 1.45 -2.8 1.45 -3.45 1.4 -4.05 0.3 -3.6 -1.45 -3.55 -2.0 -3.5 -3.5 -3.45 -3.6 -3.0 -3.7 Q-2.9 -4.35 -3.2 -5.3 L-3.35 -5.65 -3.55 -6.0 Q-3.85 -6.6 -4.25 -6.6 L-4.4 -6.6 -4.45 -6.35 -4.55 -6.05 -4.65 -5.85 -5.1 -4.5 -5.55 -5.85 -5.65 -6.2 -5.7 -6.25 -5.6 -6.45 -5.75 -6.4 -5.8 -6.6 M2.6 -4.15 L2.6 -4.1 2.45 -4.1 2.6 -4.15 M-0.05 -4.1 L-0.2 -4.0 -0.6 -4.05 -0.85 -4.1 -0.45 -4.2 -0.35 -4.05 -0.05 -4.1 M-8.55 -16.0 L-8.25 -15.9 -6.75 -15.15 -6.75 -15.1 -7.8 -14.55 -8.4 -15.1 -8.55 -15.25 -9.2 -15.6 -9.7 -15.8 -9.65 -15.9 -9.6 -15.85 -8.55 -16.0 M-5.95 -14.45 L-5.9 -14.35 -5.85 -14.2 -6.0 -13.1 -7.1 -13.45 -7.1 -13.6 Q-7.1 -14.05 -5.95 -14.45 M-4.85 -12.9 L-4.8 -13.0 -4.75 -13.1 -4.6 -13.4 -4.05 -13.15 -3.5 -12.9 -3.55 -12.85 -3.65 -12.75 -3.9 -12.45 -4.25 -12.65 -4.85 -12.9 M-4.85 -14.7 L-4.95 -14.9 -4.75 -15.1 -4.6 -15.25 -4.35 -15.25 -4.85 -14.7 M-9.1 -16.95 L-9.2 -16.95 -9.15 -17.05 -9.1 -16.95 M-9.25 -13.2 L-9.3 -12.35 -9.35 -12.5 -9.25 -13.2 M-7.15 -10.75 L-7.45 -11.3 -7.8 -11.9 -7.85 -12.05 -7.9 -12.95 -7.9 -13.0 -7.5 -12.8 -7.4 -12.75 -6.6 -12.35 -6.15 -12.15 -6.1 -11.55 -6.05 -11.45 -5.7 -10.85 -5.25 -10.3 -6.75 -10.65 -7.15 -10.75 M-4.55 -11.7 L-3.95 -11.7 -3.9 -11.75 -3.25 -11.65 Q-2.85 -11.8 -2.4 -12.4 L-2.3 -12.6 -2.15 -13.2 -2.2 -13.3 Q-2.5 -13.7 -3.9 -14.1 L-4.05 -14.15 -3.95 -14.6 -3.5 -15.05 -3.4 -15.1 -2.8 -14.8 -2.1 -14.15 -1.9 -13.4 -1.85 -13.3 -1.85 -13.25 -1.85 -12.6 -1.7 -11.2 -2.85 -11.3 -3.1 -11.35 -4.3 -11.35 -4.55 -11.7 M-2.55 -15.8 L-2.5 -15.95 -2.05 -16.15 -1.8 -16.0 -2.0 -15.55 -2.3 -15.7 -2.55 -15.8 M-12.1 -9.35 L-11.75 -10.7 -11.6 -10.55 -11.65 -10.5 -11.8 -9.4 -11.5 -9.1 -12.1 -9.35 M-9.75 -14.35 L-9.85 -14.6 -9.5 -14.45 -9.75 -14.35 M-10.3 -12.95 L-10.3 -12.85 -10.45 -13.05 -10.3 -12.95 M-9.95 -11.35 L-9.95 -11.25 -10.05 -11.3 -10.0 -11.35 -9.95 -11.35 M-8.2 -2.7 L-8.25 -2.85 -8.2 -2.7 M-7.3 -0.75 L-7.2 -0.95 -7.4 -0.9 -7.3 -0.75 M-4.85 -2.0 L-4.9 -1.85 -4.95 -2.0 -4.85 -2.0" fill="#874301" fill-rule="evenodd" stroke="none"/>
    <path d="M8.7 -12.05 L9.15 -11.9 8.2 -11.5 Q7.7 -11.45 7.65 -10.95 L7.2 -10.45 6.4 -10.95 6.3 -10.75 6.25 -10.8 Q5.9 -11.55 7.3 -12.25 L7.45 -12.35 7.55 -12.05 7.75 -11.7 8.3 -11.7 Q8.65 -11.75 8.7 -12.05 M-0.2 -14.75 L0.05 -14.8 0.15 -14.35 0.05 -14.45 -0.2 -14.75 M1.9 -15.65 L2.4 -15.3 1.75 -15.5 1.9 -15.65 M3.1 -14.65 L3.8 -14.0 3.85 -13.9 3.75 -13.75 3.55 -13.55 3.6 -13.5 4.15 -13.2 4.3 -13.55 4.95 -13.15 5.05 -12.65 4.7 -12.6 4.6 -12.6 Q4.5 -12.5 4.2 -12.45 3.75 -12.4 3.0 -12.85 L2.35 -13.4 2.3 -13.55 2.25 -13.65 Q2.15 -14.0 3.1 -14.65 M0.7 -12.8 L1.0 -12.3 1.2 -12.0 2.1 -11.25 1.75 -11.15 Q1.15 -11.1 1.0 -11.55 L0.95 -11.85 0.8 -12.25 0.7 -12.8 M2.3 -11.2 L2.8 -11.2 Q3.35 -11.25 3.25 -11.6 4.2 -12.2 5.15 -12.3 L5.3 -11.9 5.5 -11.75 5.55 -11.7 6.0 -11.5 Q6.25 -11.55 6.35 -11.9 6.35 -11.55 5.8 -11.15 L5.7 -11.1 5.05 -10.8 4.8 -10.7 4.2 -11.05 3.75 -11.05 Q3.25 -11.05 3.45 -10.7 L3.75 -10.4 3.35 -10.3 2.85 -10.15 1.35 -10.6 1.95 -11.0 2.3 -11.2 M1.9 -13.75 L1.6 -14.1 Q1.45 -14.35 1.45 -14.55 L1.9 -13.75 M-0.75 -14.3 L-0.45 -13.85 -0.3 -13.3 -0.2 -13.0 -0.1 -12.75 -0.25 -13.0 -0.4 -13.3 -0.5 -13.5 -0.75 -14.3 M0.0 -11.1 L-0.1 -10.9 -1.7 -11.2 -1.85 -12.6 -1.85 -13.25 -1.6 -12.6 -0.95 -11.5 -0.4 -11.15 0.0 -11.1 M6.4 -9.85 L6.7 -9.15 6.7 -9.05 6.8 -8.95 5.9 -8.85 5.85 -9.05 5.5 -9.75 6.3 -9.85 6.4 -9.85 M8.75 -6.0 L9.15 -6.1 8.85 -6.55 8.45 -8.2 9.75 -7.1 9.9 -6.75 10.05 -6.55 9.75 -6.05 8.85 -5.9 8.75 -6.0 M8.15 -8.95 L8.0 -9.4 7.6 -10.0 8.55 -10.15 8.95 -8.9 8.15 -8.95 M9.7 -10.15 L9.95 -10.0 10.55 -9.45 11.3 -8.35 11.8 -6.45 11.2 -6.3 11.25 -6.55 11.7 -6.6 11.45 -6.95 9.7 -10.15 M5.0 -5.7 Q4.95 -5.4 4.55 -5.05 L4.5 -5.0 3.5 -4.8 3.7 -4.45 2.9 -4.1 1.4 -3.15 0.8 -3.15 1.5 -3.6 2.45 -4.1 2.6 -4.1 2.6 -4.15 3.1 -4.7 3.05 -4.9 3.5 -5.0 3.45 -5.25 3.25 -5.7 2.95 -6.65 2.8 -6.95 2.3 -7.65 2.4 -7.75 2.55 -7.8 2.75 -7.85 Q3.7 -8.0 3.8 -7.3 L4.35 -5.75 4.45 -5.55 4.55 -5.05 4.65 -5.2 4.6 -5.25 4.55 -5.55 5.0 -5.7 M3.5 0.1 L3.8 0.15 3.5 0.15 3.5 0.1 M4.35 0.15 L4.5 0.15 4.35 0.2 4.35 0.15 M4.7 0.15 Q5.15 -0.05 5.25 -1.05 L5.5 -0.55 5.75 -0.05 4.7 0.15 M4.4 -2.85 L2.95 -2.5 2.9 -2.7 4.2 -3.3 4.25 -3.3 4.4 -2.85 M2.3 -1.4 L2.3 -1.3 2.3 -1.25 Q1.9 -1.65 1.9 -1.9 L2.05 -2.15 2.15 -1.75 2.3 -1.4 M6.5 -5.4 L6.45 -5.55 6.7 -5.6 6.6 -5.95 6.25 -7.6 7.05 -6.1 7.1 -6.05 7.4 -5.55 6.5 -5.4 M4.2 -9.6 L4.4 -8.75 3.95 -8.7 3.7 -8.7 2.6 -8.7 2.45 -8.7 1.5 -8.7 Q2.6 -9.2 2.85 -9.65 L3.35 -9.55 3.45 -9.55 4.2 -9.6 M-0.65 -8.05 L0.65 -5.7 0.7 -5.7 1.1 -4.85 0.45 -4.5 0.3 -5.45 0.25 -5.65 0.0 -6.25 -0.4 -6.9 -0.9 -7.3 -1.4 -7.3 -1.6 -7.05 -1.6 -6.25 -2.25 -7.65 -2.3 -7.75 -1.9 -7.85 -1.45 -7.9 -1.15 -8.0 -0.65 -8.05 M-1.15 -9.0 L-1.55 -8.9 -2.3 -8.75 -2.5 -8.7 Q-2.6 -9.5 -2.3 -9.85 L-1.1 -9.85 -1.15 -9.0 M-3.65 -8.55 L-3.7 -8.55 -4.7 -8.35 -4.95 -8.3 -4.95 -8.4 -4.75 -8.85 Q-4.4 -8.9 -4.25 -9.15 L-4.2 -9.1 -3.65 -8.65 -3.65 -8.55 M-6.45 -8.0 L-7.25 -7.9 -7.6 -7.8 -7.8 -7.65 -7.5 -8.45 -7.2 -8.6 Q-6.9 -8.65 -6.45 -8.0 M-8.25 -5.15 L-8.25 -5.05 -7.65 -3.75 -8.45 -4.1 -8.7 -4.0 -8.5 -5.15 -8.35 -5.15 -8.25 -5.15 M-5.75 -3.15 L-5.65 -3.15 -6.65 -5.4 Q-6.8 -6.05 -5.8 -6.6 L-5.75 -6.4 -5.6 -6.45 -5.7 -6.25 -5.65 -6.2 -5.55 -5.85 -5.1 -4.5 -5.15 -4.35 -5.45 -3.4 -5.45 -3.2 -5.2 -3.25 -4.85 -2.1 -4.85 -2.0 -4.95 -2.0 -4.9 -1.85 -5.5 0.1 Q-5.7 -0.25 -5.7 -2.1 L-5.75 -3.15 M0.2 -9.85 L0.5 -9.85 1.4 -9.85 0.0 -9.35 0.0 -9.45 0.2 -9.85 M0.2 -4.35 L-0.05 -4.1 -0.35 -4.05 -0.45 -4.2 0.2 -4.35 M-0.2 -4.0 L-0.4 -3.75 -0.6 -4.05 -0.2 -4.0 M-1.15 -0.55 L-1.9 -0.7 -1.9 -1.55 -1.85 -1.8 -1.15 -0.55 M-1.25 -2.85 L-0.6 -3.45 -0.95 -2.95 -1.25 -2.85 M7.0 -4.6 L6.95 -4.6 Q6.7 -5.4 7.05 -5.5 L7.4 -5.35 7.0 -4.65 7.0 -4.6 M6.0 -0.9 L6.1 -0.9 6.0 -0.85 6.0 -0.9 M10.9 -9.7 L10.6 -10.4 11.05 -9.4 10.9 -9.7 M12.55 -6.6 L12.4 -6.6 12.4 -6.8 12.55 -6.6 M10.8 -1.3 L10.95 -1.1 10.8 -1.1 10.8 -1.3 M-6.75 -15.1 L-6.75 -15.15 -8.25 -15.9 -8.55 -16.0 -7.9 -16.1 Q-7.1 -15.6 -5.9 -15.4 L-6.75 -15.1 M-9.7 -15.8 L-9.2 -15.6 -8.55 -15.25 -8.4 -15.1 -7.8 -14.55 -8.3 -13.95 -8.3 -13.4 -8.1 -13.15 -7.9 -13.0 -7.9 -12.95 -7.85 -12.05 -7.8 -11.9 -7.45 -11.3 -7.15 -10.75 Q-8.65 -11.15 -9.15 -11.9 L-9.2 -12.05 -9.3 -12.35 -9.25 -13.2 -9.2 -13.3 -8.75 -13.7 -8.35 -14.1 -8.05 -14.6 -8.4 -14.95 -8.65 -15.1 -9.85 -15.45 -9.9 -15.45 -9.7 -15.8 M-6.0 -13.1 L-5.85 -14.2 -5.9 -14.35 -5.95 -14.45 -5.7 -14.5 -4.95 -14.9 -4.85 -14.7 -5.25 -14.05 -4.6 -13.4 -4.75 -13.1 -4.8 -13.0 -4.85 -12.9 -5.3 -12.95 -5.4 -13.0 -6.0 -13.1 M-8.7 -16.6 L-9.05 -16.55 -9.2 -16.5 -9.25 -16.8 -9.2 -16.95 -9.1 -16.95 -8.7 -16.6 M-6.15 -12.15 L-4.55 -11.7 -4.3 -11.35 -4.9 -11.25 -5.1 -11.2 Q-5.45 -11.15 -5.35 -10.8 L-5.35 -10.7 Q-5.15 -10.3 -4.35 -10.05 L-4.45 -9.9 -4.5 -9.9 Q-4.9 -9.95 -5.25 -10.3 L-5.7 -10.85 -6.05 -11.45 -6.1 -11.55 -6.15 -12.15 M-3.4 -15.1 L-3.1 -15.3 -2.55 -15.8 -2.3 -15.7 -2.0 -15.55 -2.05 -15.4 -2.15 -14.55 -2.1 -14.15 -2.8 -14.8 -3.4 -15.1 M-1.65 -16.3 L-1.8 -16.0 -2.05 -16.15 -1.65 -16.3 M-11.75 -10.7 L-11.6 -11.15 -11.45 -11.55 -11.3 -12.1 -10.9 -11.55 -11.6 -10.55 -11.75 -10.7 M-10.65 -13.6 L-10.2 -14.75 -9.85 -14.6 -9.75 -14.35 -10.5 -13.8 -10.3 -12.95 -10.45 -13.05 -10.3 -12.85 -10.15 -12.15 -10.5 -12.7 Q-10.5 -13.35 -10.65 -13.6 M-10.0 -11.45 L-9.95 -11.35 -10.0 -11.35 -10.0 -11.45 M-9.95 -11.25 L-9.8 -10.35 -9.9 -10.4 -10.2 -10.5 -10.35 -10.5 -10.05 -11.3 -9.95 -11.25 M-8.15 -9.55 L-7.2 -9.65 -6.8 -9.6 -7.4 -9.4 -8.15 -9.55 M-11.35 -8.9 L-11.3 -8.75 -11.35 -8.85 -11.35 -8.9 M-9.2 -7.3 L-9.25 -7.45 -9.25 -7.55 -9.2 -7.55 -9.2 -7.3 M-4.05 0.3 L-3.45 1.4 -3.2 1.75 -5.05 2.15 -5.05 1.9 -6.45 2.25 -6.4 2.4 -7.05 2.55 -6.7 2.15 -6.4 1.55 -6.5 1.2 -5.35 1.5 Q-4.6 1.5 -4.05 0.3 M-7.05 -2.85 L-7.05 -2.8 -7.05 -2.85 M-7.45 -2.65 L-7.1 -2.7 -7.05 -1.3 -7.45 -1.05 -7.5 -1.15 -7.35 -1.65 -7.4 -2.35 -7.45 -2.65 M-8.2 -2.65 L-8.2 -2.6 -8.2 -2.7 -8.2 -2.65" fill="#b35900" fill-rule="evenodd" stroke="none"/>
    <path d="M-1.0 -16.5 L-0.8 -16.55 -0.75 -16.55 -0.7 -16.55 Q-1.4 -16.45 -1.4 -15.65 -1.4 -15.0 -0.75 -14.8 L-0.75 -14.3 -0.5 -13.5 -0.4 -13.3 -0.25 -13.0 -0.1 -12.75 0.3 -12.15 0.5 -11.65 0.55 -11.6 Q0.65 -11.2 0.05 -11.1 L0.0 -11.1 -0.4 -11.15 -0.95 -11.5 -1.6 -12.6 -1.85 -13.25 -1.85 -13.3 -1.9 -13.4 -2.1 -14.15 -2.15 -14.55 -2.05 -15.4 -2.0 -15.55 -1.8 -16.0 -1.65 -16.3 -1.0 -16.5 M0.05 -14.8 L0.7 -15.25 Q1.3 -15.75 1.7 -15.75 L1.9 -15.65 1.75 -15.5 Q1.3 -15.15 1.45 -14.55 1.45 -14.35 1.6 -14.1 L1.9 -13.75 2.1 -13.5 2.35 -13.25 3.0 -12.2 3.2 -11.7 3.25 -11.6 Q3.35 -11.25 2.8 -11.2 L2.3 -11.2 2.1 -11.25 1.2 -12.0 1.0 -12.3 0.7 -12.8 0.45 -13.4 0.35 -13.75 0.25 -14.05 0.15 -14.35 0.05 -14.8 M4.95 -13.15 L6.3 -12.85 6.35 -11.9 Q6.25 -11.55 6.0 -11.5 L5.55 -11.7 5.5 -11.75 5.3 -11.9 5.15 -12.3 5.05 -12.65 4.95 -13.15 M7.35 -12.85 L7.6 -12.9 7.95 -12.8 Q8.1 -12.35 8.7 -12.05 8.65 -11.75 8.3 -11.7 L7.75 -11.7 7.55 -12.05 7.45 -12.35 7.35 -12.85 M6.3 -10.75 L6.4 -10.95 7.2 -10.45 7.6 -10.0 8.0 -9.4 8.15 -8.95 8.45 -8.2 8.85 -6.55 9.15 -6.1 8.75 -6.0 8.7 -6.0 8.2 -6.65 7.7 -5.8 7.7 -6.2 7.6 -6.45 6.8 -8.95 6.7 -9.05 6.7 -9.15 6.4 -9.85 6.25 -10.25 6.2 -10.35 Q6.1 -10.55 6.3 -10.75 M-0.1 -10.9 L0.05 -10.9 1.35 -10.6 2.85 -10.15 2.95 -10.05 2.9 -9.7 2.85 -9.65 Q2.6 -9.2 1.5 -8.7 L0.75 -8.45 0.25 -8.35 -0.65 -8.05 -1.15 -8.0 -1.45 -7.9 -1.9 -7.85 -2.3 -7.75 -3.3 -7.5 -3.5 -7.45 -3.8 -7.35 -4.9 -6.95 -5.8 -6.6 Q-6.8 -6.05 -6.65 -5.4 L-5.65 -3.15 -5.75 -3.15 Q-5.9 -3.65 -6.25 -3.65 -6.85 -3.65 -7.05 -2.85 L-7.1 -2.9 -7.65 -3.75 -8.25 -5.05 -8.25 -5.15 Q-8.5 -6.15 -8.25 -6.9 L-8.05 -7.35 -7.95 -7.4 -7.8 -7.65 -7.6 -7.8 -7.25 -7.9 -6.45 -8.0 -4.95 -8.3 -4.7 -8.35 -3.7 -8.55 -3.65 -8.55 -2.5 -8.7 -2.3 -8.75 -1.55 -8.9 -1.15 -9.0 -0.25 -9.2 -0.2 -9.25 0.0 -9.35 1.4 -9.85 0.5 -9.85 0.2 -9.85 0.0 -9.85 -1.1 -9.85 -2.3 -9.85 -2.85 -9.8 -4.35 -10.05 Q-5.15 -10.3 -5.35 -10.7 L-5.35 -10.8 Q-5.45 -11.15 -5.1 -11.2 L-4.9 -11.25 -4.3 -11.35 -3.1 -11.35 -2.85 -11.3 -1.7 -11.2 -0.1 -10.9 M8.55 -10.15 Q8.3 -10.9 8.65 -11.0 9.05 -11.1 9.7 -10.15 L11.45 -6.95 11.7 -6.6 11.25 -6.55 Q11.3 -7.5 10.6 -7.5 L10.05 -6.55 9.9 -6.75 9.75 -7.1 8.95 -8.9 8.55 -10.15 M4.8 -10.7 L5.5 -9.75 5.85 -9.05 5.9 -8.85 6.25 -7.6 6.6 -5.95 6.7 -5.6 6.45 -5.55 Q6.3 -6.4 5.65 -6.4 L5.05 -5.9 5.05 -5.75 4.4 -8.75 4.2 -9.6 4.2 -9.75 3.95 -10.15 3.75 -10.4 3.45 -10.7 Q3.25 -11.05 3.75 -11.05 L4.2 -11.05 4.8 -10.7 M1.75 -5.05 L1.05 -6.95 0.9 -7.4 1.05 -7.65 1.65 -7.85 2.3 -7.65 2.8 -6.95 2.95 -6.65 3.25 -5.7 3.45 -5.25 3.5 -5.0 3.05 -4.9 2.55 -5.15 1.75 -5.05 M-1.6 -6.25 L-1.6 -7.05 -1.4 -7.3 -0.9 -7.3 -0.4 -6.9 0.0 -6.25 0.25 -5.65 0.3 -5.45 0.45 -4.5 0.2 -4.35 -0.45 -4.2 -0.85 -4.1 -1.15 -4.15 -1.45 -5.35 -1.5 -5.55 -1.6 -6.25 M-6.75 -15.1 L-5.9 -15.4 -4.6 -15.25 -4.75 -15.1 -4.95 -14.9 -5.7 -14.5 -5.95 -14.45 Q-7.1 -14.05 -7.1 -13.6 L-7.1 -13.45 -6.0 -13.1 -5.4 -13.0 -5.3 -12.95 -4.85 -12.9 -4.25 -12.65 -3.9 -12.45 -3.65 -12.75 -3.55 -12.85 -3.5 -12.9 -4.05 -13.15 -4.6 -13.4 -5.25 -14.05 -4.85 -14.7 -4.35 -15.25 -4.05 -15.25 -2.5 -15.95 -2.55 -15.8 -3.1 -15.3 -3.4 -15.1 -3.5 -15.05 -3.95 -14.6 -4.05 -14.15 -3.9 -14.1 Q-2.5 -13.7 -2.2 -13.3 L-2.15 -13.2 -2.3 -12.6 -2.4 -12.4 Q-2.85 -11.8 -3.25 -11.65 L-3.9 -11.75 -3.95 -11.7 -4.55 -11.7 -6.15 -12.15 -6.6 -12.35 -7.4 -12.75 -7.5 -12.8 -7.9 -13.0 -8.1 -13.15 -8.3 -13.4 -8.3 -13.95 -7.8 -14.55 -6.75 -15.1 M-7.9 -16.1 L-8.55 -16.0 -9.6 -15.85 -9.65 -15.9 -9.25 -16.8 -9.2 -16.5 -9.05 -16.55 -8.7 -16.6 -7.9 -16.1 M-9.9 -15.45 L-9.85 -15.45 -8.65 -15.1 -8.4 -14.95 -8.05 -14.6 -8.35 -14.1 -8.75 -13.7 -9.2 -13.3 -9.25 -13.2 -9.35 -12.5 -9.3 -12.35 -9.2 -12.05 -9.15 -11.9 Q-8.65 -11.15 -7.15 -10.75 L-6.75 -10.65 -5.25 -10.3 Q-4.9 -9.95 -4.5 -9.9 L-4.25 -9.5 -4.25 -9.2 -4.25 -9.15 Q-4.4 -8.9 -4.75 -8.85 L-5.6 -9.0 -6.0 -9.25 -6.25 -9.4 -6.4 -9.5 -6.8 -9.6 -7.2 -9.65 -8.15 -9.55 -8.35 -9.6 -8.85 -9.75 Q-9.45 -9.9 -9.75 -10.2 L-9.8 -10.35 -9.95 -11.25 -9.95 -11.35 -10.0 -11.45 -9.95 -11.55 -10.15 -12.15 -10.3 -12.85 -10.3 -12.95 -10.5 -13.8 -9.75 -14.35 -9.5 -14.45 -9.85 -14.6 -10.2 -14.75 -9.9 -15.45 M-9.15 -7.3 L-9.2 -7.3 -9.2 -7.55 -9.15 -7.3 M-10.85 -2.0 L-10.65 -1.2 -10.6 -0.75 -10.85 -2.0 M-5.1 -4.5 L-4.65 -5.85 -4.55 -6.05 -4.45 -6.35 -4.4 -6.6 -4.25 -6.6 Q-3.85 -6.6 -3.55 -6.0 L-3.35 -5.65 -3.2 -5.3 Q-2.9 -4.35 -3.0 -3.7 L-3.45 -3.6 Q-3.45 -4.05 -4.3 -4.05 -5.2 -4.05 -5.2 -3.3 L-5.2 -3.25 -5.45 -3.2 -5.45 -3.4 -5.15 -4.35 -5.1 -4.5 M-8.2 -2.7 L-8.25 -2.85 -8.2 -2.7 M-9.9 2.6 L-9.8 2.9 -9.85 2.85 -9.9 2.6" fill="#f4f402" fill-rule="evenodd" stroke="none"/>
    <path d="M7.7 -5.8 L8.2 -6.65 8.7 -6.0 8.85 -5.6 8.6 -5.0 8.35 -4.45 7.5 -2.9 7.25 -2.35 6.1 -0.9 6.0 -0.9 Q5.55 -0.95 5.35 -1.3 L5.3 -1.7 5.65 -2.2 7.0 -4.6 7.0 -4.65 7.4 -5.35 7.7 -5.8 M10.05 -6.55 L10.6 -7.5 Q11.3 -7.5 11.25 -6.55 L11.2 -6.3 9.7 -2.7 Q8.95 -1.3 8.35 -1.3 7.75 -1.3 7.55 -1.65 L7.45 -2.05 7.5 -2.1 7.7 -2.45 8.7 -4.15 8.8 -4.4 9.0 -4.8 9.75 -6.05 10.05 -6.55 M5.05 -5.75 L5.05 -5.9 5.65 -6.4 Q6.3 -6.4 6.45 -5.55 L6.5 -5.4 6.5 -5.25 6.25 -4.5 Q5.8 -3.9 4.5 -3.4 L4.25 -3.3 4.2 -3.3 2.9 -2.7 Q2.2 -2.4 2.05 -2.15 L1.9 -1.9 Q1.9 -1.65 2.3 -1.25 L2.3 -1.3 2.3 -1.4 Q2.35 -2.2 2.95 -2.5 L4.4 -2.85 Q5.4 -2.85 5.25 -1.4 L5.25 -1.05 Q5.15 -0.05 4.7 0.15 L4.5 0.15 4.35 0.15 3.8 0.15 3.5 0.1 3.05 -0.05 2.75 -0.25 2.65 -0.35 1.9 -0.2 Q0.85 -0.2 0.7 -1.85 L0.8 -2.25 1.4 -3.15 2.9 -4.1 3.7 -4.45 4.5 -5.0 4.55 -5.05 Q4.95 -5.4 5.0 -5.7 L5.05 -5.75 M1.1 -4.85 L1.75 -5.05 2.55 -5.15 3.05 -4.9 3.1 -4.7 2.6 -4.15 2.45 -4.1 1.5 -3.6 0.8 -3.15 0.15 -2.35 -0.05 -1.35 Q-0.05 -0.95 -0.4 -0.9 L-0.6 -0.9 Q-1.25 -0.9 -1.25 -1.95 L-0.95 -2.95 -0.6 -3.45 -1.25 -2.85 -1.85 -1.8 -1.9 -1.55 -1.9 -0.7 -1.15 -0.55 -0.25 -0.5 0.05 -0.5 Q0.75 -0.5 0.7 0.4 L0.7 0.8 0.65 0.85 0.35 1.15 0.1 1.15 -0.25 1.15 Q-2.3 1.05 -2.75 -0.05 L-2.85 -1.5 Q-2.85 -2.95 -2.35 -3.6 L-1.8 -4.1 -1.25 -4.15 -1.15 -4.15 -0.85 -4.1 -0.6 -4.05 -0.4 -3.75 -0.2 -4.0 -0.05 -4.1 0.2 -4.35 0.45 -4.5 1.1 -4.85 M-7.05 -2.85 Q-6.85 -3.65 -6.25 -3.65 -5.9 -3.65 -5.75 -3.15 L-5.7 -2.1 Q-5.7 -0.25 -5.5 0.1 L-4.9 -1.85 -4.85 -2.0 -4.85 -2.1 -5.2 -3.25 -5.2 -3.3 Q-5.2 -4.05 -4.3 -4.05 -3.45 -4.05 -3.45 -3.6 L-3.5 -3.5 -3.55 -2.0 -3.6 -1.45 -4.05 0.3 Q-4.6 1.5 -5.35 1.5 L-6.5 1.2 -6.4 1.55 -6.7 2.15 -7.05 2.55 -7.45 2.65 -7.75 2.65 Q-8.8 2.55 -8.8 1.8 -8.8 0.85 -7.15 0.85 L-6.75 0.9 -7.1 -0.2 -7.05 -1.25 -7.05 -1.3 -7.1 -2.7 -7.05 -2.8 -7.05 -2.85 M-11.3 -12.1 L-10.65 -13.6 Q-10.5 -13.35 -10.5 -12.7 L-10.15 -12.15 -9.95 -11.55 -10.0 -11.45 -10.0 -11.35 -10.05 -11.3 -10.35 -10.5 -10.55 -9.95 -10.65 -9.75 Q-10.3 -9.05 -10.3 -8.7 -10.3 -7.6 -10.95 -7.4 L-11.0 -7.35 -11.25 -7.35 Q-11.95 -7.35 -11.9 -8.1 L-11.35 -8.65 -11.3 -8.75 -11.35 -8.9 -11.4 -9.05 -11.5 -9.1 -11.8 -9.4 -11.65 -10.5 -11.6 -10.55 -10.9 -11.55 -11.3 -12.1 M-9.25 -7.55 L-9.25 -7.45 -9.2 -7.3 -9.15 -7.3 Q-8.5 -6.4 -8.5 -5.85 L-8.5 -5.15 -8.7 -4.0 -9.05 -3.55 -9.25 -3.25 -9.2 -2.8 -8.6 -0.5 Q-8.6 0.55 -9.15 0.55 L-9.95 -0.95 -11.15 -4.45 Q-11.15 -6.0 -9.95 -6.0 L-9.7 -5.95 Q-10.2 -6.75 -10.2 -7.3 -10.2 -8.6 -9.2 -8.9 L-8.8 -8.55 -9.25 -7.55 M-7.45 -2.65 L-7.4 -2.35 -7.35 -1.65 -7.5 -1.15 -7.85 -0.2 Q-8.2 -0.75 -8.2 -2.6 L-8.2 -2.65 -8.2 -2.7 -8.2 -2.85 -7.85 -2.95 -7.45 -2.65" fill="#e6b700" fill-rule="evenodd" stroke="none"/>
    <path d="M-12.25 -24.75 L-12.2 -24.7 -12.25 -24.7 -12.25 -24.75 M-12.4 -24.35 L-11.55 -22.45 -11.6 -22.1 -11.55 -21.9 -11.55 -21.85 -11.75 -21.3 -12.3 -20.0 -12.5 -19.55 -12.55 -19.45 -12.9 -18.6 -13.85 -16.4 -14.2 -15.75 -14.4 -15.45 -15.0 -18.6 -14.25 -20.05 -12.4 -24.35" fill="#c9a003" fill-rule="evenodd" stroke="none"/>
    <path d="M-10.9 -22.45 L-9.5 -19.5 Q-9.5 -19.1 -9.95 -19.1 L-10.2 -19.3 -11.0 -20.6 -11.55 -21.9 -11.6 -22.1 -11.55 -22.45 -11.3 -22.25 Q-11.0 -22.25 -10.9 -22.45" fill="#f8a9a9" fill-rule="evenodd" stroke="none"/>
    <path d="M-10.2 -19.3 L-10.15 -18.9 -10.45 -18.8 -10.8 -18.6 -11.0 -18.45 -11.25 -18.2 -11.7 -17.1 -12.0 -14.7 -12.1 -14.05 -13.1 -10.85 -13.3 -10.15 -14.4 -15.4 -14.4 -15.45 -14.2 -15.75 -13.85 -16.4 -12.9 -18.6 -12.55 -19.45 -12.5 -19.55 -12.3 -20.0 -11.75 -21.3 -11.55 -21.85 -11.55 -21.9 -11.0 -20.6 -10.2 -19.3" fill="#d21313" fill-rule="evenodd" stroke="none"/>
    <path d="M-10.15 -18.9 L-9.85 -18.95 Q-9.45 -18.95 -9.2 -18.55 L-9.1 -18.15 -9.05 -17.3 -9.1 -17.2 -9.15 -17.05 -9.2 -16.95 -9.25 -16.8 -9.65 -15.9 -9.7 -15.8 -9.9 -15.45 -10.2 -14.75 -10.65 -13.6 -11.3 -12.1 -11.45 -11.55 -11.6 -11.15 -11.75 -10.7 -12.1 -9.35 -12.4 -7.45 Q-12.2 -5.15 -12.4 -6.25 L-13.05 -8.95 -13.1 -9.05 -13.35 -10.15 -13.3 -10.15 -13.1 -10.85 -12.1 -14.05 -12.0 -14.7 -11.7 -17.1 -11.25 -18.2 -11.0 -18.45 -10.8 -18.6 -10.45 -18.8 -10.15 -18.9" fill="#aad5ff" fill-rule="evenodd" stroke="none"/>
  </g>
</svg>
