<?xml version="1.0" encoding="UTF-8" standalone="no"?>
<svg xmlns:xlink="http://www.w3.org/1999/xlink" height="12.4px" width="30.1px" xmlns="http://www.w3.org/2000/svg">
  <g transform="matrix(1.0, 0.0, 0.0, 1.0, 14.6, 11.9)">
    <path d="M4.05 -2.55 L-4.35 -2.55 -4.35 -5.2 4.05 -5.2 4.05 -2.55 M9.65 -5.65 L9.85 -5.7 12.45 -5.7 12.6 -5.65 12.65 -5.65 12.7 -5.45 12.7 -2.8 12.65 -2.65 12.6 -2.6 12.45 -2.55 9.85 -2.55 9.65 -2.6 9.65 -2.65 Q9.55 -2.75 9.6 -2.8 L9.6 -5.45 9.65 -5.65 M7.95 -4.8 Q7.65 -5.1 7.3 -5.05 L6.6 -4.8 6.6 -4.75 Q6.3 -4.5 6.3 -4.1 6.3 -3.75 6.6 -3.45 6.9 -3.15 7.3 -3.15 7.65 -3.15 7.95 -3.45 L8.25 -4.1 7.95 -4.75 7.95 -4.8 M8.75 -5.65 L8.8 -5.65 8.85 -5.45 8.85 -2.8 8.8 -2.65 8.75 -2.6 8.6 -2.55 5.95 -2.55 5.8 -2.6 5.75 -2.65 5.7 -2.8 5.7 -5.45 5.75 -5.65 5.8 -5.65 5.95 -5.7 8.6 -5.7 8.75 -5.65 M11.8 -4.9 L11.15 -5.15 Q10.75 -5.2 10.5 -4.9 L10.45 -4.85 Q10.15 -4.6 10.2 -4.2 10.15 -3.85 10.45 -3.55 L10.5 -3.55 Q10.75 -3.25 11.15 -3.25 11.5 -3.25 11.8 -3.55 L12.1 -4.2 11.8 -4.85 11.8 -4.9" fill="#d4d0c8" fill-rule="evenodd" stroke="none"/>
    <path d="M13.45 -9.8 L13.45 -1.5 -12.6 -1.4 -12.6 -9.8 13.45 -9.8" fill="#666666" fill-rule="evenodd" stroke="none"/>
    <path d="M15.0 -11.4 L15.0 -1.55 15.0 0.0 10.45 0.0 11.55 -0.05 14.85 -0.1 15.0 -1.55 14.85 -0.1 11.55 -0.05 9.3 -0.05 -14.1 0.0 -14.1 -11.4 15.0 -11.4 M13.45 -9.8 L-12.6 -9.8 -12.6 -1.4 13.45 -1.5 13.45 -9.8" fill="#d4d0c8" fill-rule="evenodd" stroke="none"/>
    <path d="M15.0 -11.4 L15.0 -1.55 15.0 0.0 10.45 0.0 9.3 -0.05 -14.1 0.0 -14.1 -11.4" fill="none" stroke="#000000" stroke-linecap="round" stroke-linejoin="round" stroke-width="1.0"/>
    <path d="M11.55 -0.05 L10.45 0.0" fill="none" stroke="#000000" stroke-linecap="round" stroke-linejoin="round" stroke-width="0.5"/>
    <path d="M-14.1 -11.4 L15.0 -11.4 M15.0 -1.55 L14.85 -0.1 11.55 -0.05" fill="none" stroke="#000000" stroke-linecap="round" stroke-linejoin="round" stroke-width="1.0"/>
    <path d="M-8.1 -8.45 L-8.1 -6.6 -6.3 -6.6 -6.3 -4.8 -8.1 -4.8 -8.1 -3.1 -9.9 -3.1 -9.9 -4.8 -11.65 -4.8 -11.65 -6.6 -9.9 -6.6 -9.9 -8.45 -8.1 -8.45" fill="#000000" fill-rule="evenodd" stroke="none"/>
    <path d="M-8.1 -8.45 L-8.1 -6.6 -6.3 -6.6 -6.3 -4.8 -8.1 -4.8 -8.1 -3.1 -9.9 -3.1 -9.9 -4.8 -11.65 -4.8 -11.65 -6.6 -9.9 -6.6 -9.9 -8.45 -8.1 -8.45 Z" fill="none" stroke="#d4d0c8" stroke-linecap="round" stroke-linejoin="round" stroke-width="0.5"/>
    <path d="M6.85 -8.4 L7.15 -8.1 7.8 -8.1 7.5 -8.1 10.9 -7.95 11.5 -7.75 11.15 -7.6 11.4 -7.5 8.7 -7.25 Q6.3 -7.25 6.75 -6.95 6.55 -7.0 6.55 -7.5 6.55 -8.4 6.85 -8.4 M7.3 -5.35 Q7.8 -5.35 8.15 -5.0 L8.5 -4.15 Q8.5 -3.65 8.15 -3.3 7.8 -2.95 7.3 -2.95 6.75 -2.95 6.4 -3.3 6.05 -3.65 6.05 -4.15 6.05 -4.65 6.4 -5.0 6.75 -5.35 7.3 -5.35 M12.05 -8.2 Q12.05 -8.05 11.55 -8.0 11.25 -8.05 11.3 -8.2 11.25 -8.6 11.75 -8.6 L12.0 -8.55 12.05 -8.2 M12.35 -4.25 Q12.35 -3.75 12.0 -3.4 11.65 -3.05 11.15 -3.05 10.65 -3.05 10.3 -3.4 9.9 -3.75 9.95 -4.25 9.9 -4.75 10.3 -5.1 10.65 -5.45 11.15 -5.45 11.65 -5.45 12.0 -5.1 L12.35 -4.25" fill="#ce0000" fill-rule="evenodd" stroke="none"/>
    <path d="M2.85 -4.3 L2.85 -3.6 0.3 -3.6 0.3 -4.3 2.85 -4.3 M-0.95 -4.3 L-0.95 -3.6 -3.5 -3.6 -3.5 -4.3 -0.95 -4.3" fill="#333333" fill-rule="evenodd" stroke="none"/>
    <path d="M4.1 -7.15 L-4.4 -7.15 -4.4 -8.4 4.1 -8.4 4.1 -7.15" fill="#d4d0c8" fill-rule="evenodd" stroke="none"/>
  </g>
</svg>
