<?xml version="1.0" encoding="UTF-8" standalone="no"?>
<svg xmlns:xlink="http://www.w3.org/1999/xlink" height="24.4px" width="27.35px" xmlns="http://www.w3.org/2000/svg">
  <g transform="matrix(1.0, 0.0, 0.0, 1.0, 14.1, 21.25)">
    <path d="M1.75 -18.85 L3.85 -16.85 4.8 -15.6 5.35 -14.35 5.5 -14.15 5.6 -13.95 5.65 -13.55 5.65 -13.5 5.7 -13.45 5.85 -12.95 6.2 -10.05 6.3 -7.95 6.4 -7.25 7.4 -7.7 7.35 -7.7 8.3 -8.0 8.3 -7.95 9.25 -8.0 10.1 -7.85 10.8 -7.6 10.85 -7.6 Q13.15 -6.6 13.2 -4.25 L13.25 -2.6 13.25 -2.55 Q13.25 -1.65 12.6 -0.95 L12.3 -0.6 Q12.4 0.6 11.65 1.6 L10.6 2.45 10.1 2.75 9.25 3.05 9.05 3.05 7.2 2.9 6.8 3.0 5.8 3.15 5.6 3.15 4.9 3.15 4.25 3.15 4.0 3.15 2.8 2.7 2.75 2.65 Q0.75 1.75 1.05 -0.4 L1.1 -0.7 0.6 -0.55 0.35 -0.55 -0.8 -0.55 -1.15 -0.55 -1.25 -0.55 -2.1 -0.6 -4.2 -0.55 -4.6 -0.6 -5.6 -0.95 -6.9 -1.3 -7.1 -1.45 -7.55 -1.8 -8.25 -1.9 -8.65 -2.05 -8.95 -2.35 -9.25 -2.85 -9.25 -3.0 -9.3 -3.1 -10.25 -3.95 -10.3 -4.0 -11.1 -4.9 -11.1 -4.95 -11.6 -5.65 -11.75 -5.85 -11.85 -6.0 -12.15 -6.65 -12.1 -6.55 Q-12.85 -8.35 -13.05 -10.4 L-13.05 -10.5 -13.05 -10.9 -13.05 -11.0 -13.1 -11.2 -14.1 -19.65 -14.0 -20.45 -13.7 -20.85 -13.35 -21.15 -12.95 -21.25 -12.65 -21.25 -12.35 -21.2 -11.05 -20.8 -9.35 -20.55 -9.3 -20.5 -8.85 -20.45 -7.5 -20.2 -7.6 -20.25 -6.7 -20.15 -5.6 -20.15 -4.35 -20.15 -2.4 -19.95 -0.5 -19.6 1.6 -18.95 1.75 -18.85 M8.7 -0.85 L8.95 -0.75 9.1 -0.75 9.6 -0.75 9.85 -0.8 10.1 -0.8 11.15 -0.95 11.15 -1.2 Q12.05 -1.8 12.1 -2.65 L12.05 -4.25 Q12.0 -6.0 10.3 -6.75 L10.1 -6.8 8.95 -7.05 8.3 -7.05 7.6 -6.85 6.45 -6.25 5.7 -5.55 5.35 -6.75 5.15 -7.9 5.05 -10.1 4.7 -12.8 4.55 -13.3 4.45 -13.75 4.35 -13.9 3.75 -15.15 2.95 -16.25 1.0 -18.1 -0.85 -18.65 -2.7 -19.0 -4.5 -19.2 -5.75 -19.2 -6.95 -19.2 -7.85 -19.3 -9.65 -19.6 -11.5 -19.9 -12.8 -20.3 -13.1 -20.3 -13.25 -19.8 -12.25 -11.4 Q-12.15 -11.25 -12.2 -10.95 L-12.2 -10.55 Q-12.0 -8.65 -11.35 -6.95 L-11.2 -6.6 -11.15 -6.55 -10.9 -6.25 -10.5 -5.65 -9.7 -4.7 -8.5 -3.7 -8.45 -3.25 -8.3 -2.95 -7.3 -2.85 -6.6 -2.25 -5.5 -2.0 -4.4 -1.6 -2.25 -1.65 -1.3 -1.6 -0.95 -1.6 0.2 -1.6 1.8 -1.95 2.55 -2.35 2.25 -1.4 1.9 -0.35 Q1.7 1.1 3.05 1.7 L4.1 2.1 4.75 2.1 5.45 2.1 6.55 1.95 6.75 1.85 7.55 0.6 7.5 0.0 7.45 -0.4 7.4 -1.1 7.3 -1.0 7.05 -1.0 6.95 -1.45 7.0 -1.9 7.15 -1.9 7.2 -1.8 7.25 -1.4 7.55 -1.45 7.85 -1.15 7.85 -1.1 7.85 -0.9 7.75 -0.5 7.75 -0.45 7.8 -0.45 Q7.95 -0.85 8.4 -0.85 L8.5 -0.85 8.7 -0.85 M1.3 -4.8 L-0.5 -6.1 -2.55 -7.85 -5.6 -10.75 Q-7.1 -12.6 -7.55 -13.8 L-2.3 -8.05 1.55 -5.35 5.65 -2.9 5.6 -2.8 Q3.5 -3.4 1.3 -4.8 M9.15 -0.25 L8.8 -0.4 8.75 -0.35 7.9 0.5 7.9 0.6 7.85 0.95 7.65 1.95 8.85 2.0 9.95 1.5 10.1 1.45 10.7 0.95 11.15 -0.25 10.1 -0.15 10.0 -0.15 9.45 -0.15 9.15 -0.25" fill="#000000" fill-rule="evenodd" stroke="none"/>
    <path d="M7.5 0.0 L7.55 0.6 6.75 1.85 6.55 1.95 5.45 2.1 4.75 2.1 4.1 2.1 3.05 1.7 Q1.7 1.1 1.9 -0.35 L2.25 -1.4 2.55 -2.35 1.8 -1.95 0.2 -1.6 -0.95 -1.6 -1.3 -1.6 -2.25 -1.65 -4.4 -1.6 -5.5 -2.0 -6.6 -2.25 -7.3 -2.85 -8.3 -2.95 -8.45 -3.25 -8.5 -3.7 -9.7 -4.7 -10.5 -5.65 -10.9 -6.25 -11.15 -6.55 -11.2 -6.6 -11.35 -6.95 Q-12.0 -8.65 -12.2 -10.55 L-12.2 -10.95 Q-12.15 -11.25 -12.25 -11.4 L-13.25 -19.8 -13.1 -20.3 -12.8 -20.3 -11.5 -19.9 -9.65 -19.6 -7.85 -19.3 -6.95 -19.2 -5.75 -19.2 -4.5 -19.2 -2.7 -19.0 -0.85 -18.65 1.0 -18.1 2.95 -16.25 3.75 -15.15 4.35 -13.9 4.45 -13.75 4.55 -13.3 4.7 -12.8 5.05 -10.1 5.15 -7.9 5.35 -6.75 5.7 -5.55 6.45 -6.25 7.6 -6.85 8.3 -7.05 8.95 -7.05 10.1 -6.8 10.3 -6.75 Q12.0 -6.0 12.05 -4.25 L12.1 -2.65 Q12.05 -1.8 11.15 -1.2 L11.15 -0.95 10.1 -0.8 9.85 -0.8 9.6 -0.75 9.1 -0.75 8.95 -0.75 8.7 -0.85 8.95 -1.1 10.1 -1.55 10.2 -1.6 11.3 -2.2 11.35 -2.7 11.4 -4.25 11.3 -4.8 Q11.05 -5.7 10.3 -6.1 L7.8 -6.3 7.0 -6.0 6.35 -5.6 5.9 -5.05 6.15 -4.6 6.4 -4.15 7.15 -3.2 7.3 -1.7 7.2 -1.8 7.15 -1.9 6.35 -2.75 6.8 -2.85 6.45 -3.35 5.65 -4.55 Q4.6 -6.6 4.6 -9.0 L4.3 -12.7 3.95 -13.7 Q3.3 -15.3 2.3 -16.45 1.25 -17.55 -0.05 -18.05 L-0.45 -18.15 -3.65 -18.65 -5.05 -18.7 -6.3 -18.7 -10.4 -19.2 -11.6 -19.4 -12.9 -19.85 -11.7 -11.5 -11.6 -10.95 -11.55 -10.0 -11.2 -8.2 -10.7 -6.9 -10.0 -6.0 -9.2 -5.05 -7.9 -3.9 -7.35 -3.95 -7.3 -3.5 -6.45 -3.0 -6.25 -3.45 -5.2 -3.65 -3.4 -2.95 -2.85 -2.45 -2.8 -2.2 -1.35 -2.35 -1.2 -2.6 -0.15 -3.25 1.15 -3.6 1.6 -3.35 1.9 -3.25 1.95 -3.0 2.05 -2.85 Q2.05 -2.8 2.15 -2.8 L3.0 -2.9 3.2 -3.2 3.6 -3.35 3.95 -3.3 4.1 -3.05 4.15 -2.9 4.15 -2.7 5.2 -2.45 6.8 -1.85 6.1 -1.55 4.45 -2.1 3.15 -1.9 Q2.75 -1.15 2.65 -0.35 2.6 0.25 2.85 0.95 L3.55 1.2 4.35 1.5 6.1 1.4 6.3 1.25 7.0 0.75 7.15 0.6 7.5 0.0 M7.8 -0.45 L7.75 -0.45 7.75 -0.5 7.8 -0.45 M7.85 -0.9 L7.85 -1.1 7.95 -0.9 7.85 -0.9 M4.6 -5.55 L4.6 -6.0 4.65 -5.65 4.65 -5.55 4.6 -5.55 M1.4 -6.85 L1.4 -6.75 1.0 -7.2 0.9 -7.35 1.4 -6.85 M3.15 -5.65 L3.75 -5.6 4.1 -5.2 4.05 -5.1 Q3.1 -5.2 3.15 -5.65 M5.1 -4.2 L5.45 -3.8 5.5 -3.55 5.3 -3.5 Q4.3 -4.05 4.8 -4.35 L5.1 -4.2 M7.3 -1.0 L7.4 -1.1 7.45 -0.4 7.3 -1.0 M9.15 -0.25 L9.0 -0.25 8.75 -0.35 8.8 -0.4 9.15 -0.25 M7.85 0.95 Q8.2 1.2 8.6 0.95 L9.75 0.15 10.0 -0.1 10.0 -0.15 10.1 -0.15 11.15 -0.25 10.7 0.95 10.1 1.45 9.95 1.5 8.85 2.0 7.65 1.95 7.85 0.95 M-2.05 -8.9 L-2.15 -9.05 Q-1.65 -9.05 -1.8 -8.75 L-2.05 -8.9 M-2.05 -4.8 L-1.65 -4.75 Q-0.75 -4.7 -1.45 -4.5 L-1.5 -4.4 Q-2.1 -4.3 -2.05 -4.8 M-4.05 -5.2 L-4.35 -5.15 Q-5.3 -5.15 -6.15 -5.8 L-6.85 -6.05 -7.05 -6.45 -6.95 -6.6 -6.1 -6.6 Q-4.55 -6.25 -4.05 -5.2 M-5.6 -8.1 L-5.5 -7.95 -5.6 -7.75 -5.8 -7.7 -6.0 -7.75 -6.1 -7.95 -6.0 -8.1 -5.8 -8.2 -5.6 -8.1 M-8.8 -7.1 L-8.95 -7.25 -8.95 -7.3 -8.9 -7.5 Q-8.4 -7.3 -8.8 -7.1 M-8.15 -6.0 Q-8.05 -6.8 -7.35 -6.2 L-5.7 -5.25 -4.25 -4.95 -6.05 -4.9 Q-7.05 -4.85 -7.8 -5.6 L-8.15 -6.0 M-1.35 -3.2 L-1.85 -3.05 -3.4 -3.15 -3.6 -3.4 -3.8 -3.9 -3.55 -3.9 -3.4 -4.1 0.3 -3.95 -0.6 -3.5 -1.35 -3.2 M-8.75 -5.7 L-8.65 -5.7 -7.2 -4.8 -6.95 -4.75 -5.05 -4.25 -5.55 -3.95 -6.25 -3.85 -7.3 -4.25 -7.9 -4.8 -8.75 -5.7" fill="#458305" fill-rule="evenodd" stroke="none"/>
    <path d="M0.15 -14.7 L0.35 -14.3 Q0.2 -13.65 -0.25 -14.4 -0.5 -14.75 0.0 -14.9 L0.15 -14.7 M0.85 -15.65 L0.85 -15.2 0.45 -15.2 0.45 -15.65 0.85 -15.65 M-4.35 -17.5 L-3.75 -17.2 -2.95 -16.3 -3.05 -16.15 -3.1 -16.15 -2.95 -15.55 -3.05 -15.3 -3.3 -15.45 -3.75 -15.7 -4.1 -16.25 -4.45 -16.3 Q-5.45 -16.8 -5.35 -17.55 L-5.2 -17.65 -4.8 -17.3 -4.35 -17.5 M-2.85 -17.3 L-2.65 -17.35 Q-1.7 -17.05 -2.15 -16.4 L-2.5 -16.55 Q-3.05 -16.95 -2.85 -17.3 M-6.85 -17.7 L-6.4 -17.4 Q-5.7 -17.1 -5.2 -16.45 L-6.25 -16.55 Q-7.3 -17.2 -6.85 -17.7 M-4.3 -14.3 Q-4.9 -14.3 -4.35 -14.6 -3.8 -14.1 -4.3 -14.3 M-3.95 -16.45 L-3.9 -16.5 Q-4.45 -17.05 -3.95 -16.45 M-1.95 -14.8 Q-1.25 -14.4 -1.8 -14.05 -2.8 -14.35 -1.95 -14.8 M-1.95 -15.55 L-1.8 -15.55 -1.05 -15.0 -1.3 -14.75 Q-2.05 -14.75 -1.95 -15.55 M-0.35 -16.05 L-0.65 -16.2 Q-1.1 -16.8 -0.45 -16.9 L-0.2 -16.7 Q0.3 -16.15 -0.35 -16.05 M-1.15 -16.65 Q-0.4 -16.05 -1.1 -15.9 L-1.4 -15.9 -1.6 -16.1 -1.85 -16.55 Q-1.65 -17.1 -1.15 -16.65 M-9.85 -16.75 Q-9.75 -17.05 -9.7 -16.8 -9.5 -15.95 -9.85 -16.75 M-5.15 -15.8 L-5.15 -15.4 Q-5.9 -15.55 -5.3 -15.95 L-5.15 -15.8 M-7.5 -17.65 L-7.05 -17.15 Q-6.9 -16.9 -7.05 -16.75 L-7.1 -16.8 Q-8.1 -17.15 -7.5 -17.65 M-10.45 -13.8 L-10.6 -13.9 Q-10.9 -14.25 -10.5 -14.05 -9.9 -13.9 -10.45 -13.8 M-10.4 -14.55 Q-11.15 -14.75 -10.55 -15.45 L-10.45 -15.65 -10.25 -15.65 -10.1 -14.6 -10.4 -14.55" fill="#78e00e" fill-rule="evenodd" stroke="none"/>
    <path d="M4.35 1.5 L3.55 1.2 2.85 0.95 3.2 -0.4 4.3 -0.55 Q5.2 -0.35 5.25 0.7 L5.25 1.0 5.1 1.2 4.8 1.4 4.35 1.5 M6.35 -5.6 L7.0 -6.0 7.8 -6.3 9.15 -5.35 9.4 -5.0 Q9.35 -4.0 8.5 -3.75 L7.75 -3.7 6.45 -4.9 6.55 -5.2 6.5 -5.4 6.35 -5.6 M0.15 -14.7 L0.0 -14.9 Q-0.5 -14.75 -0.25 -14.4 0.2 -13.65 0.35 -14.3 L0.15 -14.7 M1.3 -4.8 L0.3 -4.75 0.25 -4.9 Q-0.2 -5.4 -0.8 -5.2 L-1.1 -5.25 -1.2 -5.35 -1.2 -5.3 -1.25 -5.3 -1.4 -5.45 -1.7 -5.6 -2.15 -5.65 -3.15 -5.75 -3.6 -6.2 -4.05 -6.45 -4.8 -6.75 -5.95 -6.95 -7.3 -7.1 -7.25 -7.1 Q-7.1 -7.15 -7.05 -7.25 L-6.95 -7.45 -7.05 -7.8 -7.2 -7.9 -7.5 -7.95 -7.75 -7.8 -7.9 -7.5 -8.55 -8.0 -9.35 -8.05 -9.45 -8.0 -10.8 -9.85 -12.05 -19.1 -10.05 -17.75 -11.0 -19.2 -10.5 -19.05 -9.9 -18.9 -9.15 -18.8 -8.35 -18.7 -7.3 -18.55 -6.2 -18.45 -5.55 -18.35 -4.9 -18.3 -3.55 -18.2 -0.5 -18.1 0.4 -17.35 1.1 -16.55 1.8 -15.7 2.4 -14.8 2.95 -13.75 3.5 -12.05 4.0 -10.2 4.2 -9.15 4.4 -7.95 4.6 -6.8 4.65 -5.65 4.6 -6.0 4.6 -5.55 4.4 -5.6 2.85 -6.3 Q2.2 -6.15 2.35 -5.5 L3.05 -5.25 Q4.05 -5.2 4.65 -4.35 L3.45 -5.0 2.15 -5.55 1.0 -6.3 Q-1.5 -7.9 -3.55 -9.95 -6.55 -12.75 -8.9 -16.05 L-8.55 -15.4 -8.0 -14.2 -7.3 -13.0 -6.95 -12.45 Q-6.0 -10.85 -4.75 -9.6 -2.8 -7.6 -0.5 -6.1 L1.3 -4.8 M0.85 -15.65 L0.45 -15.65 0.45 -15.2 0.85 -15.2 0.85 -15.65 M0.05 -7.45 L1.8 -6.3 Q1.9 -7.1 1.1 -7.7 1.2 -8.65 0.15 -8.65 L-0.05 -8.6 0.7 -7.75 0.05 -7.45 M-2.85 -17.3 Q-3.05 -16.95 -2.5 -16.55 L-2.15 -16.4 Q-1.7 -17.05 -2.65 -17.35 L-2.85 -17.3 M-4.35 -17.5 L-4.8 -17.3 -5.2 -17.65 -5.35 -17.55 Q-5.45 -16.8 -4.45 -16.3 L-4.1 -16.25 -3.75 -15.7 -3.3 -15.45 -3.05 -15.3 -2.95 -15.55 -3.1 -16.15 -3.05 -16.15 -2.95 -16.3 -3.75 -17.2 -4.35 -17.5 M-6.85 -17.7 Q-7.3 -17.2 -6.25 -16.55 L-5.2 -16.45 -5.15 -16.6 -6.85 -17.7 M-7.5 -17.65 Q-8.1 -17.15 -7.1 -16.8 L-7.05 -16.75 Q-6.9 -16.9 -7.05 -17.15 L-7.5 -17.65 M-5.15 -15.8 L-5.3 -15.95 Q-5.9 -15.55 -5.15 -15.4 L-5.15 -15.8 M-9.85 -16.75 Q-9.5 -15.95 -9.7 -16.8 -9.75 -17.05 -9.85 -16.75 M-1.15 -16.65 Q-1.65 -17.1 -1.85 -16.55 L-1.6 -16.1 -1.4 -15.9 -1.1 -15.9 Q-0.4 -16.05 -1.15 -16.65 M-0.35 -16.05 Q0.3 -16.15 -0.2 -16.7 L-0.45 -16.9 Q-1.1 -16.8 -0.65 -16.2 L-0.35 -16.05 M-1.95 -15.55 Q-2.05 -14.75 -1.3 -14.75 L-1.05 -15.0 -1.8 -15.55 -1.95 -15.55 M-1.95 -14.8 Q-2.8 -14.35 -1.8 -14.05 -1.25 -14.4 -1.95 -14.8 M-3.95 -16.45 Q-4.45 -17.05 -3.9 -16.5 L-3.95 -16.45 M-4.3 -14.3 Q-3.8 -14.1 -4.35 -14.6 -4.9 -14.3 -4.3 -14.3 M-4.8 -11.7 L-4.7 -11.35 -4.55 -11.25 Q-3.95 -11.45 -4.8 -11.7 M-2.5 -11.5 Q-3.15 -11.05 -2.4 -10.7 L-1.8 -10.4 -1.65 -10.35 Q-1.1 -10.6 -1.65 -11.05 L-2.5 -11.5 M-10.4 -14.55 L-10.1 -14.6 -10.25 -15.65 -10.45 -15.65 -10.55 -15.45 Q-11.15 -14.75 -10.4 -14.55 M-10.45 -13.8 Q-9.9 -13.9 -10.5 -14.05 -10.9 -14.25 -10.6 -13.9 L-10.45 -13.8 M-10.45 -7.05 L-10.65 -8.5 -9.35 -7.05 -8.35 -6.1 -10.45 -7.05 M-1.9 -9.55 L-3.0 -9.6 -1.25 -8.2 -1.05 -8.35 Q-1.4 -9.05 -1.9 -9.55 M-1.4 -5.85 Q-0.85 -6.25 -1.55 -6.5 -2.05 -6.35 -1.7 -6.0 L-1.4 -5.85 M-5.6 -8.1 L-5.8 -8.2 -6.0 -8.1 -6.1 -7.95 -6.0 -7.75 -5.8 -7.7 -5.6 -7.75 -5.5 -7.95 -5.6 -8.1 M-9.8 -9.0 Q-9.5 -8.3 -8.8 -8.5 -8.3 -8.75 -8.75 -9.15 -9.4 -9.6 -9.8 -9.0" fill="#63bb09" fill-rule="evenodd" stroke="none"/>
    <path d="M7.5 0.0 L7.15 0.6 7.0 0.75 6.3 1.25 6.1 1.4 4.35 1.5 4.8 1.4 5.1 1.2 5.25 1.0 5.25 0.7 Q5.2 -0.35 4.3 -0.55 L3.2 -0.4 2.85 0.95 Q2.6 0.25 2.65 -0.35 2.75 -1.15 3.15 -1.9 L4.45 -2.1 6.1 -1.55 6.8 -1.85 5.2 -2.45 4.15 -2.7 4.15 -2.9 4.1 -3.05 3.95 -3.3 3.6 -3.35 3.2 -3.2 3.0 -2.9 2.15 -2.8 Q2.05 -2.8 2.05 -2.85 L1.95 -3.0 1.9 -3.25 1.6 -3.35 1.15 -3.6 -0.15 -3.25 -1.2 -2.6 -1.35 -2.35 -2.8 -2.2 -2.85 -2.45 -3.4 -2.95 -5.2 -3.65 -6.25 -3.45 -6.45 -3.0 -7.3 -3.5 -7.35 -3.95 -7.9 -3.9 -9.2 -5.05 -10.0 -6.0 -10.7 -6.9 -11.2 -8.2 -11.55 -10.0 -11.6 -10.95 -11.7 -11.5 -12.9 -19.85 -11.6 -19.4 -10.4 -19.2 -6.3 -18.7 -5.05 -18.7 -3.65 -18.65 -0.45 -18.15 -0.05 -18.05 Q1.25 -17.55 2.3 -16.45 3.3 -15.3 3.95 -13.7 L4.3 -12.7 4.6 -9.0 Q4.6 -6.6 5.65 -4.55 L6.45 -3.35 6.8 -2.85 6.35 -2.75 7.15 -1.9 7.0 -1.9 6.95 -1.45 7.05 -1.0 7.3 -1.0 7.45 -0.4 7.5 0.0 M7.2 -1.8 L7.3 -1.7 7.15 -3.2 6.4 -4.15 6.15 -4.6 5.9 -5.05 6.35 -5.6 6.5 -5.4 6.55 -5.2 6.45 -4.9 7.75 -3.7 8.5 -3.75 Q9.35 -4.0 9.4 -5.0 L9.15 -5.35 7.8 -6.3 10.3 -6.1 Q11.05 -5.7 11.3 -4.8 L11.4 -4.25 11.35 -2.7 11.3 -2.2 10.2 -1.6 10.1 -1.55 8.95 -1.1 8.7 -0.85 8.5 -0.85 8.4 -0.85 Q7.95 -0.85 7.8 -0.45 L7.75 -0.5 7.85 -0.9 7.95 -0.9 7.85 -1.1 7.85 -1.15 7.55 -1.45 7.25 -1.4 7.2 -1.8 M4.65 -5.65 L4.6 -6.8 4.4 -7.95 4.2 -9.15 4.0 -10.2 3.5 -12.05 2.95 -13.75 2.4 -14.8 1.8 -15.7 1.1 -16.55 0.4 -17.35 -0.5 -18.1 -3.55 -18.2 -4.9 -18.3 -5.55 -18.35 -6.2 -18.45 -7.3 -18.55 -8.35 -18.7 -9.15 -18.8 -9.9 -18.9 -10.5 -19.05 -11.0 -19.2 -10.05 -17.75 -12.05 -19.1 -10.8 -9.85 -9.45 -8.0 -9.35 -8.05 -8.55 -8.0 -7.9 -7.5 -7.75 -7.8 -7.5 -7.95 -7.2 -7.9 -7.05 -7.8 -6.95 -7.45 -7.05 -7.25 Q-7.1 -7.15 -7.25 -7.1 L-7.3 -7.1 -5.95 -6.95 -4.8 -6.75 -4.05 -6.45 -3.6 -6.2 -3.15 -5.75 -2.15 -5.65 -1.7 -5.6 -1.4 -5.45 -1.25 -5.3 -1.2 -5.3 -1.2 -5.35 -1.1 -5.25 -0.8 -5.2 Q-0.2 -5.4 0.25 -4.9 L0.3 -4.75 1.3 -4.8 Q3.5 -3.4 5.6 -2.8 L5.65 -2.9 1.55 -5.35 -2.3 -8.05 -7.55 -13.8 Q-7.1 -12.6 -5.6 -10.75 L-2.55 -7.85 -0.5 -6.1 Q-2.8 -7.6 -4.75 -9.6 -6.0 -10.85 -6.95 -12.45 L-7.3 -13.0 -8.0 -14.2 -8.55 -15.4 -8.9 -16.05 Q-6.55 -12.75 -3.55 -9.95 -1.5 -7.9 1.0 -6.3 L2.15 -5.55 3.45 -5.0 4.65 -4.35 Q4.05 -5.2 3.05 -5.25 L2.35 -5.5 Q2.2 -6.15 2.85 -6.3 L4.4 -5.6 4.6 -5.55 4.65 -5.55 4.65 -5.65 M1.4 -6.85 L0.9 -7.35 1.0 -7.2 1.4 -6.75 1.4 -6.85 M0.05 -7.45 L0.7 -7.75 -0.05 -8.6 0.15 -8.65 Q1.2 -8.65 1.1 -7.7 1.9 -7.1 1.8 -6.3 L0.05 -7.45 M3.15 -5.65 Q3.1 -5.2 4.05 -5.1 L4.1 -5.2 3.75 -5.6 3.15 -5.65 M5.1 -4.2 L4.8 -4.35 Q4.3 -4.05 5.3 -3.5 L5.5 -3.55 5.45 -3.8 5.1 -4.2 M8.75 -0.35 L9.0 -0.25 9.15 -0.25 9.45 -0.15 10.0 -0.15 10.0 -0.1 9.75 0.15 8.6 0.95 Q8.2 1.2 7.85 0.95 L7.9 0.6 7.9 0.5 8.75 -0.35 M-2.5 -11.5 L-1.65 -11.05 Q-1.1 -10.6 -1.65 -10.35 L-1.8 -10.4 -2.4 -10.7 Q-3.15 -11.05 -2.5 -11.5 M-4.8 -11.7 Q-3.95 -11.45 -4.55 -11.25 L-4.7 -11.35 -4.8 -11.7 M-10.45 -7.05 L-8.35 -6.1 -9.35 -7.05 -10.65 -8.5 -10.45 -7.05 M-2.05 -8.9 L-1.8 -8.75 Q-1.65 -9.05 -2.15 -9.05 L-2.05 -8.9 M-1.9 -9.55 Q-1.4 -9.05 -1.05 -8.35 L-1.25 -8.2 -3.0 -9.6 -1.9 -9.55 M-4.05 -5.2 Q-4.55 -6.25 -6.1 -6.6 L-6.95 -6.6 -7.05 -6.45 -6.85 -6.05 -6.15 -5.8 Q-5.3 -5.15 -4.35 -5.15 L-4.05 -5.2 M-2.05 -4.8 Q-2.1 -4.3 -1.5 -4.4 L-1.45 -4.5 Q-0.75 -4.7 -1.65 -4.75 L-2.05 -4.8 M-1.4 -5.85 L-1.7 -6.0 Q-2.05 -6.35 -1.55 -6.5 -0.85 -6.25 -1.4 -5.85 M-9.8 -9.0 Q-9.4 -9.6 -8.75 -9.15 -8.3 -8.75 -8.8 -8.5 -9.5 -8.3 -9.8 -9.0 M-8.8 -7.1 Q-8.4 -7.3 -8.9 -7.5 L-8.95 -7.3 -8.95 -7.25 -8.8 -7.1 M-8.15 -6.0 L-7.8 -5.6 Q-7.05 -4.85 -6.05 -4.9 L-4.25 -4.95 -5.7 -5.25 -7.35 -6.2 Q-8.05 -6.8 -8.15 -6.0 M-8.75 -5.7 L-7.9 -4.8 -7.3 -4.25 -6.25 -3.85 -5.55 -3.95 -5.05 -4.25 -6.95 -4.75 -7.2 -4.8 -8.65 -5.7 -8.75 -5.7 M-1.35 -3.2 L-0.6 -3.5 0.3 -3.95 -3.4 -4.1 -3.55 -3.9 -3.8 -3.9 -3.6 -3.4 -3.4 -3.15 -1.85 -3.05 -1.35 -3.2" fill="#4a9d06" fill-rule="evenodd" stroke="none"/>
    <path d="M-5.2 -16.45 Q-5.7 -17.1 -6.4 -17.4 L-6.85 -17.7 -5.15 -16.6 -5.2 -16.45" fill="#77e20c" fill-rule="evenodd" stroke="none"/>
  </g>
</svg>
