<?xml version="1.0" encoding="UTF-8" standalone="no"?>
<svg xmlns:xlink="http://www.w3.org/1999/xlink" height="35.3px" width="34.65px" xmlns="http://www.w3.org/2000/svg">
  <g transform="matrix(1.0, 0.0, 0.0, 1.0, 17.5, 34.1)">
    <path d="M7.2 -25.0 L7.25 -24.55 6.15 -15.65 12.65 -17.4 14.5 -18.1 15.05 -18.15 15.55 -17.9 15.85 -17.4 Q17.05 -11.4 17.15 -7.35 L16.9 -6.65 9.9 0.9 9.6 1.15 9.2 1.2 -11.5 1.2 -11.9 1.15 -12.2 0.9 -14.95 -2.05 -15.15 -2.35 -17.4 -8.1 Q-17.6 -8.5 -17.4 -8.9 L-16.85 -9.4 Q-16.5 -9.6 -16.1 -9.4 L-11.35 -7.4 -14.9 -10.65 -15.05 -10.85 -16.0 -12.3 -16.25 -12.55 -16.5 -13.15 -16.85 -13.75 -17.1 -14.4 -17.05 -14.7 -16.5 -19.75 -16.5 -20.3 -16.35 -20.75 -16.3 -21.25 -16.1 -21.75 -15.65 -22.1 -15.1 -22.1 -9.0 -20.65 -10.95 -26.6 -10.95 -27.2 -10.6 -27.7 -2.9 -33.85 -2.3 -34.1 -1.65 -33.85 1.15 -31.6 1.25 -31.5 7.0 -25.35 7.2 -25.0" fill="#000000" fill-rule="evenodd" stroke="none"/>
    <path d="M14.85 -14.05 L14.45 -15.0 13.45 -13.95 13.3 -13.75 11.8 -11.6 10.1 -7.55 11.15 -7.3 13.25 -7.3 14.9 -7.6 15.45 -9.7 14.85 -14.05 M12.0 -13.35 L12.85 -15.35 12.9 -16.4 14.85 -17.2 Q16.05 -11.3 16.15 -7.35 L9.2 0.2 7.2 0.2 14.05 -6.1 11.8 -5.95 10.1 -6.25 6.2 0.2 6.15 0.2 12.0 -13.35 M6.15 -12.45 L7.05 -8.85 8.75 -9.4 7.7 -7.3 5.25 -12.65 7.45 -6.7 5.7 -2.85 6.7 -7.05 Q3.15 -8.1 4.05 -12.15 L0.9 -2.5 0.55 -3.4 4.4 -16.1 4.65 -21.45 1.5 -19.2 -0.4 -18.0 -0.95 -7.2 -4.15 -16.3 3.75 -22.1 -4.6 -16.55 -6.35 -17.4 -7.2 -17.9 -9.0 -15.05 -2.65 -2.7 -0.65 -0.3 -0.35 -3.35 -0.3 -3.9 -0.25 0.2 -0.55 0.2 -2.3 -2.15 -1.0 0.2 -1.5 0.2 -2.25 -1.2 -10.35 -13.45 -8.2 -18.1 -9.3 -16.55 -9.2 -16.7 -8.1 -18.9 -9.25 -19.15 -9.4 -19.2 -14.65 -20.35 -15.3 -21.15 -7.45 -19.3 -6.75 -20.4 -6.35 -19.0 -5.8 -20.1 -3.95 -19.15 -3.75 -18.75 5.35 -23.5 3.25 -26.8 1.1 -28.7 0.5 -30.8 6.25 -24.7 4.95 -14.3 6.15 -12.45 M-12.85 -18.5 L-13.05 -18.95 -12.8 -18.45 -10.7 -14.7 -9.5 -16.15 -10.85 -14.3 -8.85 -10.05 -10.9 -12.9 -13.05 -13.75 -12.35 -14.25 -12.7 -16.45 -12.5 -17.8 -12.85 -18.5 M-9.9 -3.85 L-6.9 -1.55 -5.0 -0.05 -8.1 -1.45 -9.05 -1.2 -8.7 -0.8 -9.35 -1.1 -8.4 -0.5 -7.2 0.2 -11.5 0.2 -14.2 -2.75 -13.1 -2.8 Q-12.35 -1.75 -11.5 -1.65 L-11.45 -2.55 -9.9 -3.85 M-4.0 -0.45 L-1.65 0.2 -2.25 0.2 -4.0 -0.45" fill="#454545" fill-rule="evenodd" stroke="none"/>
    <path d="M12.85 -15.35 L12.0 -13.35 8.75 -9.4 7.05 -8.85 6.15 -12.45 12.85 -15.35" fill="url(#gradient0)" fill-rule="evenodd" stroke="none"/>
    <path d="M13.45 -13.95 L14.45 -15.0 14.85 -14.05 14.25 -14.45 13.45 -13.95 M15.45 -9.7 L14.9 -7.6 13.25 -7.3 15.45 -9.7 M11.15 -7.3 L10.1 -7.55 11.8 -11.6 13.3 -13.75 11.15 -7.3 M6.2 0.2 L10.1 -6.25 7.1 0.2 6.2 0.2 M11.8 -5.95 L14.05 -6.1 7.2 0.2 7.15 0.2 11.8 -5.95 M4.4 -16.1 L0.55 -3.4 0.3 -4.3 4.4 -16.1 M3.25 -26.8 L5.35 -23.5 -3.75 -18.75 -1.55 -28.35 -0.5 -29.95 0.75 -28.95 -1.0 -27.85 -1.7 -19.9 -0.1 -23.95 3.25 -26.8 M-14.65 -20.35 L-9.4 -19.2 -13.25 -18.95 -14.65 -20.35 M-9.25 -19.15 L-8.1 -18.9 -9.2 -16.7 -9.25 -19.15 M-9.3 -16.55 L-8.2 -18.1 -10.35 -13.45 -2.25 -1.2 -8.85 -10.05 -10.85 -14.3 -9.5 -16.15 -10.7 -14.7 -12.8 -18.45 -9.3 -16.55 M-0.35 -3.35 L-0.65 -0.3 -2.65 -2.7 -9.0 -15.05 -7.2 -17.9 -4.9 -12.2 -7.45 -15.45 -0.45 -3.15 -1.3 -5.85 -0.3 -3.95 -0.35 -3.35 M-0.95 -7.2 L-0.4 -18.0 1.5 -19.2 -0.2 -5.7 -0.95 -7.2 M-13.0 -18.55 L-12.85 -18.5 -12.5 -17.8 -13.0 -18.55 M-7.2 0.2 L-8.4 -0.5 -8.7 -0.8 -9.05 -1.2 -8.1 -1.45 -5.85 0.2 -7.2 0.2" fill="#bababa" fill-rule="evenodd" stroke="none"/>
    <path d="M14.85 -14.05 L15.45 -9.7 13.25 -7.3 11.15 -7.3 13.3 -13.75 13.45 -13.95 14.25 -14.45 14.85 -14.05 M10.1 -6.25 L11.8 -5.95 7.15 0.2 7.1 0.2 10.1 -6.25 M1.5 -19.2 L4.65 -21.45 4.4 -16.1 0.3 -4.3 -0.2 -5.7 1.5 -19.2 M1.1 -28.7 L3.25 -26.8 -0.1 -23.95 -1.7 -19.9 -1.0 -27.85 0.75 -28.95 1.1 -28.7 M-3.75 -18.75 L-3.95 -19.15 -1.55 -28.35 -3.75 -18.75 M-9.4 -19.2 L-9.25 -19.15 -9.2 -16.7 -9.3 -16.55 -12.8 -18.45 -13.05 -18.95 -12.85 -18.5 -13.0 -18.55 -13.65 -18.95 -13.25 -18.95 -9.4 -19.2 M-1.3 -5.85 L-0.45 -3.15 -7.45 -15.45 -4.9 -12.2 -1.3 -5.85 M-8.4 -0.5 L-9.35 -1.1 -8.7 -0.8 -8.4 -0.5" fill="#6a6a6a" fill-rule="evenodd" stroke="none"/>
    <path d="M12.9 -16.4 L12.85 -15.35 6.15 -12.45 4.95 -14.3 12.9 -16.4 M0.5 -30.8 L1.1 -28.7 0.75 -28.95 -0.5 -29.95 -1.55 -28.35 -3.95 -19.15 -5.8 -20.1 -3.15 -29.95 -8.45 -26.35 -6.75 -20.4 -7.45 -19.3 -10.0 -26.95 -2.3 -33.1 0.5 -30.8 M-15.3 -21.15 L-14.65 -20.35 -13.25 -18.95 -13.65 -18.95 -13.0 -18.55 -12.5 -17.8 -12.7 -16.45 -15.4 -20.2 -15.3 -21.15 M-15.5 -19.65 L-15.4 -14.25 -16.05 -14.4 -15.5 -19.65 M-13.55 -13.85 L-12.35 -14.25 -13.05 -13.75 -13.55 -13.85 M-10.95 -6.15 L-9.9 -4.45 -9.95 -4.5 -9.9 -4.4 -9.9 -3.85 -11.45 -2.55 -11.3 -5.75 -15.65 -7.35 -13.1 -2.8 -14.2 -2.75 -16.5 -8.5 -10.95 -6.15" fill="#ffffff" fill-rule="evenodd" stroke="none"/>
    <path d="M12.0 -13.35 L6.15 0.2 -0.25 0.2 -0.3 -3.9 -0.3 -3.95 -1.3 -5.85 -4.9 -12.2 -7.2 -17.9 -6.35 -17.4 -4.6 -16.55 3.75 -22.1 -4.15 -16.3 -0.95 -7.2 -0.2 -5.7 0.3 -4.3 0.55 -3.4 0.9 -2.5 4.45 -0.3 5.7 -2.85 7.45 -6.7 5.25 -12.65 7.7 -7.3 8.75 -9.4 12.0 -13.35 M-1.0 0.2 L-2.3 -2.15 -0.55 0.2 -1.0 0.2 M-6.9 -1.55 L-4.0 -0.45 -2.25 0.2 -5.85 0.2 -8.1 -1.45 -5.0 -0.05 -6.9 -1.55" fill="#000000" fill-rule="evenodd" stroke="none"/>
    <path d="M0.9 -2.5 L4.05 -12.15 Q3.15 -8.1 6.7 -7.05 L5.7 -2.85 4.45 -0.3 0.9 -2.5" fill="url(#gradient1)" fill-rule="evenodd" stroke="none"/>
    <path d="M-5.8 -20.1 L-6.35 -19.0 -6.75 -20.4 -8.45 -26.35 -3.15 -29.95 -5.8 -20.1" fill="url(#gradient2)" fill-rule="evenodd" stroke="none"/>
    <path d="M-15.5 -19.65 L-15.5 -20.3 -15.4 -20.2 -12.7 -16.45 -12.35 -14.25 -13.55 -13.85 -15.4 -14.25 -15.5 -19.65 M-15.5 -13.4 L-15.4 -13.25 -15.5 -13.2 -15.5 -13.4" fill="url(#gradient3)" fill-rule="evenodd" stroke="none"/>
    <path d="M-2.25 -1.2 L-1.5 0.2 -1.65 0.2 -4.0 -0.45 -6.9 -1.55 -9.9 -3.85 -9.9 -4.4 -9.4 -3.85 -9.9 -4.45 -10.95 -6.15 -8.85 -6.45 -14.2 -11.35 -15.4 -13.25 -15.5 -13.4 -16.05 -14.35 -16.1 -14.4 -16.05 -14.4 -15.4 -14.25 -13.55 -13.85 -13.05 -13.75 -10.9 -12.9 -8.85 -10.05 -2.25 -1.2" fill="url(#gradient4)" fill-rule="evenodd" stroke="none"/>
    <path d="M-9.9 -4.45 L-9.4 -3.85 -9.9 -4.4 -9.95 -4.5 -9.9 -4.45" fill="#00618a" fill-rule="evenodd" stroke="none"/>
    <path d="M-11.45 -2.55 L-11.5 -1.65 Q-12.35 -1.75 -13.1 -2.8 L-15.65 -7.35 -11.3 -5.75 -11.45 -2.55" fill="url(#gradient5)" fill-rule="evenodd" stroke="none"/>
    <path d="M-0.3 -3.9 L-0.35 -3.35 -0.3 -3.95 -0.3 -3.9" fill="#333399" fill-opacity="0.22352941" fill-rule="evenodd" stroke="none"/>
  </g>
  <defs>
    <linearGradient gradientTransform="matrix(0.0026, 0.0021, 0.0027, -0.0033, 8.45, -13.1)" gradientUnits="userSpaceOnUse" id="gradient0" spreadMethod="pad" x1="-819.2" x2="819.2">
      <stop offset="0.0" stop-color="#ffffff"/>
      <stop offset="1.0" stop-color="#6a6a6a"/>
    </linearGradient>
    <linearGradient gradientTransform="matrix(0.0036, 0.0014, 0.0031, -0.0078, 4.6, -6.55)" gradientUnits="userSpaceOnUse" id="gradient1" spreadMethod="pad" x1="-819.2" x2="819.2">
      <stop offset="0.0" stop-color="#ffffff"/>
      <stop offset="1.0" stop-color="#6a6a6a"/>
    </linearGradient>
    <linearGradient gradientTransform="matrix(0.0031, 0.001, 0.0021, -0.0063, -6.65, -24.0)" gradientUnits="userSpaceOnUse" id="gradient2" spreadMethod="pad" x1="-819.2" x2="819.2">
      <stop offset="0.0" stop-color="#ffffff"/>
      <stop offset="1.0" stop-color="#6a6a6a"/>
    </linearGradient>
    <linearGradient gradientTransform="matrix(0.0026, 0.0023, 0.0034, -0.0039, -14.5, -17.75)" gradientUnits="userSpaceOnUse" id="gradient3" spreadMethod="pad" x1="-819.2" x2="819.2">
      <stop offset="0.0" stop-color="#ffffff"/>
      <stop offset="1.0" stop-color="#6a6a6a"/>
    </linearGradient>
    <linearGradient gradientTransform="matrix(0.008, 0.004, 0.004, -0.008, -8.8, -7.0)" gradientUnits="userSpaceOnUse" id="gradient4" spreadMethod="pad" x1="-819.2" x2="819.2">
      <stop offset="0.0" stop-color="#ffffff"/>
      <stop offset="1.0" stop-color="#6a6a6a"/>
    </linearGradient>
    <linearGradient gradientTransform="matrix(0.0018, 0.0017, 0.0021, -0.0022, -12.35, -3.25)" gradientUnits="userSpaceOnUse" id="gradient5" spreadMethod="pad" x1="-819.2" x2="819.2">
      <stop offset="0.0" stop-color="#ffffff"/>
      <stop offset="1.0" stop-color="#6a6a6a"/>
    </linearGradient>
  </defs>
</svg>
