<?xml version="1.0" encoding="UTF-8" standalone="no"?>
<svg xmlns:xlink="http://www.w3.org/1999/xlink" height="39.15px" width="23.15px" xmlns="http://www.w3.org/2000/svg">
  <g transform="matrix(1.0, 0.0, 0.0, 1.0, 11.55, 35.05)">
    <path d="M-11.5 -0.7 L-11.55 -17.3 -11.45 -17.85 -10.9 -20.3 -10.9 -20.4 -10.9 -22.05 -10.9 -22.4 -10.85 -22.85 -10.75 -23.2 -10.5 -23.65 -10.55 -23.6 -10.35 -23.8 -10.3 -23.85 -10.35 -23.85 Q-9.6 -24.75 -7.25 -25.4 L-7.05 -25.5 Q-1.95 -33.3 7.5 -35.0 L8.05 -34.95 8.5 -34.55 8.65 -34.0 8.4 -25.15 8.4 -25.05 Q10.0 -24.45 10.5 -23.65 L10.55 -23.55 10.7 -23.35 10.75 -23.25 10.95 -22.45 10.95 -22.4 10.85 -21.75 10.95 -20.2 10.95 -20.1 11.6 -17.55 11.6 -17.3 11.55 -0.7 11.55 0.0 Q11.6 1.1 10.4 2.0 9.5 2.65 7.75 3.15 4.5 4.1 0.0 4.1 -4.5 4.1 -7.7 3.15 -9.45 2.65 -10.3 2.05 -11.5 1.2 -11.55 0.2 L-11.55 0.1 -11.55 0.0 -11.55 -0.1 -11.55 -0.2 -11.5 -0.45 -11.5 -0.7 11.55 -0.7 -11.5 -0.7" fill="#000000" fill-rule="evenodd" stroke="none"/>
    <path d="M-10.55 -17.25 Q-10.5 -16.0 -7.45 -15.1 -4.35 -14.2 0.0 -14.2 4.35 -14.2 7.45 -15.1 10.55 -16.0 10.55 -17.3 L10.6 -17.3 10.55 -0.1 Q10.5 -0.7 9.8 -1.15 L9.8 -1.2 9.8 -1.3 9.8 -1.4 9.8 -10.55 9.8 -10.7 Q9.65 -11.85 6.9 -12.65 4.05 -13.5 0.0 -13.45 -4.05 -13.5 -6.9 -12.65 -8.8 -12.1 -9.45 -11.35 L-9.75 -10.9 -9.75 -10.35 -9.75 -1.2 -10.2 -0.8 -10.5 -0.3 -10.55 -17.25" fill="#1fade9" fill-rule="evenodd" stroke="none"/>
    <path d="M10.6 -17.3 L10.55 -17.3 Q10.55 -16.0 7.45 -15.1 4.35 -14.2 0.0 -14.2 -4.35 -14.2 -7.45 -15.1 -10.5 -16.0 -10.55 -17.25 L-10.55 -17.3 -10.5 -17.6 -9.95 -20.1 -9.9 -20.1 -9.9 -19.85 Q-9.8 -19.35 -9.05 -18.9 -8.35 -18.4 -7.0 -18.0 L-5.45 -17.65 0.0 -17.15 5.45 -17.65 7.0 -18.0 Q8.35 -18.4 9.1 -18.9 9.6 -19.15 9.9 -19.9 L9.95 -20.05 9.95 -20.1 10.6 -17.3" fill="#65c6ef" fill-rule="evenodd" stroke="none"/>
    <path d="M9.8 -21.9 L9.8 -22.2 9.25 -21.65 Q8.5 -21.15 7.05 -20.7 4.15 -19.9 0.05 -19.85 -4.05 -19.9 -6.95 -20.7 -8.4 -21.15 -9.1 -21.65 -9.75 -22.1 -9.85 -22.55 L-9.85 -22.75 -9.7 -23.05 -9.6 -23.15 Q-8.95 -23.9 -7.0 -24.45 L0.0 -25.3 7.0 -24.45 Q9.1 -23.85 9.7 -23.05 L9.75 -23.0 9.85 -22.85 9.95 -22.4 9.8 -21.9" fill="#535779" fill-rule="evenodd" stroke="none"/>
    <path d="M-9.85 -22.75 L-9.85 -22.55 Q-9.75 -22.1 -9.1 -21.65 -8.4 -21.15 -6.95 -20.7 -4.05 -19.9 0.05 -19.85 4.15 -19.9 7.05 -20.7 8.5 -21.15 9.25 -21.65 L9.8 -22.2 9.8 -21.9 9.2 -21.25 Q8.45 -20.75 7.0 -20.3 4.1 -19.5 0.0 -19.45 -4.1 -19.5 -7.0 -20.3 -8.45 -20.75 -9.15 -21.25 L-9.9 -22.15 -9.9 -22.6 -9.85 -22.75" fill="#7379ae" fill-rule="evenodd" stroke="none"/>
    <path d="M9.95 -20.1 L9.95 -20.05 9.9 -19.9 Q9.6 -19.15 9.1 -18.9 8.35 -18.4 7.0 -18.0 L5.45 -17.65 0.0 -17.15 -5.45 -17.65 -7.0 -18.0 Q-8.35 -18.4 -9.05 -18.9 -9.8 -19.35 -9.9 -19.85 L-9.9 -20.1 -9.9 -20.15 -9.9 -20.3 -9.9 -22.15 -9.9 -22.4 -9.9 -22.6 -9.9 -22.15 -9.15 -21.25 Q-8.45 -20.75 -7.0 -20.3 -4.1 -19.5 0.0 -19.45 4.1 -19.5 7.0 -20.3 8.45 -20.75 9.2 -21.25 L9.8 -21.9 9.95 -20.1 M-10.55 0.1 L-10.55 0.0 -10.55 -0.1 -10.5 -0.3 -10.55 0.1" fill="#000000" fill-rule="evenodd" stroke="none"/>
    <path d="M-9.75 -10.35 L-9.75 -10.9 -9.45 -11.35 Q-8.8 -12.1 -6.9 -12.65 -4.05 -13.5 0.0 -13.45 4.05 -13.5 6.9 -12.65 9.65 -11.85 9.8 -10.7 L9.8 -10.55 Q9.75 -9.4 6.9 -8.55 4.05 -7.7 0.0 -7.7 -4.05 -7.7 -6.9 -8.55 -9.5 -9.3 -9.75 -10.35 M3.95 -11.05 L3.55 -11.5 Q3.4 -12.8 2.35 -12.8 L1.35 -12.45 Q0.9 -13.4 0.25 -13.4 L-0.2 -13.05 -0.9 -12.9 -1.2 -11.95 Q-1.45 -12.55 -2.25 -12.55 L-3.4 -12.05 -3.7 -11.8 -4.15 -11.0 -4.5 -11.1 Q-5.25 -11.1 -5.65 -10.3 L-6.8 -9.55 -6.6 -9.3 -6.25 -9.4 -5.15 -9.0 Q-4.9 -9.0 -4.55 -9.35 L-4.2 -9.1 Q-3.1 -9.1 -3.1 -9.9 L-2.8 -9.9 Q-2.8 -8.65 -1.1 -8.65 L-1.5 -8.35 -1.85 -8.7 -2.25 -8.5 -2.9 -9.35 -3.05 -9.35 -3.2 -8.95 -3.5 -8.8 -3.75 -9.0 -5.15 -8.65 Q-5.15 -8.15 -3.85 -8.15 -3.65 -8.15 -3.55 -8.25 L-2.9 -8.1 -1.35 -7.95 -1.15 -8.0 -0.8 -7.85 Q-0.3 -7.85 -0.1 -8.05 0.0 -7.8 0.35 -7.8 1.15 -7.8 1.15 -8.4 1.15 -8.85 0.45 -8.85 L0.0 -8.7 -0.05 -8.8 -0.2 -8.85 -0.55 -8.8 0.45 -9.15 1.05 -8.95 1.4 -9.05 1.95 -8.8 Q2.45 -8.8 3.0 -9.3 L3.7 -9.1 Q4.25 -9.1 4.5 -9.4 4.75 -9.0 5.5 -9.0 6.35 -9.0 6.55 -9.5 L6.55 -9.45 Q6.55 -9.15 6.95 -9.15 7.95 -9.15 7.95 -9.85 L7.6 -10.25 Q6.75 -10.25 6.6 -9.75 L6.6 -9.85 Q6.45 -10.65 5.85 -10.7 L5.9 -11.0 Q5.9 -11.9 5.1 -11.9 L4.25 -11.7 Q3.95 -11.55 3.95 -11.2 L3.95 -11.05 M4.5 -8.7 Q4.5 -8.35 4.95 -8.35 5.35 -8.35 5.35 -8.65 L5.0 -9.0 Q4.5 -9.0 4.5 -8.7 M3.75 -8.55 L3.45 -8.9 Q2.6 -8.9 2.6 -8.3 2.6 -8.0 3.0 -8.0 3.75 -8.0 3.75 -8.55 M1.35 -8.4 Q1.25 -8.05 1.65 -8.05 2.05 -8.05 2.05 -8.4 L1.75 -8.75 Q1.35 -8.75 1.35 -8.4 M-5.75 -8.35 Q-5.5 -8.35 -5.5 -8.6 L-6.2 -9.05 Q-6.6 -9.05 -6.6 -8.8 -6.6 -8.35 -5.75 -8.35 M-6.7 -8.95 L-7.0 -9.2 Q-7.25 -9.2 -7.25 -9.0 L-6.9 -8.75 -6.7 -8.95" fill="#ffcc33" fill-rule="evenodd" stroke="none"/>
    <path d="M-3.4 -12.05 L-2.25 -12.55 Q-1.45 -12.55 -1.2 -11.95 L-0.9 -12.9 -0.2 -13.05 0.25 -13.4 Q0.9 -13.4 1.35 -12.45 L2.35 -12.8 Q3.4 -12.8 3.55 -11.5 L3.95 -11.05 Q4.0 -10.7 4.45 -10.7 5.05 -10.7 5.05 -11.25 5.05 -11.75 4.6 -11.75 L4.25 -11.7 5.1 -11.9 Q5.9 -11.9 5.9 -11.0 L5.85 -10.7 Q6.45 -10.65 6.6 -9.85 L6.6 -9.75 Q6.75 -10.25 7.6 -10.25 L7.95 -9.85 Q7.95 -9.15 6.95 -9.15 6.55 -9.15 6.55 -9.45 L6.55 -9.5 Q6.35 -9.0 5.5 -9.0 4.75 -9.0 4.5 -9.4 4.25 -9.1 3.7 -9.1 L3.0 -9.3 Q2.45 -8.8 1.95 -8.8 L1.4 -9.05 1.05 -8.95 0.45 -9.15 -0.55 -8.8 -1.1 -8.65 Q-2.8 -8.65 -2.8 -9.9 L-3.1 -9.9 Q-3.1 -9.1 -4.2 -9.1 L-4.55 -9.35 Q-4.9 -9.0 -5.15 -9.0 L-6.25 -9.4 -6.6 -9.3 -6.8 -9.55 -5.65 -10.3 Q-5.25 -11.1 -4.5 -11.1 L-4.15 -11.0 -3.7 -11.8 -3.85 -11.25 Q-3.85 -10.8 -3.3 -10.8 -2.85 -10.8 -2.3 -11.25 L-1.75 -11.9 Q-1.75 -12.3 -2.3 -12.3 L-3.4 -12.05 M1.4 -11.55 Q1.45 -11.25 1.9 -11.25 2.8 -11.25 2.8 -12.0 2.8 -12.35 2.5 -12.35 1.7 -12.35 1.5 -11.95 L1.2 -12.1 Q0.85 -12.1 0.85 -11.8 0.85 -11.5 1.15 -11.5 L1.4 -11.55 M1.6 -10.25 Q1.6 -9.9 1.9 -9.9 2.6 -9.9 2.6 -10.25 L2.25 -10.6 Q1.6 -10.6 1.6 -10.25 M-4.6 -10.35 L-4.9 -10.7 Q-5.5 -10.7 -5.5 -10.05 -5.5 -9.75 -5.1 -9.75 -4.6 -9.75 -4.6 -10.35 M-0.7 -10.5 Q-0.7 -10.85 -1.0 -10.85 -1.85 -10.85 -1.85 -10.2 L-1.55 -10.0 Q-0.7 -10.0 -0.7 -10.5 M-0.2 -12.9 L-0.65 -12.55 Q-0.65 -12.15 -0.3 -12.15 0.1 -12.15 0.1 -12.55 L-0.2 -12.9" fill="#dd9280" fill-rule="evenodd" stroke="none"/>
    <path d="M-9.75 -1.2 L-9.75 -10.35 Q-9.5 -9.3 -6.9 -8.55 -4.05 -7.7 0.0 -7.7 4.05 -7.7 6.9 -8.55 9.75 -9.4 9.8 -10.55 L9.8 -1.4 9.8 -1.3 9.8 -1.2 Q9.75 -0.75 9.3 -0.35 8.55 0.25 6.9 0.75 L0.0 1.6 -6.9 0.75 -9.25 -0.3 -9.75 -1.05 -9.75 -1.2 M-0.55 -8.8 L-0.2 -8.85 -0.05 -8.8 0.0 -8.7 0.45 -8.85 Q1.15 -8.85 1.15 -8.4 1.15 -7.8 0.35 -7.8 0.0 -7.8 -0.1 -8.05 -0.3 -7.85 -0.8 -7.85 L-1.15 -8.0 -1.35 -7.95 -2.9 -8.1 -3.55 -8.25 Q-3.65 -8.15 -3.85 -8.15 -5.15 -8.15 -5.15 -8.65 L-3.75 -9.0 -3.5 -8.8 -3.2 -8.95 -3.05 -9.35 -2.9 -9.35 -2.25 -8.5 -1.85 -8.7 -1.5 -8.35 -1.1 -8.65 -0.55 -8.8 M6.35 -6.45 Q6.35 -6.85 6.0 -6.85 L5.4 -6.45 4.9 -5.95 Q4.9 -5.55 5.55 -5.55 6.35 -5.55 6.35 -6.45 M5.95 -7.65 L5.7 -7.85 1.05 -7.2 -3.05 -7.2 Q-3.9 -7.2 -4.35 -7.55 L-5.2 -7.6 Q-7.0 -7.6 -7.0 -6.95 -7.0 -6.35 -6.55 -6.35 L-5.45 -6.65 -4.7 -6.6 Q-5.05 -5.75 -1.95 -5.7 L0.4 -5.0 Q1.5 -5.0 2.25 -5.75 L2.65 -6.5 3.3 -6.7 Q4.2 -6.7 4.4 -6.4 4.75 -6.4 5.35 -6.9 L5.95 -7.65 M6.8 -7.85 L6.25 -7.2 6.6 -6.9 Q7.25 -6.9 7.9 -8.0 L7.65 -8.3 Q7.35 -8.3 6.8 -7.85 M1.35 -8.4 Q1.35 -8.75 1.75 -8.75 L2.05 -8.4 Q2.05 -8.05 1.65 -8.05 1.25 -8.05 1.35 -8.4 M3.75 -8.55 Q3.75 -8.0 3.0 -8.0 2.6 -8.0 2.6 -8.3 2.6 -8.9 3.45 -8.9 L3.75 -8.55 M4.5 -8.7 Q4.5 -9.0 5.0 -9.0 L5.35 -8.65 Q5.35 -8.35 4.95 -8.35 4.5 -8.35 4.5 -8.7 M2.45 -5.35 L1.55 -4.35 Q1.55 -4.05 2.0 -4.05 L2.75 -4.3 3.8 -4.45 4.25 -5.3 4.15 -5.55 4.3 -5.85 Q4.3 -6.3 3.5 -6.3 3.1 -6.3 2.45 -5.35 M8.65 -0.65 L8.8 -0.85 Q8.55 -1.4 6.65 -1.95 L0.0 -2.7 -6.6 -1.95 Q-8.15 -1.5 -8.7 -0.95 L-8.75 -0.9 -8.75 -0.8 -8.6 -0.6 -8.6 -0.65 Q-8.0 -0.15 -6.6 0.25 -3.85 1.05 0.0 1.05 3.85 1.05 6.65 0.25 8.0 -0.15 8.65 -0.65 M-5.75 -8.35 Q-6.6 -8.35 -6.6 -8.8 -6.6 -9.05 -6.2 -9.05 L-5.5 -8.6 Q-5.5 -8.35 -5.75 -8.35 M-6.55 -8.0 L-6.6 -8.05 -7.45 -8.2 -7.85 -8.0 -7.3 -7.6 Q-6.95 -7.6 -6.55 -8.0 M-6.7 -8.95 L-6.9 -8.75 -7.25 -9.0 Q-7.25 -9.2 -7.0 -9.2 L-6.7 -8.95 M-4.2 -4.75 L-2.8 -4.15 Q-2.05 -4.15 -2.05 -4.5 -2.6 -5.4 -3.1 -5.4 -4.2 -5.4 -4.2 -4.75 M-4.95 -5.2 L-4.7 -5.4 -5.2 -6.4 -5.95 -5.95 Q-5.65 -5.2 -4.95 -5.2 M-1.1 -4.45 Q-1.1 -4.1 -0.8 -4.1 -0.5 -4.1 -0.5 -4.45 -0.5 -4.8 -0.8 -4.8 L-1.1 -4.45" fill="#f8a832" fill-rule="evenodd" stroke="none"/>
    <path d="M6.8 -7.85 Q7.35 -8.3 7.65 -8.3 L7.9 -8.0 Q7.25 -6.9 6.6 -6.9 L6.25 -7.2 6.8 -7.85 M5.95 -7.65 L5.35 -6.9 Q4.75 -6.4 4.4 -6.4 4.2 -6.7 3.3 -6.7 L2.65 -6.5 2.25 -5.75 Q1.5 -5.0 0.4 -5.0 L-1.95 -5.7 Q-5.05 -5.75 -4.7 -6.6 L-5.45 -6.65 -6.55 -6.35 Q-7.0 -6.35 -7.0 -6.95 -7.0 -7.6 -5.2 -7.6 L-4.35 -7.55 Q-3.9 -7.2 -3.05 -7.2 L1.05 -7.2 5.7 -7.85 5.95 -7.65 M6.35 -6.45 Q6.35 -5.55 5.55 -5.55 4.9 -5.55 4.9 -5.95 L5.4 -6.45 6.0 -6.85 Q6.35 -6.85 6.35 -6.45 M2.45 -5.35 Q3.1 -6.3 3.5 -6.3 4.3 -6.3 4.3 -5.85 L4.15 -5.55 4.25 -5.3 3.8 -4.45 2.75 -4.3 2.0 -4.05 Q1.55 -4.05 1.55 -4.35 L2.45 -5.35 M-6.55 -8.0 Q-6.95 -7.6 -7.3 -7.6 L-7.85 -8.0 -7.45 -8.2 -6.6 -8.05 -6.55 -8.0 M-1.1 -4.45 L-0.8 -4.8 Q-0.5 -4.8 -0.5 -4.45 -0.5 -4.1 -0.8 -4.1 -1.1 -4.1 -1.1 -4.45 M-4.95 -5.2 Q-5.65 -5.2 -5.95 -5.95 L-5.2 -6.4 -4.7 -5.4 -4.95 -5.2 M-4.2 -4.75 Q-4.2 -5.4 -3.1 -5.4 -2.6 -5.4 -2.05 -4.5 -2.05 -4.15 -2.8 -4.15 L-4.2 -4.75" fill="#b94f4f" fill-rule="evenodd" stroke="none"/>
    <path d="M3.95 -11.05 L3.95 -11.2 Q3.95 -11.55 4.25 -11.7 L4.6 -11.75 Q5.05 -11.75 5.05 -11.25 5.05 -10.7 4.45 -10.7 4.0 -10.7 3.95 -11.05 M-3.7 -11.8 L-3.4 -12.05 -2.3 -12.3 Q-1.75 -12.3 -1.75 -11.9 L-2.3 -11.25 Q-2.85 -10.8 -3.3 -10.8 -3.85 -10.8 -3.85 -11.25 L-3.7 -11.8 M1.6 -10.25 Q1.6 -10.6 2.25 -10.6 L2.6 -10.25 Q2.6 -9.9 1.9 -9.9 1.6 -9.9 1.6 -10.25 M1.4 -11.55 L1.15 -11.5 Q0.85 -11.5 0.85 -11.8 0.85 -12.1 1.2 -12.1 L1.5 -11.95 Q1.7 -12.35 2.5 -12.35 2.8 -12.35 2.8 -12.0 2.8 -11.25 1.9 -11.25 1.45 -11.25 1.4 -11.55 M-0.2 -12.9 L0.1 -12.55 Q0.1 -12.15 -0.3 -12.15 -0.65 -12.15 -0.65 -12.55 L-0.2 -12.9 M-0.7 -10.5 Q-0.7 -10.0 -1.55 -10.0 L-1.85 -10.2 Q-1.85 -10.85 -1.0 -10.85 -0.7 -10.85 -0.7 -10.5 M-4.6 -10.35 Q-4.6 -9.75 -5.1 -9.75 -5.5 -9.75 -5.5 -10.05 -5.5 -10.7 -4.9 -10.7 L-4.6 -10.35" fill="#e3c2b5" fill-rule="evenodd" stroke="none"/>
    <path d="M8.65 -0.65 Q8.0 -0.15 6.65 0.25 3.85 1.05 0.0 1.05 -3.85 1.05 -6.6 0.25 -8.0 -0.15 -8.6 -0.65 L-8.6 -0.6 -8.75 -0.8 -8.75 -0.9 -8.7 -0.95 Q-8.15 -1.5 -6.6 -1.95 L0.0 -2.7 6.65 -1.95 Q8.55 -1.4 8.8 -0.85 L8.65 -0.65" fill="#f87118" fill-rule="evenodd" stroke="none"/>
    <path d="M-10.5 -0.3 L-10.2 -0.8 -9.75 -1.2 -9.75 -1.05 -9.25 -0.3 -9.45 -0.15 -9.5 -0.05 -9.5 0.05 Q-9.25 0.65 -7.15 1.25 L0.0 2.1 7.2 1.25 Q9.35 0.6 9.55 0.0 L9.3 -0.35 Q9.75 -0.75 9.8 -1.2 L9.8 -1.15 Q10.5 -0.7 10.55 -0.1 L10.55 0.0 Q10.55 0.65 9.8 1.2 9.05 1.75 7.45 2.2 4.35 3.1 0.0 3.1 -4.35 3.1 -7.45 2.2 L-9.75 1.25 Q-10.5 0.7 -10.55 0.1 L-10.5 -0.3" fill="#1294cb" fill-rule="evenodd" stroke="none"/>
    <path d="M9.3 -0.35 L9.55 0.0 Q9.35 0.6 7.2 1.25 L0.0 2.1 -7.15 1.25 Q-9.25 0.65 -9.5 0.05 L-9.5 -0.05 -9.45 -0.15 -9.25 -0.3 -6.9 0.75 0.0 1.6 6.9 0.75 Q8.55 0.25 9.3 -0.35" fill="#149fda" fill-rule="evenodd" stroke="none"/>
    <path d="M7.65 -34.05 L7.4 -25.15 7.3 -22.65 Q7.3 -22.5 6.45 -22.05 L3.8 -21.45 -1.1 -21.25 Q-4.2 -21.25 -7.2 -22.45 L-7.45 -22.8 -7.4 -22.9 Q-2.5 -32.2 7.65 -34.05" fill="#000000" fill-rule="evenodd" stroke="none"/>
  </g>
</svg>
