<?xml version="1.0" encoding="UTF-8" standalone="no"?>
<svg xmlns:xlink="http://www.w3.org/1999/xlink" height="18.55px" width="44.25px" xmlns="http://www.w3.org/2000/svg">
  <g transform="matrix(1.0, 0.0, 0.0, 1.0, 21.65, 18.2)">
    <path d="M-8.75 -4.65 L-9.25 -5.0 -10.25 -6.1 Q-11.4 -7.95 -11.1 -10.2 L-10.45 -11.45 -9.3 -12.1 -8.65 -12.3 -7.85 -12.5 Q-8.1 -12.9 -7.85 -13.3 -7.7 -13.6 -7.35 -13.6 L-5.3 -13.8 -3.85 -13.95 -2.65 -14.15 1.75 -13.9 2.6 -13.7 3.2 -13.6 5.05 -12.85 6.15 -12.6 Q6.05 -12.0 6.8 -11.9 L7.1 -11.4 7.5 -10.65 7.25 -9.2 6.45 -7.45 5.55 -6.45 Q4.9 -5.8 4.05 -5.4 1.7 -4.35 -0.9 -4.05 L-5.85 -4.25 -7.1 -4.4 -8.45 -4.65 -8.75 -4.65 M-6.75 -9.9 L-6.5 -9.65 -5.1 -9.15 -2.65 -9.25 Q-2.2 -9.4 -1.75 -9.65 -1.0 -10.1 -1.35 -11.0 L-1.7 -11.4 Q-3.15 -12.2 -4.9 -11.95 -6.0 -11.8 -6.7 -10.9 L-6.8 -10.6 -6.75 -9.9" fill="#ff6699" fill-rule="evenodd" stroke="none"/>
    <path d="M-6.75 -9.9 L-6.8 -10.6 -6.7 -10.9 Q-6.0 -11.8 -4.9 -11.95 -3.15 -12.2 -1.7 -11.4 L-1.35 -11.0 Q-1.0 -10.1 -1.75 -9.65 -2.2 -9.4 -2.65 -9.25 L-5.1 -9.15 -6.5 -9.65 -6.75 -9.9" fill="#ffffff" fill-rule="evenodd" stroke="none"/>
    <path d="M6.15 -12.6 L6.45 -12.9 Q6.9 -12.4 7.7 -12.3 L7.8 -12.25 8.0 -12.05 8.35 -11.85 Q9.3 -11.25 9.65 -10.2 10.05 -9.05 9.8 -7.85 L9.75 -7.3 Q9.7 -6.1 8.9 -5.15 L8.0 -3.9 Q7.15 -2.55 5.5 -2.75 L3.5 -1.95 2.1 -1.6 -3.95 -1.8 Q-5.45 -2.1 -6.65 -3.05 L-7.05 -3.35 -8.55 -3.9 Q-8.9 -4.05 -8.9 -4.35 L-8.75 -4.65 -8.45 -4.65 -7.1 -4.4 -5.85 -4.25 -0.9 -4.05 Q1.7 -4.35 4.05 -5.4 4.9 -5.8 5.55 -6.45 L6.45 -7.45 7.25 -9.2 7.5 -10.65 7.1 -11.4 6.8 -11.9 Q6.05 -12.0 6.15 -12.6" fill="#cd0191" fill-rule="evenodd" stroke="none"/>
    <path d="M6.5 -5.4 L8.8 -5.6 9.65 -9.15 8.8 -9.8 9.55 -9.5 8.85 -11.8 10.3 -10.6 Q13.25 -12.8 16.65 -13.6 L20.9 -14.3 22.6 -11.6 19.05 -8.7 20.2 -10.4 21.05 -11.45 22.05 -12.3 18.15 -13.7 10.7 -9.85 17.55 -10.7 10.75 -8.5 13.35 -8.05 16.65 -7.05 16.45 -6.3 13.65 -7.15 10.8 -7.8 10.75 -6.4 15.05 -3.9 11.6 -5.05 10.4 -5.6 9.8 -4.65 Q11.65 -2.9 14.25 -1.9 L17.8 -0.55 Q15.25 0.0 12.95 -1.1 10.9 -2.2 9.55 -4.05 7.8 -1.85 5.25 -0.75 1.7 1.0 -2.2 0.0 -4.85 -0.55 -7.3 -1.9 L-9.75 -3.4 -8.95 -2.95 -10.3 -4.25 -10.05 -3.6 -11.4 -4.95 -13.2 -3.4 Q-14.7 -2.0 -16.8 -1.6 L-18.45 -1.4 -20.7 -2.8 -20.75 -4.3 -21.2 -4.25 -21.65 -8.6 -21.2 -5.3 -17.3 -6.1 -17.45 -5.5 -20.2 -4.35 -20.05 -3.2 Q-18.1 -1.95 -15.75 -2.7 -13.1 -3.65 -11.6 -6.1 L-11.15 -7.0 -11.3 -7.95 -13.75 -7.4 -14.5 -7.75 -18.85 -6.3 -15.1 -8.6 -15.6 -9.5 -21.55 -8.9 -19.7 -11.5 -17.2 -10.55 Q-15.7 -9.9 -14.3 -8.8 L-10.6 -9.15 -9.65 -10.75 -10.2 -7.2 -9.35 -7.35 -10.0 -6.7 -7.15 -4.05 Q-6.3 -3.35 -5.2 -3.1 L-4.55 -2.9 -4.75 -2.5 -0.55 -2.2 -3.55 -4.15 Q-0.2 -2.75 3.5 -3.15 6.1 -3.2 8.55 -4.55 L6.5 -5.4 M8.65 -11.85 Q2.6 -13.95 -3.65 -12.7 -7.45 -12.0 -10.95 -10.35 L-10.05 -10.25 -12.25 -9.75 -11.7 -9.35 Q-17.75 -11.15 -21.5 -16.25 L-12.25 -9.75 Q-14.0 -14.75 -18.75 -16.6 L-20.85 -17.25 -19.65 -18.2 Q-14.7 -16.95 -12.9 -12.25 L-12.55 -10.95 Q-10.9 -11.9 -9.6 -13.15 L-8.7 -14.05 Q-3.5 -15.35 1.8 -14.25 5.35 -13.55 8.65 -11.85 M19.65 -2.9 L19.05 -8.45 20.45 -7.15 19.65 -2.9 M20.5 -1.85 L19.25 -1.05 19.75 -2.75 20.1 -4.5 20.4 -3.5 20.5 -1.85 M-6.15 -14.35 L-8.55 -13.8 -8.15 -13.55 -7.75 -13.55 -6.15 -14.35 M-11.25 -10.4 L-10.35 -11.6 -11.75 -10.45 -11.25 -10.4 M-6.65 -5.7 L4.8 -4.8 -6.1 -5.25 -6.65 -5.7 M-6.5 -7.8 Q-0.75 -6.65 5.1 -7.65 L-5.2 -7.35 -6.5 -7.8" fill="#ffffff" fill-rule="evenodd" stroke="none"/>
  </g>
</svg>
