<?xml version="1.0" encoding="UTF-8" standalone="no"?>
<svg xmlns:xlink="http://www.w3.org/1999/xlink" height="30.0px" width="17.55px" xmlns="http://www.w3.org/2000/svg">
  <g transform="matrix(1.0, 0.0, 0.0, 1.0, 8.7, 28.95)">
    <path d="M7.05 1.05 L-6.7 1.05 -6.7 -6.0 7.05 -6.0 7.05 1.05" fill="#000000" fill-rule="evenodd" stroke="none"/>
    <path d="M3.1 -22.45 L3.85 -23.1 4.15 -23.05 Q4.65 -23.15 4.95 -23.65 L6.3 -25.9 Q7.0 -27.1 6.6 -28.5 L6.35 -27.85 5.7 -27.55 1.65 -27.7 0.65 -27.7 -1.2 -27.4 -2.25 -26.8 Q-2.45 -26.45 -2.0 -26.1 L0.4 -25.5 0.55 -25.25 0.8 -24.85 1.2 -24.45 1.8 -22.95 0.15 -19.55 0.0 -20.55 Q0.65 -21.55 0.15 -22.7 -0.15 -23.3 -0.9 -23.35 L-2.75 -25.65 Q-3.15 -26.15 -3.2 -26.8 L-3.2 -27.55 -5.6 -28.4 -5.65 -28.5 Q-6.15 -28.8 -6.1 -28.3 L-7.1 -27.75 -6.8 -26.45 Q-6.55 -24.95 -5.45 -23.85 L-4.35 -22.8 Q-3.15 -21.8 -1.65 -21.5 L-1.45 -21.2 -1.95 -19.55 -0.65 -16.85 Q-0.95 -15.3 -0.7 -13.85 L-0.45 -12.65 0.0 -10.95 -0.35 -4.6 -0.8 -4.65 -1.95 -5.0 -1.9 -5.1 -1.75 -5.3 -1.2 -5.8 Q-0.05 -9.65 -0.8 -12.15 -1.6 -14.7 -1.45 -15.5 L-0.95 -16.6 -2.0 -17.4 Q-3.0 -18.05 -3.3 -19.0 L-2.05 -20.45 Q-8.55 -22.1 -8.7 -28.65 L6.15 -28.95 8.85 -28.65 Q9.05 -26.05 7.6 -23.8 6.65 -22.45 5.35 -21.8 L2.5 -20.45 3.6 -19.0 Q3.4 -18.3 2.8 -17.7 L1.3 -16.6 Q2.2 -14.6 1.5 -12.15 1.15 -10.85 1.25 -9.4 L1.5 -6.5 1.5 -5.7 2.0 -5.55 2.3 -5.0 0.35 -4.6 0.4 -5.45 0.65 -8.6 0.4 -15.25 0.55 -15.65 Q0.8 -16.95 0.2 -17.95 L0.35 -18.55 0.65 -17.95 0.45 -17.6 Q2.05 -17.85 2.6 -19.5 L1.15 -18.7 1.0 -20.2 3.1 -22.45" fill="#ffffff" fill-rule="evenodd" stroke="none"/>
    <path d="M3.1 -22.45 L2.45 -22.75 3.05 -23.2 2.55 -24.1 2.6 -25.65 2.05 -26.1 2.7 -26.5 2.05 -26.8 1.65 -27.7 5.7 -27.55 Q5.85 -25.95 4.65 -24.8 3.9 -24.15 3.85 -23.1 L3.1 -22.45 M0.4 -25.5 L0.6 -25.4 0.55 -25.25 0.4 -25.5 M0.8 -24.85 L1.1 -24.7 1.2 -24.45 0.8 -24.85 M0.15 -19.55 L0.35 -18.55 0.2 -17.95 Q0.8 -16.95 0.55 -15.65 L0.4 -15.25 0.65 -8.6 Q0.55 -8.8 0.5 -8.5 L0.05 -6.05 0.15 -5.4 0.4 -5.45 0.35 -4.6 0.3 -4.1 0.05 -3.95 Q-0.15 -3.95 -0.25 -4.1 L-0.35 -4.6 0.0 -10.95 Q0.15 -14.4 -0.65 -17.8 L-0.95 -18.65 -1.3 -19.4 -0.55 -21.25 -1.35 -22.5 -4.8 -24.95 -5.35 -28.1 -5.6 -28.4 -3.2 -27.55 -3.2 -26.8 Q-3.15 -26.15 -2.75 -25.65 L-0.9 -23.35 Q-0.15 -23.3 0.15 -22.7 0.65 -21.55 0.0 -20.55 L0.15 -19.55 M-1.65 -21.5 Q-3.15 -21.8 -4.35 -22.8 L-5.45 -23.85 Q-6.55 -24.95 -6.8 -26.45 L-7.1 -27.75 -6.1 -28.3 -6.15 -27.55 Q-6.15 -26.05 -5.3 -24.8 L-4.5 -23.85 -2.05 -22.25 Q-1.55 -22.05 -1.65 -21.5" fill="#cccccc" fill-rule="evenodd" stroke="none"/>
    <path d="M1.65 -27.7 L2.05 -26.8 2.7 -26.5 2.05 -26.1 2.6 -25.65 2.55 -24.1 3.05 -23.2 2.45 -22.75 3.1 -22.45 1.0 -20.2 1.15 -18.7 2.6 -19.5 Q2.05 -17.85 0.45 -17.6 L0.65 -17.95 0.35 -18.55 0.15 -19.55 1.8 -22.95 1.2 -24.45 1.1 -24.7 0.8 -24.85 0.55 -25.25 0.6 -25.4 0.4 -25.5 -2.0 -26.1 Q-2.45 -26.45 -2.25 -26.8 L-1.2 -27.4 0.65 -27.7 1.65 -27.7 M3.85 -23.1 Q3.9 -24.15 4.65 -24.8 5.85 -25.95 5.7 -27.55 L6.35 -27.85 6.6 -28.5 Q7.0 -27.1 6.3 -25.9 L4.95 -23.65 Q4.65 -23.15 4.15 -23.05 L3.85 -23.1 M0.0 -10.95 L-0.45 -12.65 -0.7 -13.85 Q-0.95 -15.3 -0.65 -16.85 L-1.95 -19.55 -1.45 -21.2 -1.65 -21.5 Q-1.55 -22.05 -2.05 -22.25 L-4.5 -23.85 -5.3 -24.8 Q-6.15 -26.05 -6.15 -27.55 L-6.1 -28.3 Q-6.15 -28.8 -5.65 -28.5 L-5.6 -28.4 -5.35 -28.1 -4.8 -24.95 -1.35 -22.5 -0.55 -21.25 -1.3 -19.4 -0.95 -18.65 -0.65 -17.8 Q0.15 -14.4 0.0 -10.95 M0.65 -8.6 L0.4 -5.45 0.15 -5.4 0.05 -6.05 0.5 -8.5 Q0.55 -8.8 0.65 -8.6" fill="#000000" fill-rule="evenodd" stroke="none"/>
    <path d="M1.0 -2.45 L3.85 -4.6 3.9 -5.4 6.1 -5.4 6.1 -5.25 Q5.95 -4.15 5.45 -3.2 L5.4 -3.1 5.15 -3.0 5.35 -4.5 4.2 -3.6 Q2.4 -2.25 1.2 -0.45 L0.0 -0.35 -1.6 -0.2 -0.95 -0.6 -0.45 -0.7 0.55 -1.75 Q0.7 -1.75 0.8 -1.85 1.25 -1.95 0.95 -2.35 L0.95 -2.4 1.0 -2.45 M3.35 -5.4 L2.2 -4.85 Q0.1 -3.65 -1.4 -1.85 L-1.5 -1.75 -1.85 -2.4 -2.5 -2.35 -3.15 -2.3 -4.4 -1.75 -0.95 -4.5 -0.7 -5.4 3.35 -5.4 M2.05 -0.5 L2.0 -0.5 2.05 -0.55 2.05 -0.5 M-6.15 -1.4 L-5.45 -1.8 -5.65 -1.4 -5.7 -0.9 -4.4 0.45 -6.15 0.45 -6.15 -1.4 M-4.15 -5.4 L-6.15 -3.8 -6.15 -5.4 -4.15 -5.4" fill="#feeec0" fill-rule="evenodd" stroke="none"/>
    <path d="M3.9 -5.4 L3.85 -4.6 1.0 -2.45 3.1 -4.85 -1.4 -1.85 Q0.1 -3.65 2.2 -4.85 L3.35 -5.4 3.9 -5.4 M0.95 -2.35 Q1.25 -1.95 0.8 -1.85 0.7 -1.75 0.55 -1.75 L0.95 -2.35 M5.15 -3.0 L5.4 -3.1 5.0 -1.0 2.05 -0.5 2.05 -0.55 5.15 -3.0 M5.95 -3.25 L5.95 -3.2 5.95 -3.25 M-6.15 -1.4 L-6.15 -3.8 -4.15 -5.4 -0.7 -5.4 -0.95 -4.5 -4.4 -1.75 -3.15 -2.3 -2.5 -2.35 -1.85 -2.4 -1.5 -1.75 -2.7 -0.7 -2.8 -0.2 -1.85 -0.15 -3.3 0.45 -4.4 0.45 -5.7 -0.9 -5.65 -1.4 Q-3.6 -2.55 -2.45 -4.5 L-3.0 -4.55 -3.25 -4.85 -3.4 -4.85 -5.25 -3.45 -5.0 -2.7 -5.45 -1.8 -6.15 -1.4" fill="#cccc99" fill-rule="evenodd" stroke="none"/>
    <path d="M-1.4 -1.85 L3.1 -4.85 1.0 -2.45 0.95 -2.4 0.95 -2.35 0.55 -1.75 -0.45 -0.7 -0.95 -0.6 -1.6 -0.2 -1.85 -0.15 -2.8 -0.2 -2.7 -0.7 -1.5 -1.75 -1.4 -1.85 M1.2 -0.45 Q2.4 -2.25 4.2 -3.6 L5.35 -4.5 5.15 -3.0 2.05 -0.55 2.0 -0.5 Q1.6 0.1 1.2 -0.2 L1.2 -0.45 M-5.45 -1.8 L-5.0 -2.7 -5.25 -3.45 -3.4 -4.85 -3.25 -4.85 -3.0 -4.55 -2.45 -4.5 Q-3.6 -2.55 -5.65 -1.4 L-5.45 -1.8" fill="#000000" fill-rule="evenodd" stroke="none"/>
    <path d="M-1.6 -0.2 L0.0 -0.35 1.2 -0.45 1.2 -0.2 Q1.6 0.1 2.0 -0.5 L2.05 -0.5 5.0 -1.0 5.4 -3.1 5.45 -3.2 Q5.95 -4.15 6.1 -5.25 L6.1 -5.4 6.45 -5.4 6.45 0.45 -3.3 0.45 -1.85 -0.15 -1.6 -0.2 M5.95 -3.25 L5.95 -3.2 5.95 -3.25" fill="#988d47" fill-rule="evenodd" stroke="none"/>
  </g>
</svg>
