<?xml version="1.0" encoding="UTF-8" standalone="no"?>
<svg xmlns:xlink="http://www.w3.org/1999/xlink" height="23.75px" width="31.6px" xmlns="http://www.w3.org/2000/svg">
  <g transform="matrix(1.0, 0.0, 0.0, 1.0, 15.8, 19.75)">
    <path d="M15.0 -14.0 L15.3 -12.85 15.4 -12.15 Q15.8 -9.9 15.8 -6.25 L15.65 -5.8 15.35 -5.45 7.45 -1.55 2.1 1.05 2.1 1.1 -3.05 3.4 -4.8 4.0 -5.2 3.9 -11.45 -0.05 -15.1 -2.55 -15.3 -2.95 -15.65 -3.9 -15.7 -4.1 -15.75 -4.35 -15.75 -4.5 -15.75 -4.8 -15.3 -6.65 -15.05 -7.8 -14.4 -9.85 -13.15 -12.35 -13.1 -12.4 -12.45 -13.35 -12.4 -13.35 -12.25 -13.55 -12.25 -13.6 -11.7 -14.2 -11.65 -14.2 -11.0 -14.85 -11.0 -14.9 -10.6 -15.2 -10.05 -15.4 Q-9.7 -15.4 -10.15 -15.45 L-7.95 -15.8 -7.95 -15.85 -7.85 -15.85 -7.5 -15.95 -6.8 -16.1 1.25 -18.35 1.35 -18.35 Q3.25 -19.25 5.35 -19.55 L5.4 -19.55 5.35 -19.5 Q11.3 -20.75 14.3 -15.45 L14.65 -14.85 14.7 -14.75 15.0 -14.05 15.0 -14.0" fill="#000000" fill-rule="evenodd" stroke="none"/>
    <path d="M14.05 -13.7 L6.5 -11.75 0.1 -10.3 -3.0 -9.35 -2.2 -6.4 1.45 -7.8 8.55 -10.45 14.45 -11.95 Q14.8 -9.75 14.8 -6.25 11.65 -4.6 7.0 -2.3 L1.65 0.3 -3.5 2.65 -3.3 0.7 -3.3 0.2 -3.25 -0.8 -3.3 -4.15 -3.35 -5.15 -3.45 -5.9 -3.55 -6.4 -3.95 -8.05 -4.2 -8.95 -4.4 -9.5 Q-6.0 -14.25 -8.95 -14.25 L-9.0 -14.25 -10.6 -14.15 -10.2 -14.5 -7.95 -14.9 -7.8 -14.95 -7.75 -14.95 -7.45 -15.05 Q-5.45 -14.3 -4.2 -12.25 L-3.1 -9.9 2.9 -11.75 11.7 -14.35 13.45 -15.0 13.8 -14.35 14.05 -13.7" fill="#ff6699" fill-rule="evenodd" stroke="none"/>
    <path d="M14.45 -11.95 L8.55 -10.45 1.45 -7.8 -2.2 -6.4 -3.0 -9.35 0.1 -10.3 6.5 -11.75 14.05 -13.7 14.35 -12.65 14.45 -11.95 M13.45 -15.0 L11.7 -14.35 2.9 -11.75 -3.1 -9.9 -4.2 -12.25 Q-5.45 -14.3 -7.45 -15.05 L-6.75 -15.2 1.45 -17.45 Q3.3 -18.35 5.35 -18.6 10.7 -19.75 13.45 -15.0" fill="#feabcd" fill-rule="evenodd" stroke="none"/>
    <path d="M-10.6 -14.15 L-9.0 -14.25 -8.95 -14.25 Q-6.0 -14.25 -4.4 -9.5 L-4.2 -8.95 -3.95 -8.05 -3.55 -6.4 -6.25 -5.55 -3.45 -5.9 -3.35 -5.15 -3.3 -4.15 -3.25 -0.8 -3.3 0.2 -3.3 0.7 -3.5 2.65 -4.95 3.1 -5.95 2.5 -8.75 -3.45 -7.15 1.75 -11.15 -0.8 -14.65 -3.2 -10.05 -4.6 -10.2 -5.45 -15.05 -4.2 -15.05 -4.4 -15.1 -4.6 -14.65 -6.4 -14.4 -7.55 -13.75 -9.45 -12.6 -11.8 -10.35 -6.0 -11.9 -12.75 -11.75 -12.9 -11.2 -13.55 -10.65 -14.15 -10.6 -14.15 M-13.65 -9.35 L-13.65 -9.4 -13.65 -9.35" fill="#fd2d81" fill-rule="evenodd" stroke="none"/>
    <path d="M-3.55 -6.4 L-3.45 -5.9 -6.25 -5.55 -3.55 -6.4 M-11.9 -12.75 L-10.35 -6.0 -12.6 -11.8 -11.9 -12.75 M-15.05 -4.2 L-10.2 -5.45 -10.05 -4.6 -14.65 -3.2 -15.05 -4.2 M-7.15 1.75 L-8.75 -3.45 -5.95 2.5 -7.15 1.75" fill="#ba014b" fill-rule="evenodd" stroke="none"/>
    <path d="M2.95 -14.9 Q-2.7 -13.2 -3.55 -13.2 L-3.6 -13.2 -3.95 -13.3 -4.1 -13.4 -4.15 -13.6 -4.05 -13.75 -3.95 -13.75 2.7 -15.8 9.5 -18.0 9.6 -18.0 9.7 -17.9 9.95 -17.65 10.0 -17.5 10.0 -17.35 9.9 -17.25 Q8.4 -16.55 2.95 -14.9" fill="#ffffff" fill-rule="evenodd" stroke="none"/>
  </g>
</svg>
