<?xml version="1.0" encoding="UTF-8" standalone="no"?>
<svg
   xmlns:dc="http://purl.org/dc/elements/1.1/"
   xmlns:cc="http://creativecommons.org/ns#"
   xmlns:rdf="http://www.w3.org/1999/02/22-rdf-syntax-ns#"
   xmlns:svg="http://www.w3.org/2000/svg"
   xmlns="http://www.w3.org/2000/svg"
   xmlns:xlink="http://www.w3.org/1999/xlink"
   xmlns:sodipodi="http://sodipodi.sourceforge.net/DTD/sodipodi-0.dtd"
   xmlns:inkscape="http://www.inkscape.org/namespaces/inkscape"
   height="42.349998"
   width="44.700001"
   version="1.1"
   id="svg156"
   sodipodi:docname="49.svg"
   inkscape:version="0.92.1 r15371">
  <metadata
     id="metadata160">
    <rdf:RDF>
      <cc:Work
         rdf:about="">
        <dc:format>image/svg+xml</dc:format>
        <dc:type
           rdf:resource="http://purl.org/dc/dcmitype/StillImage" />
        <dc:title></dc:title>
      </cc:Work>
    </rdf:RDF>
  </metadata>
  <sodipodi:namedview
     pagecolor="#ffffff"
     bordercolor="#666666"
     borderopacity="1"
     objecttolerance="10"
     gridtolerance="10"
     guidetolerance="10"
     inkscape:pageopacity="0"
     inkscape:pageshadow="2"
     inkscape:window-width="818"
     inkscape:window-height="480"
     id="namedview158"
     showgrid="false"
     fit-margin-top="0"
     fit-margin-left="0"
     fit-margin-right="0"
     fit-margin-bottom="0"
     inkscape:zoom="3.4528165"
     inkscape:cx="23.1"
     inkscape:cy="20.575001"
     inkscape:window-x="0"
     inkscape:window-y="27"
     inkscape:window-maximized="0"
     inkscape:current-layer="svg156" />
  <g
     transform="translate(22.35,41.35)"
     id="g6">
    <use
       height="42.349998"
       transform="translate(-22.35,-41.35)"
       width="44.700001"
       xlink:href="#shape0"
       id="use2"
       x="0"
       y="0" />
    <use
       height="40.349998"
       transform="translate(-21.35,-40.35)"
       width="42.75"
       xlink:href="#sprite0"
       id="use4"
       x="0"
       y="0" />
  </g>
  <defs
     id="defs154">
    <g
       id="shape0"
       transform="translate(22.35,41.35)">
      <path
         d="m 22.15,-27.25 0.2,0.65 -0.05,3.2 -0.2,0.6 -0.5,0.35 -2.15,0.75 -0.45,0.05 -0.4,-0.15 -0.5,-0.3 -4,1.3 0.15,0.7 v 0.05 l 0.2,0.85 q 1.8,7.65 1.5,15.35 l 2,1.3 0.35,0.45 0.05,0.55 -0.25,0.5 q -1.15,1.25 -2.65,1.7 h 0.05 l -1.4,0.3 H 13.8 L 12.8,0.7 12,0.5 H 11.95 L 10.8,0.1 10.35,-0.2 Q 10.15,-0.4 10.1,-0.7 L 8.7,-9.75 3.3,-3.9 4.35,-3.35 4.8,-2.95 4.9,-2.35 4.7,-0.5 4.5,0 4,0.35 3.25,0.6 2.8,0.7 1.15,0.65 0.85,0.6 0.05,0.3 -0.8,0.65 -1.15,0.7 H -2.8 L -3.15,0.65 -3.95,0.4 -4.45,0.1 -4.7,-0.45 -4.9,-2.3 l 0.15,-0.6 0.4,-0.4 0.85,-0.45 -5.2,-5.8 -1.35,8.9 q -0.05,0.3 -0.25,0.5 l -0.45,0.3 -2,0.55 -1,0.3 h -0.3 l -1.4,-0.35 q -1.05,-0.3 -1.95,-1 l -0.05,-0.05 -0.6,-0.55 -0.3,-0.5 0.05,-0.6 0.4,-0.45 2,-1.3 q 0.15,-6.6 1.15,-13.1 l 0.7,-3.7 h -0.25 q -1.15,-0.15 -2,-0.8 l -0.25,-0.15 -1.5,-0.5 -0.5,0.3 -0.45,0.15 -0.45,-0.05 -2.15,-0.8 -0.5,-0.4 -0.15,-0.55 -0.1,-3.15 0.25,-0.65 0.6,-0.35 3.4,-0.65 0.55,0.05 0.4,0.3 0.5,0.6 2.65,-0.25 1.8,-4 -2.5,-1.9 -0.4,-0.65 0.15,-0.7 0.75,-1.15 0.1,-2.55 0.2,-0.5 1.35,-1.9 0.35,-0.3 0.4,-0.1 1.7,-0.1 0.3,0.05 1.8,0.4 0.1,0.05 0.45,0.15 h 0.1 q 1.35,0.55 2.4,1.55 l 0.3,0.65 0.3,3.1 q 0.05,0.4 -0.2,0.7 l -0.7,0.4 -0.35,0.05 -0.5,0.95 1.6,3.35 0.1,0.65 -1,5.05 -0.3,0.55 -0.1,0.1 0.3,2.35 q 1.25,6.75 5.45,12.85 l 1.25,-2 q 3.4,-5.7 4.55,-12.2 l -0.05,0.05 0.1,-0.55 0.05,-0.5 -0.1,-0.1 -0.3,-0.55 -1,-5.1 0.05,-0.6 1.6,-3.35 -0.5,-1 -0.3,-0.05 Q 4.85,-34.4 4.6,-34.7 4.3,-35.05 4.35,-35.45 l 0.3,-3.1 0.2,-0.45 0.35,-0.35 1.95,-0.9 0.05,-0.05 q 2.25,-0.9 4.6,-0.9 l 0.45,0.1 0.35,0.3 1.3,1.8 0.2,0.55 0.15,2.5 0.7,1.15 0.15,0.7 -0.35,0.65 -2.55,1.9 1.9,4.15 2.6,0.15 0.45,-0.6 q 0.15,-0.2 0.45,-0.3 l 0.5,-0.05 3.45,0.6 0.6,0.35 m -35.95,6.6 0.65,0.2 -0.2,-0.4 -0.15,0.05 -0.3,0.15"
         id="path8"
         inkscape:connector-curvature="0"
         style="fill:#002b55;fill-rule:evenodd;stroke:none" />
    </g>
    <g
       id="sprite0"
       transform="translate(21.25,45.3)">
      <use
         height="40.349998"
         transform="translate(-21.25,-45.3)"
         width="42.75"
         xlink:href="#shape1"
         id="use11"
         x="0"
         y="0" />
    </g>
    <g
       id="shape1"
       transform="translate(21.25,45.3)">
      <path
         d="m 10.75,-36.35 -2.95,-2.55 0.05,-0.95 -0.1,-0.9 0.65,-2.7 1,-0.65 q 1.2,-0.75 2.5,-1.05 l 1.3,1.8 0.1,2.75 0.95,1.4 -3.25,2.35 0.35,0.7 -0.6,-0.2"
         id="path14"
         inkscape:connector-curvature="0"
         style="fill:url(#gradient0);fill-rule:evenodd;stroke:none" />
      <path
         d="m 11.9,-45.15 q -1.3,0.3 -2.5,1.05 l -1,0.65 -0.65,2.7 0.1,0.9 -0.05,0.95 2.95,2.55 0.4,0.35 -0.25,0.45 -2.15,-1.4 V -37 H 8.7 l -0.6,0.15 -0.1,5.4 -0.85,8.6 q -0.9,5.9 -4.9,10.2 l -1.35,1.4 -0.7,-0.5 0.2,-0.25 1.75,-2.85 Q 5.65,-20.7 6.8,-27.4 L 6.85,-27.95 7,-29 l -0.5,-0.4 -0.9,-4.85 0.05,-0.55 1.7,-3.5 -1,-1.9 -0.9,-0.1 0.3,-3.1 1.95,-0.9 q 2.05,-0.85 4.2,-0.85 M 12.35,-5.45 11.2,-5.8 9.55,-16.55 9.5,-16.8 v -0.05 l 0.1,-0.05 0.45,-0.3 0.45,0.25 0.75,2.9 q 0.95,4.2 1.1,8.6 m -16,-0.9 -0.15,-1 1.75,-0.95 0.1,-0.3 -7.35,-8.2 0.15,-0.5 0.6,0.25 q 5.7,2.4 7.65,8.45 l -2.45,2.35 -0.3,-0.1 m -13,0.3 -0.6,-0.55 2.45,-1.6 q 0.1,-6.8 1.15,-13.5 l 0.95,-4.7 2.25,0.75 q -2.95,7.35 -2.8,18.4 l -3.4,1.2 m -4.5,-22.65 -0.1,-2.85 3.45,-0.6 0.8,1 3.75,-0.35 2.4,-5.3 -2.6,-1.95 -0.5,-0.5 0.15,-0.25 0.7,-1.05 0.15,-2.8 1.3,-1.85 1.7,-0.1 1.8,0.45 -2.5,1.05 -0.15,2 q -0.35,1.4 -1.65,1.8 l 2.6,2.5 0.05,0.4 1.3,0.1 0.9,0.1 0.3,1.3 -0.45,0.1 -0.3,-0.15 q -2.6,1.95 -4.05,5 l -0.35,0.15 q -1.4,1.7 -3.8,0.6 -1.3,-0.55 -2.3,-1.55 h -0.35 l -1.8,2.7 -0.45,0.05"
         id="path16"
         inkscape:connector-curvature="0"
         style="fill:#ffffff;fill-rule:evenodd;stroke:none" />
      <path
         d="m 10.75,-36.35 0.6,0.2 2.2,4.7 3.65,0.25 0.85,-1 3.45,0.65 -0.15,3.15 -2.15,0.8 -0.85,-0.55 -5.4,1.75 0.45,1.6 -5.4,-6.65 0.1,-5.4 0.6,-0.15 0.05,0.05 2.15,1.4 0.25,-0.45 -0.4,-0.35"
         id="path18"
         inkscape:connector-curvature="0"
         style="fill:url(#gradient1);fill-rule:evenodd;stroke:none" />
      <path
         d="m 5.65,-34.8 -0.05,0.55 -0.1,-0.2 v -0.05 l 0.15,-0.3 M 8.7,-37 h 0.05 v 0.05 L 8.7,-37 m 0.85,20.45 -0.05,-0.25 0.05,0.25 m -23,-22.2 -0.55,-0.4 0.2,-0.35 -0.15,0.25 0.5,0.5"
         id="path20"
         inkscape:connector-curvature="0"
         style="fill:#0099cc;fill-rule:evenodd;stroke:none" />
      <path
         d="m 0.9,-11.25 1.35,-1.4 q 4,-4.3 4.9,-10.2 l 0.85,-8.6 5.4,6.65 0.15,0.85 -3.95,7.05 -0.1,0.05 v 0.05 -0.1 l -7.2,7.85 -1.4,-2.2"
         id="path22"
         inkscape:connector-curvature="0"
         style="fill:url(#gradient2);fill-rule:evenodd;stroke:none" />
      <path
         d="m 13.55,-23.95 q 1.85,7.8 1.5,15.7 l 2.45,1.6 q -1,1 -2.2,1.35 l -1.25,0.3 -0.9,-0.2 -0.8,-0.25 q -0.15,-4.4 -1.1,-8.6 l -0.75,-2.9 -0.45,-0.25 -0.45,0.3 3.95,-7.05"
         id="path24"
         inkscape:connector-curvature="0"
         style="fill:url(#gradient3);fill-rule:evenodd;stroke:none" />
      <path
         d="m 0.2,-11.75 0.7,0.5 1.4,2.2 -0.25,0.2 0.15,0.5 0.35,0.15 -2.4,2.4 v 0.05 l -0.35,0.15 -0.85,0.3 -1.7,0.05 -0.85,-0.3 -0.05,-0.8 0.3,0.1 2.45,-2.35 q -1.95,-6.05 -7.65,-8.45 L -6.4,-26 q 1.4,7.6 6.5,14.4 l 0.1,-0.15"
         id="path26"
         inkscape:connector-curvature="0"
         style="fill:url(#gradient4);fill-rule:evenodd;stroke:none" />
      <path
         d="M 2.55,-8.2 4,-7.4 3.8,-5.55 2.95,-5.3 H 1.25 L 0.4,-5.65 0.15,-5.8 2.55,-8.2"
         id="path28"
         inkscape:connector-curvature="0"
         style="fill:url(#gradient5);fill-rule:evenodd;stroke:none" />
      <path
         d="m -8.15,-44.85 0.5,0.15 q 1.2,0.45 2.1,1.35 l 0.3,3.1 -0.9,0.1 -1,1.9 0.4,0.75 -1.75,0.5 -1.3,-0.1 -0.05,-0.4 -2.6,-2.5 q 1.3,-0.4 1.65,-1.8 l 0.15,-2 2.5,-1.05"
         id="path30"
         inkscape:connector-curvature="0"
         style="fill:url(#gradient6);fill-rule:evenodd;stroke:none" />
      <path
         d="m -12.85,-26.4 -5.3,-1.75 -0.85,0.6 -2.15,-0.8 v -0.35 l 0.45,-0.05 1.8,-2.7 h 0.35 q 1,1 2.3,1.55 2.4,1.1 3.8,-0.6 l 0.35,-0.15 q 1.45,-3.05 4.05,-5 l 0.3,0.15 0.45,-0.1 -0.3,-1.3 -0.9,-0.1 1.75,-0.5 1.45,3.05 -0.95,4.7 -6.6,3.35"
         id="path32"
         inkscape:connector-curvature="0"
         style="fill:url(#gradient7);fill-rule:evenodd;stroke:none" />
      <path
         d="m -9.3,-16.8 v 0.1 l -1.65,10.95 -2,0.55 -0.9,0.25 -1.2,-0.3 q -0.9,-0.25 -1.6,-0.8 l 3.4,-1.2 q -0.15,-11.05 2.8,-18.4 l -2.25,-0.75 h -0.15 l 6.6,-3.35 -0.05,0.35 -0.5,0.45 0.4,2.95 -2.15,8.95 -0.6,-0.25 -0.15,0.5"
         id="path34"
         inkscape:connector-curvature="0"
         style="fill:url(#gradient8);fill-rule:evenodd;stroke:none" />
      <path
         d="m 11.8,-43.3 0.5,0.45 q 0.75,0.95 0.1,2.15 l -0.1,0.35 -0.25,0.45 q -0.55,0.2 -1.1,0 -0.5,-0.15 -0.8,-0.5 l 0.1,-2.45 1.55,-0.45"
         id="path36"
         inkscape:connector-curvature="0"
         style="fill:url(#gradient9);fill-rule:evenodd;stroke:none" />
      <path
         d="m 11.05,-33.35 q 2.1,1.4 3.15,3.75 -1,2.35 -3.1,0.45 l -1.6,-1.65 -0.1,-1.8 0.2,-0.35 0.35,-0.35 1.1,-0.05"
         id="path38"
         inkscape:connector-curvature="0"
         style="fill:url(#gradient10);fill-rule:evenodd;stroke:none" />
      <path
         d="m 10.45,-25.35 0.6,0.5 q 0.7,4.6 -3.15,6.45 l -0.35,0.05 Q 6,-21.6 9,-24.25 q 0.65,-0.65 1.45,-1.1"
         id="path40"
         inkscape:connector-curvature="0"
         style="fill:url(#gradient11);fill-rule:evenodd;stroke:none" />
      <path
         d="m 13.05,-19.25 0.5,0.3 q 1.95,2.95 -0.75,5.2 l -0.3,0.1 -0.45,-0.65 q -1.3,-2.65 0.5,-4.55 l 0.5,-0.4"
         id="path42"
         inkscape:connector-curvature="0"
         style="fill:url(#gradient12);fill-rule:evenodd;stroke:none" />
      <path
         d="m 5.95,-14.3 q -0.7,1.7 -2.3,2.3 l -0.4,0.1 Q 3.1,-14.95 5.9,-15.45 l 0.3,0.65 -0.25,0.5"
         id="path44"
         inkscape:connector-curvature="0"
         style="fill:url(#gradient13);fill-rule:evenodd;stroke:none" />
      <path
         d="M -8.65,-43.2 H -7 q 0.8,0.3 1,1.1 v 0.75 q -1.8,2.3 -2.65,-0.75 v -1.1"
         id="path46"
         inkscape:connector-curvature="0"
         style="fill:url(#gradient14);fill-rule:evenodd;stroke:none" />
      <path
         d="m -6.85,-33.2 0.45,0.55 q -1,3.2 -4,3.15 l -0.4,-0.15 q -0.15,-1.8 1.35,-2.65 l 1.95,-1.25 0.4,0.15 0.25,0.2"
         id="path48"
         inkscape:connector-curvature="0"
         style="fill:url(#gradient15);fill-rule:evenodd;stroke:none" />
      <path
         d="m -7.65,-24.2 q 0.6,3.85 -2.7,5.15 l -0.55,-0.1 q -0.4,-3.7 2.9,-5.4 l 0.35,0.35"
         id="path50"
         inkscape:connector-curvature="0"
         style="fill:url(#gradient16);fill-rule:evenodd;stroke:none" />
      <path
         d="m -14.1,-26.5 q -0.9,-0.15 -1.55,-0.7 l -1.1,-0.85 -0.1,-0.35 -0.7,-0.35 0.8,-0.55 q 2,0.2 3.6,1.55 l -0.55,1.1 -0.4,0.15"
         id="path52"
         inkscape:connector-curvature="0"
         style="fill:url(#gradient17);fill-rule:evenodd;stroke:none" />
      <path
         d="m -11.5,-11 -0.25,0.15 q -1.85,-2.6 0.85,-4.7 l 0.6,1.4 q 0.35,2.05 -1.2,3.15"
         id="path54"
         inkscape:connector-curvature="0"
         style="fill:url(#gradient18);fill-rule:evenodd;stroke:none" />
      <path
         d="m -0.65,-10.45 -6.3,-7.1 0.5,-6.15 2.7,7.8 3.1,5.45 m -18.55,-17.8 -0.9,-0.85 2.3,-0.75 q 0.15,0.45 -0.05,0.8 -0.4,0.8 -1.35,0.8 m 10.8,0.55 0.1,0.8 -0.3,1 0.75,1.8 q -2.45,5.6 -2.55,12.2 0,1.6 -0.85,2.9 l -1.6,2.15 0.65,-1.35 q 0.8,-2.05 0.9,-4.3 l 0.1,-4.45 -1,2.9 q -0.05,-2.35 0.95,-4.4 l 1.6,-3 q 0.9,-1.55 0.25,-3.25 l -0.5,-1.3 -0.9,-0.25 2.4,-1.45 m 1.2,-5.35 -0.15,-1.65 q 1.4,1 0.5,3.05 -0.85,1.9 -2.6,3 -1.55,0.95 -3.4,1.1 -2,0.3 -3.35,-1 l 4.25,-0.4 q 2.3,-0.35 3.9,-2.25 0.65,-0.75 0.85,-1.85 m -2.1,-8.8 q -0.4,0.45 0.1,0.05 l -0.1,-0.05 m 0.4,-1.9 0.6,0.35 -0.55,0.6 0.05,0.65 1.25,1.1 -0.3,0.9 0.65,0.1 -0.2,0.75 -0.75,0.75 -0.2,-2.15 -0.45,-0.5 -1.2,-0.15 0.45,-0.9 -1.65,-0.65 2.3,-0.85 m 9.25,34.9 0.45,0.8 -2.9,2.35 2.45,-3.15 m 10.8,-6.6 0.25,-1.1 -1.15,-1.6 2.3,-2.8 -0.65,4.9 0.75,0.2 -0.25,2.35 0.95,-0.15 0.6,4.55 -0.65,0.55 v 1.1 l 1.6,0.65 -1.05,0.4 -1.45,-0.45 0.45,-3.1 -0.8,-1.55 0.2,-0.7 -0.75,-0.3 0.65,-2.75 -1,-0.2 M 8.1,-31.7 l 0.05,-3.5 0.95,-0.95 -0.3,1.2 0.5,0.35 -0.35,1.25 0.55,0.7 v 1.45 l 0.5,0.65 -0.95,1 0.75,0.3 -0.2,3.1 -0.6,0.5 -1.75,6.1 Q 5.95,-15.4 2.5,-11.4 L 1.85,-11.15 5.95,-18.7 5.6,-19.2 8.65,-31 8.1,-31.7 m 11.75,2.4 v 0.9 l -4.55,-0.05 -0.7,0.7 -1.55,0.15 -2.8,-2.45 -0.05,-0.65 3,1.95 4.7,-1.05 1.05,0.9 0.9,-0.4 M 11.1,-44.45 9.5,-42 l 1,-0.35 -0.15,2.2 0.85,0.4 -2.2,2.15 0.9,-1.25 -0.6,-1.3 0.45,-1.3 -1,-0.15 -0.25,-0.8 2.6,-2.05"
         id="path56"
         inkscape:connector-curvature="0"
         style="fill:#002b55;fill-rule:evenodd;stroke:none" />
    </g>
    <radialGradient
       cx="0"
       cy="0"
       gradientTransform="matrix(0.0056,0,0,0.0056,10.95,-40.65)"
       gradientUnits="userSpaceOnUse"
       id="gradient0"
       r="819.20001"
       spreadMethod="pad">
      <stop
         offset="0.22745098039215686"
         stop-color="#ffffff"
         id="stop59" />
      <stop
         offset="0.796078431372549"
         stop-color="#4969ab"
         id="stop61" />
    </radialGradient>
    <radialGradient
       cx="0"
       cy="0"
       gradientTransform="matrix(0.0109,0,0,0.0109,14.7,-30.9)"
       gradientUnits="userSpaceOnUse"
       id="gradient1"
       r="819.20001"
       spreadMethod="pad">
      <stop
         offset="0.22745098039215686"
         stop-color="#ffffff"
         id="stop64" />
      <stop
         offset="0.796078431372549"
         stop-color="#4969ab"
         id="stop66" />
    </radialGradient>
    <radialGradient
       cx="0"
       cy="0"
       gradientTransform="matrix(0.0149,0,0,0.0149,7.25,-20.25)"
       gradientUnits="userSpaceOnUse"
       id="gradient2"
       r="819.20001"
       spreadMethod="pad">
      <stop
         offset="0.22745098039215686"
         stop-color="#ffffff"
         id="stop69" />
      <stop
         offset="0.796078431372549"
         stop-color="#4969ab"
         id="stop71" />
    </radialGradient>
    <radialGradient
       cx="0"
       cy="0"
       gradientTransform="matrix(0.0117,0,0,0.0117,13.55,-14.45)"
       gradientUnits="userSpaceOnUse"
       id="gradient3"
       r="819.20001"
       spreadMethod="pad">
      <stop
         offset="0.22745098039215686"
         stop-color="#ffffff"
         id="stop74" />
      <stop
         offset="0.796078431372549"
         stop-color="#4969ab"
         id="stop76" />
    </radialGradient>
    <radialGradient
       cx="0"
       cy="0"
       gradientTransform="matrix(0.0134,0,0,0.0134,-3,-15.65)"
       gradientUnits="userSpaceOnUse"
       id="gradient4"
       r="819.20001"
       spreadMethod="pad">
      <stop
         offset="0.22745098039215686"
         stop-color="#ffffff"
         id="stop79" />
      <stop
         offset="0.796078431372549"
         stop-color="#4969ab"
         id="stop81" />
    </radialGradient>
    <radialGradient
       cx="0"
       cy="0"
       gradientTransform="matrix(0.0026,0,0,0.0026,2.05,-6.7)"
       gradientUnits="userSpaceOnUse"
       id="gradient5"
       r="819.20001"
       spreadMethod="pad">
      <stop
         offset="0.22745098039215686"
         stop-color="#ffffff"
         id="stop84" />
      <stop
         offset="0.796078431372549"
         stop-color="#4969ab"
         id="stop86" />
    </radialGradient>
    <radialGradient
       cx="0"
       cy="0"
       gradientTransform="matrix(0.0056,0,0,0.0056,-8.85,-40.9)"
       gradientUnits="userSpaceOnUse"
       id="gradient6"
       r="819.20001"
       spreadMethod="pad">
      <stop
         offset="0.22745098039215686"
         stop-color="#ffffff"
         id="stop89" />
      <stop
         offset="0.796078431372549"
         stop-color="#4969ab"
         id="stop91" />
    </radialGradient>
    <radialGradient
       cx="0"
       cy="0"
       gradientTransform="matrix(0.0107,0,0,0.0107,-13.25,-31.95)"
       gradientUnits="userSpaceOnUse"
       id="gradient7"
       r="819.20001"
       spreadMethod="pad">
      <stop
         offset="0.22745098039215686"
         stop-color="#ffffff"
         id="stop94" />
      <stop
         offset="0.796078431372549"
         stop-color="#4969ab"
         id="stop96" />
    </radialGradient>
    <radialGradient
       cx="0"
       cy="0"
       gradientTransform="matrix(0.0165,0,0,0.0165,-11.45,-17.35)"
       gradientUnits="userSpaceOnUse"
       id="gradient8"
       r="819.20001"
       spreadMethod="pad">
      <stop
         offset="0.22745098039215686"
         stop-color="#ffffff"
         id="stop99" />
      <stop
         offset="0.796078431372549"
         stop-color="#4969ab"
         id="stop101" />
    </radialGradient>
    <linearGradient
       gradientTransform="matrix(0.0015,0,0,0.0021,11.4,-41.6)"
       gradientUnits="userSpaceOnUse"
       id="gradient9"
       spreadMethod="pad"
       x1="-819.20001"
       x2="819.20001">
      <stop
         offset="0.40784313725490196"
         stop-color="#ffffff"
         id="stop104" />
      <stop
         offset="0.7725490196078432"
         stop-color="#6ba9f3"
         id="stop106" />
    </linearGradient>
    <linearGradient
       gradientTransform="matrix(0.0029,0,0,0.0031,11.75,-30.8)"
       gradientUnits="userSpaceOnUse"
       id="gradient10"
       spreadMethod="pad"
       x1="-819.20001"
       x2="819.20001">
      <stop
         offset="0.40784313725490196"
         stop-color="#ffffff"
         id="stop109" />
      <stop
         offset="0.7725490196078432"
         stop-color="#6ba9f3"
         id="stop111" />
    </linearGradient>
    <linearGradient
       gradientTransform="matrix(0.0025,0,0,0.0043,9.1,-21.85)"
       gradientUnits="userSpaceOnUse"
       id="gradient11"
       spreadMethod="pad"
       x1="-819.20001"
       x2="819.20001">
      <stop
         offset="0.40784313725490196"
         stop-color="#ffffff"
         id="stop114" />
      <stop
         offset="0.7725490196078432"
         stop-color="#6ba9f3"
         id="stop116" />
    </linearGradient>
    <linearGradient
       gradientTransform="matrix(0.0018,0,0,0.0034,12.95,-16.45)"
       gradientUnits="userSpaceOnUse"
       id="gradient12"
       spreadMethod="pad"
       x1="-819.20001"
       x2="819.20001">
      <stop
         offset="0.40784313725490196"
         stop-color="#ffffff"
         id="stop119" />
      <stop
         offset="0.7725490196078432"
         stop-color="#6ba9f3"
         id="stop121" />
    </linearGradient>
    <linearGradient
       gradientTransform="matrix(0.0018,0,0,0.0022,4.7,-13.7)"
       gradientUnits="userSpaceOnUse"
       id="gradient13"
       spreadMethod="pad"
       x1="-819.20001"
       x2="819.20001">
      <stop
         offset="0.40784313725490196"
         stop-color="#ffffff"
         id="stop124" />
      <stop
         offset="0.7725490196078432"
         stop-color="#6ba9f3"
         id="stop126" />
    </linearGradient>
    <linearGradient
       gradientTransform="matrix(0.0017,0,0,0.0017,-7.4,-41.8)"
       gradientUnits="userSpaceOnUse"
       id="gradient14"
       spreadMethod="pad"
       x1="-819.20001"
       x2="819.20001">
      <stop
         offset="0.40784313725490196"
         stop-color="#ffffff"
         id="stop129" />
      <stop
         offset="0.7725490196078432"
         stop-color="#6ba9f3"
         id="stop131" />
    </linearGradient>
    <linearGradient
       gradientTransform="matrix(0.0027,0,0,0.0025,-8.65,-31.55)"
       gradientUnits="userSpaceOnUse"
       id="gradient15"
       spreadMethod="pad"
       x1="-819.20001"
       x2="819.20001">
      <stop
         offset="0.40784313725490196"
         stop-color="#ffffff"
         id="stop134" />
      <stop
         offset="0.7725490196078432"
         stop-color="#6ba9f3"
         id="stop136" />
    </linearGradient>
    <linearGradient
       gradientTransform="matrix(0.0021,0,0,0.0034,-9.25,-21.8)"
       gradientUnits="userSpaceOnUse"
       id="gradient16"
       spreadMethod="pad"
       x1="-819.20001"
       x2="819.20001">
      <stop
         offset="0.40784313725490196"
         stop-color="#ffffff"
         id="stop139" />
      <stop
         offset="0.7725490196078432"
         stop-color="#6ba9f3"
         id="stop141" />
    </linearGradient>
    <linearGradient
       gradientTransform="matrix(0.0027,0,0,0.0017,-15.35,-27.95)"
       gradientUnits="userSpaceOnUse"
       id="gradient17"
       spreadMethod="pad"
       x1="-819.20001"
       x2="819.20001">
      <stop
         offset="0.40784313725490196"
         stop-color="#ffffff"
         id="stop144" />
      <stop
         offset="0.7725490196078432"
         stop-color="#6ba9f3"
         id="stop146" />
    </linearGradient>
    <linearGradient
       gradientTransform="matrix(0.0014,0,0,0.0029,-11.35,-13.25)"
       gradientUnits="userSpaceOnUse"
       id="gradient18"
       spreadMethod="pad"
       x1="-819.20001"
       x2="819.20001">
      <stop
         offset="0.40784313725490196"
         stop-color="#ffffff"
         id="stop149" />
      <stop
         offset="0.7725490196078432"
         stop-color="#6ba9f3"
         id="stop151" />
    </linearGradient>
  </defs>
</svg>
