<?xml version="1.0" encoding="UTF-8" standalone="no"?>
<svg xmlns:xlink="http://www.w3.org/1999/xlink" height="35.55px" width="17.75px" xmlns="http://www.w3.org/2000/svg">
  <g transform="matrix(1.0, 0.0, 0.0, 1.0, 8.75, 34.8)">
    <path d="M5.85 -10.35 Q7.9 -9.35 8.65 -7.25 9.45 -5.15 8.3 -3.2 7.1 -1.35 5.2 -0.35 L2.25 0.5 -2.05 0.75 Q-4.5 0.5 -6.75 -0.65 -8.95 -1.7 -8.7 -4.0 -8.45 -6.15 -6.95 -7.8 -5.25 -9.65 -3.0 -10.55 -0.9 -11.45 1.4 -11.45 3.8 -11.4 5.85 -10.35 M7.6 -6.85 L8.3 -6.25 7.5 -5.25 7.8 -4.55 8.55 -5.9 Q7.8 -8.05 5.95 -9.3 3.95 -10.65 1.6 -10.5 -0.8 -10.45 -3.25 -9.5 -5.5 -8.55 -6.95 -6.6 L-7.7 -5.05 -8.05 -3.2 -5.95 -1.95 Q-4.8 -1.4 -3.25 -1.3 L0.7 -1.2 Q2.5 -1.25 4.3 -2.15 L7.05 -3.85 6.65 -4.1 5.6 -3.75 Q6.5 -5.5 5.7 -7.45 L6.45 -6.85 7.6 -6.85" fill="#000000" fill-rule="evenodd" stroke="none"/>
    <path d="M7.6 -6.85 L6.45 -6.85 5.7 -7.45 Q6.5 -5.5 5.6 -3.75 L6.65 -4.1 7.05 -3.85 4.3 -2.15 Q2.5 -1.25 0.7 -1.2 L-3.25 -1.3 Q-4.8 -1.4 -5.95 -1.95 L-8.05 -3.2 -7.7 -5.05 -6.95 -6.6 Q-5.5 -8.55 -3.25 -9.5 -0.8 -10.45 1.6 -10.5 3.95 -10.65 5.95 -9.3 7.8 -8.05 8.55 -5.9 L7.8 -4.55 7.5 -5.25 8.3 -6.25 7.6 -6.85 M1.5 -8.25 Q-0.4 -8.0 -2.05 -8.8 L-2.4 -9.05 -2.45 -9.45 -2.15 -9.55 Q-3.5 -9.3 -4.65 -8.6 -6.5 -7.6 -7.35 -5.75 L-6.95 -4.95 -6.9 -4.85 Q-5.4 -4.2 -3.75 -4.15 L-1.9 -4.1 -2.55 -4.0 0.55 -4.5 Q3.9 -5.05 3.25 -8.2 L2.55 -8.95 Q2.35 -8.4 1.5 -8.25" fill="#26243c" fill-rule="evenodd" stroke="none"/>
    <path d="M1.5 -8.25 Q2.35 -8.4 2.55 -8.95 L3.25 -8.2 Q3.9 -5.05 0.55 -4.5 L-2.55 -4.0 -1.9 -4.1 -3.75 -4.15 Q-5.4 -4.2 -6.9 -4.85 L-6.95 -4.95 -7.35 -5.75 Q-6.5 -7.6 -4.65 -8.6 -3.5 -9.3 -2.15 -9.55 L-2.45 -9.45 -2.4 -9.05 -2.05 -8.8 Q-0.4 -8.0 1.5 -8.25 M-4.95 -6.95 L-5.4 -7.05 -5.85 -6.95 -6.05 -6.7 -5.85 -6.45 -5.4 -6.35 -4.95 -6.45 -4.75 -6.7 -4.95 -6.95 M-2.7 -7.9 L-1.75 -8.1 -3.3 -8.8 -4.3 -7.9 -6.05 -7.3 -3.95 -7.5 -3.5 -8.1 -2.7 -7.9 M-5.95 -6.4 L-6.25 -6.25 -6.4 -5.95 -6.25 -5.6 -5.95 -5.5 -5.6 -5.6 -5.5 -5.95 -5.6 -6.25 -5.95 -6.4" fill="#45406a" fill-rule="evenodd" stroke="none"/>
    <path d="M-5.95 -6.4 L-5.6 -6.25 -5.5 -5.95 -5.6 -5.6 -5.95 -5.5 -6.25 -5.6 -6.4 -5.95 -6.25 -6.25 -5.95 -6.4 M-2.7 -7.9 L-3.5 -8.1 -3.95 -7.5 -6.05 -7.3 -4.3 -7.9 -3.3 -8.8 -1.75 -8.1 -2.7 -7.9 M-4.95 -6.95 L-4.75 -6.7 -4.95 -6.45 -5.4 -6.35 -5.85 -6.45 -6.05 -6.7 -5.85 -6.95 -5.4 -7.05 -4.95 -6.95" fill="#d7d5e6" fill-rule="evenodd" stroke="none"/>
    <path d="M-0.6 -8.9 L-2.45 -9.6 -2.45 -25.75 -2.45 -25.85 0.5 -34.8 2.55 -25.65 2.55 -25.55 2.55 -9.6 0.6 -8.9 1.25 -9.3 1.25 -25.95 0.2 -32.4 -1.2 -26.1 -1.2 -9.3 -0.6 -8.9" fill="#000000" fill-rule="evenodd" stroke="none"/>
    <path d="M0.6 -8.9 L0.5 -8.9 -0.6 -8.9 -1.2 -9.3 -1.2 -26.1 0.2 -32.4 1.25 -25.95 1.25 -9.3 0.6 -8.9" fill="#f8e374" fill-rule="evenodd" stroke="none"/>
  </g>
</svg>
