<?xml version="1.0" encoding="UTF-8" standalone="no"?>
<svg xmlns:xlink="http://www.w3.org/1999/xlink" height="45.1px" width="45.05px" xmlns="http://www.w3.org/2000/svg">
  <g transform="matrix(1.0, 0.0, 0.0, 1.0, 16.5, 42.4)">
    <path d="M22.8 -11.95 Q22.5 -11.85 22.25 -12.1 L17.1 -15.95 16.85 -15.7 16.7 -15.65 18.1 -11.35 18.0 -10.75 18.05 -10.7 17.6 -10.25 Q17.3 -10.05 17.0 -10.25 L16.5 -10.55 13.1 -15.75 12.9 -11.25 12.7 -10.65 12.05 -10.4 Q11.8 -10.35 11.5 -10.55 L11.15 -11.1 9.95 -16.2 10.0 -16.25 9.95 -16.2 8.45 -12.7 8.05 -12.2 7.4 -12.15 7.45 -12.1 6.95 -12.5 6.9 -12.55 6.8 -13.15 7.15 -16.0 6.85 -16.3 5.95 -15.4 5.8 -15.35 6.35 -13.3 6.3 -12.75 5.85 -12.3 5.3 -12.25 5.25 -12.2 2.85 -12.9 2.8 -12.95 Q2.75 -12.9 2.65 -13.0 L-2.1 -7.75 -1.95 -7.1 -1.9 -6.75 -2.05 -6.4 -2.9 -4.95 -2.45 -4.5 -2.2 -3.95 -2.15 -3.9 Q-2.15 -3.5 -2.4 -3.25 -2.65 -3.0 -3.0 -2.95 L-5.2 -2.75 Q-5.45 -2.7 -5.7 -2.95 L-6.0 -3.05 -6.05 -2.8 Q-6.15 -2.5 -6.4 -2.45 L-15.2 2.55 -15.7 2.65 -15.75 2.7 -16.3 2.45 -16.5 1.95 -16.5 1.85 -16.4 1.35 -14.45 -2.1 -14.7 -2.35 -14.95 -3.0 -14.7 -3.65 -0.6 -17.75 0.05 -18.0 0.7 -17.95 1.45 -18.7 Q1.3 -18.95 1.3 -19.15 L1.55 -19.8 2.45 -20.7 2.15 -21.0 -0.7 -20.65 -1.3 -20.75 -1.35 -20.8 -1.75 -21.3 -1.65 -21.9 -1.2 -22.35 2.35 -23.8 -2.75 -25.0 Q-3.1 -25.05 -3.3 -25.35 L-3.5 -25.95 -3.15 -26.5 -2.6 -26.75 1.85 -27.0 -3.25 -30.3 -3.3 -30.35 -3.6 -30.85 -3.65 -30.9 -3.6 -31.45 -3.15 -31.9 -2.5 -31.95 1.8 -30.55 1.9 -30.75 1.85 -30.7 2.1 -30.95 -1.15 -35.3 -1.35 -35.4 -1.65 -35.8 -1.65 -36.3 -1.4 -36.75 -1.15 -37.0 -0.75 -37.2 -0.7 -37.25 -0.25 -37.2 0.15 -36.9 0.3 -36.75 5.5 -32.75 5.95 -33.0 4.5 -40.45 4.5 -40.55 4.6 -41.05 5.05 -41.5 5.75 -41.5 5.7 -41.45 6.15 -41.1 9.5 -34.45 9.7 -34.35 9.75 -34.3 10.0 -34.05 12.05 -41.7 Q12.1 -42.05 12.4 -42.25 L13.0 -42.35 Q13.35 -42.4 13.55 -42.1 L13.75 -41.5 13.8 -33.25 19.35 -39.6 19.85 -39.9 20.4 -39.75 20.5 -39.75 20.8 -39.25 20.85 -39.2 20.8 -38.65 18.15 -33.1 18.3 -33.15 18.8 -33.05 19.2 -32.65 19.3 -32.15 19.25 -32.0 24.8 -34.65 25.35 -34.7 25.9 -34.35 25.85 -34.3 26.05 -33.7 Q26.0 -33.35 25.75 -33.2 L19.4 -27.65 27.65 -27.6 28.25 -27.4 28.5 -26.85 28.4 -26.25 27.9 -25.85 20.2 -23.85 20.5 -23.55 20.6 -23.35 Q23.9 -21.65 27.25 -20.0 L27.65 -19.5 27.65 -19.6 27.65 -18.9 27.25 -18.4 26.65 -18.4 26.6 -18.35 19.15 -19.8 18.9 -19.35 23.5 -13.35 23.6 -12.75 23.35 -12.2 Q23.15 -12.0 22.8 -11.95" fill="#000000" fill-rule="evenodd" stroke="none"/>
    <path d="M-14.0 -1.0 L-13.15 -2.45 -13.9 -3.2 0.2 -17.3 1.25 -17.25 2.85 -18.85 2.35 -19.35 3.85 -20.85 7.0 -17.7 5.5 -16.2 5.0 -16.7 4.6 -16.3 4.15 -16.75 -12.6 0.0 -15.05 1.35 -0.45 -13.25 -1.1 -13.9 -14.0 -1.0 M-6.75 -4.15 L-6.65 -3.35 -8.55 -2.35 -6.75 -4.15 M-6.3 -4.6 L-4.9 -6.0 -2.95 -4.05 -5.1 -3.8 -6.3 -4.6 M-4.45 -6.45 L-2.9 -8.0 -2.65 -7.05 -3.55 -5.55 -4.45 -6.45 M3.15 -14.05 L4.95 -15.85 5.05 -15.75 5.6 -13.3 3.25 -13.95 3.15 -14.05" fill="#938828" fill-rule="evenodd" stroke="none"/>
    <path d="M7.0 -17.7 L3.85 -20.85 2.9 -21.8 3.3 -22.2 7.25 -22.75 6.75 -24.75 4.0 -23.7 3.3 -24.4 3.25 -24.75 3.15 -26.25 3.0 -27.6 5.7 -25.9 6.8 -28.3 2.85 -29.55 2.8 -30.5 3.6 -30.9 5.55 -31.85 7.1 -32.7 7.65 -30.05 10.45 -31.05 9.1 -33.7 9.3 -33.8 10.65 -32.75 12.9 -30.9 15.4 -29.3 16.95 -26.85 18.85 -24.55 19.9 -23.2 19.8 -23.0 17.15 -24.35 16.15 -21.55 18.8 -21.0 18.0 -19.4 17.0 -17.5 16.6 -16.7 15.6 -16.8 14.4 -20.7 12.0 -19.6 13.65 -16.95 12.4 -17.0 10.85 -17.15 10.5 -17.2 9.75 -17.95 10.9 -20.6 8.8 -21.2 8.3 -17.2 7.9 -16.8 7.0 -17.7 M16.8 -32.3 L18.55 -32.45 18.35 -30.75 Q16.9 -30.0 15.45 -29.35 L16.8 -32.3" fill="#ba0101" fill-rule="evenodd" stroke="none"/>
    <path d="M3.3 -22.2 L-0.7 -21.7 4.0 -23.7 6.75 -24.75 7.25 -22.75 3.3 -22.2" fill="url(#gradient0)" fill-rule="evenodd" stroke="none"/>
    <path d="M3.0 -27.6 L-2.65 -31.25 2.85 -29.55 6.8 -28.3 5.7 -25.9 3.0 -27.6" fill="url(#gradient1)" fill-rule="evenodd" stroke="none"/>
    <path d="M3.25 -24.75 L-2.4 -26.1 3.15 -26.25 3.25 -24.75 M3.6 -30.9 L-0.35 -36.05 -0.6 -36.3 -0.35 -36.55 -0.15 -36.25 5.55 -31.85 3.6 -30.9 M10.65 -32.75 L13.0 -41.7 13.1 -31.1 12.9 -30.9 10.65 -32.75 M17.2 -27.0 L27.8 -26.9 18.85 -24.55 16.95 -26.85 17.2 -27.0 M18.0 -19.4 L22.9 -13.0 17.0 -17.5 18.0 -19.4 M12.4 -17.0 L12.2 -11.5 10.85 -17.15 12.4 -17.0" fill="#760101" fill-rule="evenodd" stroke="none"/>
    <path d="M-14.0 -1.0 L-1.1 -13.9 -0.45 -13.25 -15.05 1.35 -15.5 1.6 -14.0 -1.0 M-12.6 0.0 L4.15 -16.75 4.6 -16.3 4.55 -16.25 4.95 -15.85 3.15 -14.05 2.75 -14.45 -2.95 -8.15 -2.9 -8.0 -4.45 -6.45 -4.85 -6.85 -5.3 -6.4 -4.9 -6.0 -6.3 -4.6 -6.8 -4.9 -6.75 -4.15 -8.55 -2.35 -12.6 0.0" fill="#645c1c" fill-rule="evenodd" stroke="none"/>
    <path d="M7.1 -32.7 L5.55 -40.85 9.1 -33.7 10.45 -31.05 7.65 -30.05 7.1 -32.7" fill="url(#gradient2)" fill-rule="evenodd" stroke="none"/>
    <path d="M13.1 -31.1 L20.15 -39.15 16.8 -32.3 15.45 -29.35 15.4 -29.3 12.9 -30.9 13.1 -31.1" fill="url(#gradient3)" fill-rule="evenodd" stroke="none"/>
    <path d="M15.6 -16.8 L17.35 -11.25 13.65 -16.95 12.0 -19.6 14.4 -20.7 15.6 -16.8" fill="url(#gradient4)" fill-rule="evenodd" stroke="none"/>
    <path d="M9.75 -17.95 L7.8 -13.2 8.3 -17.2 8.8 -21.2 10.9 -20.6 9.75 -17.95" fill="url(#gradient5)" fill-rule="evenodd" stroke="none"/>
    <path d="M18.35 -30.75 L25.3 -34.0 17.2 -27.0 16.95 -26.85 15.4 -29.3 15.45 -29.35 Q16.9 -30.0 18.35 -30.75" fill="url(#gradient6)" fill-rule="evenodd" stroke="none"/>
    <path d="M19.8 -23.0 L27.0 -19.4 18.8 -21.0 16.15 -21.55 17.15 -24.35 19.8 -23.0" fill="url(#gradient7)" fill-rule="evenodd" stroke="none"/>
  </g>
  <defs>
    <linearGradient gradientTransform="matrix(-0.0018, 5.0E-4, 3.0E-4, 0.0013, 5.15, -23.25)" gradientUnits="userSpaceOnUse" id="gradient0" spreadMethod="pad" x1="-819.2" x2="819.2">
      <stop offset="0.0" stop-color="#ba0101"/>
      <stop offset="1.0" stop-color="#fb0101"/>
    </linearGradient>
    <linearGradient gradientTransform="matrix(-0.0024, -0.0014, -8.0E-4, 0.0014, 4.1, -28.4)" gradientUnits="userSpaceOnUse" id="gradient1" spreadMethod="pad" x1="-819.2" x2="819.2">
      <stop offset="0.0" stop-color="#ba0101"/>
      <stop offset="1.0" stop-color="#fb0101"/>
    </linearGradient>
    <linearGradient gradientTransform="matrix(-0.0011, -0.0027, -0.0017, 7.0E-4, 8.0, -33.2)" gradientUnits="userSpaceOnUse" id="gradient2" spreadMethod="pad" x1="-819.2" x2="819.2">
      <stop offset="0.0" stop-color="#ba0101"/>
      <stop offset="1.0" stop-color="#fb0101"/>
    </linearGradient>
    <linearGradient gradientTransform="matrix(0.0017, -0.0023, -0.0015, -0.0011, 15.65, -32.05)" gradientUnits="userSpaceOnUse" id="gradient3" spreadMethod="pad" x1="-819.2" x2="819.2">
      <stop offset="0.0" stop-color="#ba0101"/>
      <stop offset="1.0" stop-color="#fb0101"/>
    </linearGradient>
    <linearGradient gradientTransform="matrix(0.0014, 0.0024, -0.0014, 8.0E-4, 14.5, -18.0)" gradientUnits="userSpaceOnUse" id="gradient4" spreadMethod="pad" x1="-819.2" x2="819.2">
      <stop offset="0.0" stop-color="#ba0101"/>
      <stop offset="1.0" stop-color="#fb0101"/>
    </linearGradient>
    <linearGradient gradientTransform="matrix(-5.0E-4, 0.0018, -0.0013, -3.0E-4, 9.35, -19.05)" gradientUnits="userSpaceOnUse" id="gradient5" spreadMethod="pad" x1="-819.2" x2="819.2">
      <stop offset="0.0" stop-color="#ba0101"/>
      <stop offset="1.0" stop-color="#fb0101"/>
    </linearGradient>
    <linearGradient gradientTransform="matrix(0.0023, -0.0017, 0.0011, 0.0015, 18.15, -29.55)" gradientUnits="userSpaceOnUse" id="gradient6" spreadMethod="pad" x1="-819.2" x2="819.2">
      <stop offset="0.0" stop-color="#ba0101"/>
      <stop offset="1.0" stop-color="#fb0101"/>
    </linearGradient>
    <linearGradient gradientTransform="matrix(0.0027, 0.0011, -7.0E-4, 0.0017, 19.3, -21.9)" gradientUnits="userSpaceOnUse" id="gradient7" spreadMethod="pad" x1="-819.2" x2="819.2">
      <stop offset="0.0" stop-color="#ba0101"/>
      <stop offset="1.0" stop-color="#fb0101"/>
    </linearGradient>
  </defs>
</svg>
