<?xml version="1.0" encoding="UTF-8" standalone="no"?>
<svg xmlns:xlink="http://www.w3.org/1999/xlink" height="36.65px" width="20.25px" xmlns="http://www.w3.org/2000/svg">
  <g transform="matrix(1.0, 0.0, 0.0, 1.0, 1.05, 0.95)">
    <path d="M12.6 4.3 Q12.75 8.6 13.45 12.15 L14.2 16.35 14.15 19.15 13.8 22.05 Q13.7 22.75 14.6 24.2 15.95 26.5 15.85 27.8 L15.85 27.85 Q15.75 30.05 18.9 33.0 L19.15 33.3 19.2 33.7 Q19.25 34.8 18.1 35.35 L16.0 35.7 15.5 35.55 15.1 35.15 15.0 34.8 Q14.9 35.3 13.05 35.3 10.05 35.2 4.1 35.4 L0.8 35.25 Q-1.25 34.8 -1.0 33.55 -1.1 33.0 1.3 28.1 L1.75 27.2 Q1.6 26.9 1.7 26.6 L1.95 26.1 2.35 25.7 Q3.35 23.05 3.35 21.25 3.35 19.9 3.7 17.15 L3.7 17.1 Q3.7 15.4 5.75 12.65 L5.8 12.65 Q6.9 11.15 7.6 5.35 L6.75 2.45 6.7 2.15 Q6.65 -0.85 9.5 -0.95 11.05 -1.1 11.9 0.65 12.5 1.8 12.6 4.3" fill="#003366" fill-rule="evenodd" stroke="none"/>
    <path d="M11.2 9.55 L10.55 5.4 10.4 4.55 10.45 5.2 9.8 1.35 Q9.5 1.3 9.5 1.6 L9.65 2.3 9.45 4.05 9.25 3.75 Q8.45 2.55 8.55 1.2 L8.3 1.2 8.15 2.6 Q8.15 3.7 8.8 4.4 L9.3 5.15 9.15 6.2 9.4 6.6 Q9.25 9.5 7.8 12.7 L6.6 15.6 5.3 18.35 5.95 17.55 5.45 19.45 4.15 25.1 3.2 26.25 Q4.35 23.3 4.35 21.25 4.35 19.95 4.7 17.25 4.7 15.75 6.55 13.25 7.85 11.7 8.6 5.4 L7.7 2.15 Q7.65 0.15 9.55 0.05 11.4 -0.05 11.6 4.35 11.75 8.7 12.5 12.35 L13.2 16.35 13.15 19.1 12.8 21.85 Q12.6 22.75 13.75 24.7 14.9 26.65 14.85 27.75 14.6 30.4 18.2 33.7 18.2 34.7 16.0 34.7 16.05 34.0 4.05 34.4 -0.05 34.5 0.0 33.55 0.0 33.05 2.2 28.55 L3.0 26.7 4.0 25.65 3.9 26.25 Q3.7 27.3 2.2 29.7 0.85 31.9 0.85 33.05 0.85 33.6 3.2 34.0 L3.2 33.95 Q1.55 33.75 1.55 33.0 1.55 31.65 4.9 26.25 L5.3 24.3 9.65 19.5 9.6 19.75 5.2 28.3 6.35 28.05 6.75 29.15 2.2 33.0 7.0 30.75 8.2 30.2 11.4 28.65 9.5 31.75 10.9 31.05 11.35 32.25 10.0 34.05 14.75 33.25 16.35 33.75 15.5 32.2 14.6 32.0 14.35 31.3 14.5 31.1 14.3 30.75 14.55 30.2 Q14.65 29.85 14.15 29.85 L14.45 29.4 13.95 28.75 14.45 27.35 13.45 27.5 12.9 24.75 11.8 24.55 11.8 24.35 12.05 23.65 11.85 23.35 11.85 21.85 12.4 21.05 11.75 19.55 12.25 16.95 12.3 16.95 12.3 16.9 12.55 15.35 11.7 14.2 12.3 13.2 11.45 12.8 11.2 9.65 11.2 9.55 M9.8 1.35 L9.8 1.25 9.8 1.35 M6.55 16.75 L10.15 12.35 6.4 19.95 9.45 18.55 5.45 23.5 6.2 19.5 6.55 16.75 M8.25 18.0 L8.25 18.05 8.2 18.05 8.25 18.0" fill="#0033cc" fill-rule="evenodd" stroke="none"/>
    <path d="M10.45 5.2 L10.4 4.55 10.55 5.4 11.2 9.55 10.9 9.35 10.85 8.85 10.65 7.05 10.45 5.2 M11.2 9.65 L11.45 12.8 12.3 13.2 11.7 14.2 12.55 15.35 12.3 16.9 12.15 16.65 12.2 16.45 12.0 16.25 11.6 16.6 Q10.4 16.9 9.65 19.5 L5.3 24.3 5.45 23.5 9.45 18.55 6.4 19.95 10.15 12.35 6.55 16.75 6.65 16.1 Q7.0 15.15 7.9 13.7 L7.95 13.9 Q8.6 13.6 9.85 12.2 11.15 10.6 11.2 9.65 M12.25 16.95 L11.75 19.55 12.4 21.05 11.85 21.85 11.85 23.35 11.75 23.35 Q10.65 23.75 10.25 24.8 L9.6 26.45 6.75 29.75 6.8 30.0 6.55 30.4 Q6.45 30.7 6.9 30.75 L7.0 30.75 2.2 33.0 6.75 29.15 6.35 28.05 5.2 28.3 9.6 19.75 9.3 20.95 Q7.5 24.0 6.9 25.5 L6.9 26.25 7.0 26.25 7.5 25.95 7.35 26.25 7.4 26.25 7.9 25.65 Q9.55 24.4 10.2 22.2 L10.65 21.4 Q11.15 20.55 11.1 19.1 11.6 17.9 12.25 16.95 M11.8 24.35 L11.8 24.55 12.9 24.75 13.45 27.5 14.45 27.35 13.95 28.75 14.45 29.4 14.15 29.85 14.1 29.95 14.05 30.0 11.7 32.65 Q11.7 33.05 12.1 33.05 L12.7 32.7 12.85 32.85 13.4 32.95 15.0 32.8 15.1 32.6 15.0 32.45 14.65 32.45 14.2 32.55 13.55 32.5 13.85 31.9 13.75 31.6 14.35 31.3 14.6 32.0 15.5 32.2 16.35 33.75 14.75 33.25 10.0 34.05 11.35 32.25 10.9 31.05 9.5 31.75 11.4 28.65 8.2 30.2 8.75 29.6 Q10.45 28.4 11.8 24.35 M4.0 25.65 L3.0 26.7 2.65 26.8 3.2 26.25 4.15 25.1 4.0 25.65 M5.95 17.55 L5.3 18.35 6.6 15.6 5.95 17.55 M9.4 6.6 L9.15 6.2 9.3 5.15 9.45 5.95 9.4 6.6 M9.45 4.05 L9.65 2.3 9.8 2.85 10.2 5.5 10.1 5.7 9.45 4.05 M9.8 1.35 L9.8 1.25 9.8 1.35 M10.0 15.6 L8.5 18.3 8.8 18.55 11.25 16.3 11.2 16.1 10.9 16.1 11.1 15.25 10.95 14.8 Q10.95 14.35 11.6 13.2 11.65 12.9 11.35 12.9 10.75 12.9 10.0 15.6 M8.25 18.0 L8.2 18.05 8.25 18.05 8.25 18.0 M13.35 27.15 L13.0 26.8 Q12.5 26.8 11.1 29.25 L11.4 29.5 12.55 28.35 13.35 27.15 M8.65 12.45 Q9.75 9.75 10.05 7.45 L10.6 9.75 Q10.6 10.3 9.25 11.75 L8.65 12.45" fill="#00ccff" fill-rule="evenodd" stroke="none"/>
    <path d="M11.2 9.55 L11.2 9.65 Q11.15 10.6 9.85 12.2 8.6 13.6 7.95 13.9 L7.9 13.7 Q7.0 15.15 6.65 16.1 L6.55 16.75 6.2 19.5 5.45 23.5 5.3 24.3 4.9 26.25 Q1.55 31.65 1.55 33.0 1.55 33.75 3.2 33.95 L3.2 34.0 Q0.85 33.6 0.85 33.05 0.85 31.9 2.2 29.7 3.7 27.3 3.9 26.25 L4.0 25.65 4.15 25.1 5.45 19.45 5.95 17.55 6.6 15.6 7.8 12.7 Q9.25 9.5 9.4 6.6 L9.45 5.95 9.3 5.15 8.8 4.4 Q8.15 3.7 8.15 2.6 L8.3 1.2 8.55 1.2 Q8.45 2.55 9.25 3.75 L9.45 4.05 10.1 5.7 10.2 5.5 9.8 2.85 9.65 2.3 9.5 1.6 Q9.5 1.3 9.8 1.35 L10.45 5.2 10.65 7.05 10.85 8.85 10.9 9.35 11.2 9.55 M12.3 16.9 L12.3 16.95 12.25 16.95 Q11.6 17.9 11.1 19.1 11.15 20.55 10.65 21.4 L10.2 22.2 Q9.55 24.4 7.9 25.65 L7.4 26.25 7.35 26.25 7.5 25.95 7.0 26.25 6.9 26.25 6.9 25.5 Q7.5 24.0 9.3 20.95 L9.6 19.75 9.65 19.5 Q10.4 16.9 11.6 16.6 L12.0 16.25 12.2 16.45 12.15 16.65 12.3 16.9 M11.85 23.35 L12.05 23.65 11.8 24.35 Q10.45 28.4 8.75 29.6 L8.2 30.2 7.0 30.75 6.9 30.75 Q6.45 30.7 6.55 30.4 L6.8 30.0 6.75 29.75 9.6 26.45 10.25 24.8 Q10.65 23.75 11.75 23.35 L11.85 23.35 M14.15 29.85 Q14.65 29.85 14.55 30.2 L14.3 30.75 14.5 31.1 14.35 31.3 13.75 31.6 13.85 31.9 13.55 32.5 14.2 32.55 14.65 32.45 15.0 32.45 15.1 32.6 15.0 32.8 13.4 32.95 12.85 32.85 12.7 32.7 12.1 33.05 Q11.7 33.05 11.7 32.65 L14.05 30.0 14.1 29.95 14.15 29.85 M10.0 15.6 Q10.75 12.9 11.35 12.9 11.65 12.9 11.6 13.2 10.95 14.35 10.95 14.8 L11.1 15.25 10.9 16.1 11.2 16.1 11.25 16.3 8.8 18.55 8.5 18.3 10.0 15.6 M8.65 12.45 L9.25 11.75 Q10.6 10.3 10.6 9.75 L10.05 7.45 Q9.75 9.75 8.65 12.45 M13.35 27.15 L12.55 28.35 11.4 29.5 11.1 29.25 Q12.5 26.8 13.0 26.8 L13.35 27.15" fill="#ffffff" fill-rule="evenodd" stroke="none"/>
  </g>
</svg>
