<?xml version="1.0" encoding="UTF-8" standalone="no"?>
<svg xmlns:xlink="http://www.w3.org/1999/xlink" height="24.95px" width="21.35px" xmlns="http://www.w3.org/2000/svg">
  <g transform="matrix(1.0, 0.0, 0.0, 1.0, 10.25, 25.05)">
    <path d="M7.1 -15.95 L7.5 -15.95 7.5 -15.4 7.45 -15.4 5.15 -0.7 2.35 -0.2 2.25 -0.15 2.25 -0.2 3.4 -5.1 3.45 -5.3 4.3 -8.2 4.4 -9.0 5.9 -15.4 5.95 -15.4 6.05 -15.95 6.4 -15.95 7.1 -15.95 M-2.15 -0.1 L-5.0 -0.6 -7.5 -15.4 -7.45 -15.4 -7.45 -15.6 -7.5 -15.95 -7.3 -15.95 -6.8 -15.95 -6.35 -15.95 -5.45 -15.95 -5.35 -15.4 -5.4 -15.4 -4.25 -10.05 -4.35 -9.3 -4.4 -8.8 -4.4 -8.7 -4.35 -8.4 -3.75 -5.4 -3.5 -4.8 -3.45 -4.75 -2.95 -4.3 -2.05 -0.15 -2.15 -0.1" fill="#ba0101" fill-rule="evenodd" stroke="none"/>
    <path d="M-1.35 -15.95 L0.7 -15.95 1.25 -15.95 2.55 -15.95 2.65 -15.95 3.2 -15.95 5.0 -15.95 5.5 -15.95 6.05 -15.95 5.95 -15.4 5.9 -15.4 4.4 -9.0 Q3.55 -12.85 0.6 -11.2 L0.0 -10.85 -0.45 -11.35 -1.4 -12.0 -2.05 -11.95 -2.15 -11.9 Q-3.2 -11.7 -3.85 -10.65 L-4.25 -10.05 -5.4 -15.4 -5.35 -15.4 -5.45 -15.95 -4.5 -15.95 -3.95 -15.95 -1.8 -15.95 -1.35 -15.95 M-2.95 -4.3 L-2.6 -4.2 Q-1.95 -4.25 -2.0 -4.85 L-2.7 -7.45 Q-2.85 -9.95 -1.8 -9.95 -1.3 -9.95 -0.95 -8.85 L-0.95 -8.4 -0.95 -8.35 Q-1.05 -7.75 -0.7 -7.45 -0.55 -7.2 0.0 -7.15 0.7 -7.05 0.95 -8.9 1.0 -9.95 2.0 -9.9 2.8 -9.85 2.75 -8.3 2.55 -6.6 1.25 -5.05 L1.1 -4.95 Q0.95 -4.5 1.25 -4.2 L1.85 -3.95 Q2.7 -3.95 3.4 -5.1 L2.25 -0.2 2.25 -0.15 -2.05 -0.15 -2.95 -4.3" fill="#db0202" fill-rule="evenodd" stroke="none"/>
    <path d="M-3.75 -5.4 L-2.9 -4.55 -2.5 -5.0 -3.3 -9.8 -2.7 -10.85 -2.25 -10.95 -1.25 -10.55 -0.95 -8.85 -0.75 -8.2 Q0.65 -11.0 2.95 -10.0 L3.35 -9.55 3.1 -5.25 3.4 -5.1 Q2.7 -3.95 1.85 -3.95 L1.25 -4.2 Q0.95 -4.5 1.1 -4.95 L1.25 -5.05 Q2.55 -6.6 2.75 -8.3 2.8 -9.85 2.0 -9.9 1.0 -9.95 0.95 -8.9 0.7 -7.05 0.0 -7.15 -0.55 -7.2 -0.7 -7.45 -1.05 -7.75 -0.95 -8.35 L-0.95 -8.4 -0.95 -8.85 Q-1.3 -9.95 -1.8 -9.95 -2.85 -9.95 -2.7 -7.45 L-2.0 -4.85 Q-1.95 -4.25 -2.6 -4.2 L-2.95 -4.3 -3.45 -4.75 -3.5 -4.8 -3.75 -5.4 M-4.35 -9.3 L-4.35 -8.4 -4.4 -8.7 -4.4 -8.8 -4.35 -9.3" fill="#ff9900" fill-rule="evenodd" stroke="none"/>
    <path d="M-0.8 -18.95 L-0.4 -18.95 1.25 -19.15 1.3 -19.75 1.1 -17.05 0.85 -16.8 0.7 -15.95 -1.35 -15.95 -0.8 -18.95 M4.65 -18.75 L4.65 -18.7 Q5.0 -17.8 5.0 -16.55 L5.0 -15.95 3.2 -15.95 3.35 -16.6 3.75 -17.9 Q3.85 -18.35 4.4 -18.65 L4.65 -18.75 M3.4 -5.1 L3.1 -5.25 3.35 -9.55 2.95 -10.0 Q0.65 -11.0 -0.75 -8.2 L-0.95 -8.85 -1.25 -10.55 -2.25 -10.95 -2.7 -10.85 -3.3 -9.8 -2.5 -5.0 -2.9 -4.55 -3.75 -5.4 -4.35 -8.4 -4.35 -9.3 -4.25 -10.05 -3.85 -10.65 Q-3.2 -11.7 -2.15 -11.9 L-2.05 -11.95 -1.4 -12.0 -0.45 -11.35 0.0 -10.85 0.6 -11.2 Q3.55 -12.85 4.4 -9.0 L4.3 -8.2 3.45 -5.3 3.4 -5.1 M-6.95 -19.7 Q-4.8 -19.75 -4.2 -20.4 L-4.5 -15.95 -5.45 -15.95 -6.35 -15.95 -6.95 -19.7" fill="#ffcc00" fill-rule="evenodd" stroke="none"/>
    <path d="M-7.35 -19.3 L-7.55 -20.6 -7.5 -20.9 -7.3 -21.1 -6.8 -21.45 -6.6 -21.55 -5.65 -21.7 -4.55 -21.8 -3.65 -20.95 -3.95 -15.95 -4.5 -15.95 -4.2 -20.4 -4.2 -20.8 -4.75 -21.35 -6.6 -21.05 -7.1 -20.7 -6.95 -19.7 -6.35 -15.95 -6.8 -15.95 -7.35 -19.3 M1.3 -20.65 L1.6 -20.6 1.8 -20.4 1.65 -16.9 1.4 -16.55 1.25 -15.95 0.7 -15.95 0.85 -16.8 1.1 -17.05 1.3 -19.75 1.3 -20.15 -0.65 -19.9 -0.8 -18.95 -1.35 -15.95 -1.8 -15.95 -0.85 -20.25 1.3 -20.65 M5.0 -15.95 L5.0 -16.55 Q5.0 -17.8 4.65 -18.7 L4.65 -18.75 Q4.3 -19.6 3.8 -19.6 3.3 -19.6 2.95 -18.7 2.6 -17.8 2.6 -16.55 L2.65 -15.95 2.55 -15.95 2.55 -18.85 2.85 -19.4 3.85 -20.1 5.35 -18.3 5.5 -17.65 5.55 -16.8 5.55 -16.55 5.55 -16.4 5.55 -16.3 5.5 -15.95 5.0 -15.95" fill="#c17402" fill-rule="evenodd" stroke="none"/>
    <path d="M1.3 -19.75 L1.25 -19.15 -0.4 -18.95 -0.8 -18.95 -0.65 -19.9 1.3 -20.15 1.3 -19.75 M2.65 -15.95 L2.6 -16.55 Q2.6 -17.8 2.95 -18.7 3.3 -19.6 3.8 -19.6 4.3 -19.6 4.65 -18.75 L4.4 -18.65 Q3.85 -18.35 3.75 -17.9 L3.35 -16.6 3.2 -15.95 2.65 -15.95 M-6.95 -19.7 L-7.1 -20.7 -6.6 -21.05 -4.75 -21.35 -4.2 -20.8 -4.2 -20.4 Q-4.8 -19.75 -6.95 -19.7" fill="#ffff00" fill-rule="evenodd" stroke="none"/>
    <path d="M-7.3 -15.95 L-9.35 -17.8 -8.6 -18.9 -7.35 -19.3 -6.8 -15.95 -7.3 -15.95 M-5.65 -21.7 L-5.65 -23.75 -5.0 -23.75 -3.75 -23.9 -3.05 -23.65 Q-2.0 -23.5 -1.85 -22.4 -1.75 -21.55 -1.9 -20.75 L-1.1 -22.5 1.25 -22.55 1.3 -20.65 -0.85 -20.25 -1.8 -15.95 -3.95 -15.95 -3.65 -20.95 -4.55 -21.8 -5.65 -21.7 M1.8 -20.4 L2.15 -20.9 2.4 -21.8 4.25 -21.75 4.4 -20.15 6.1 -22.85 7.55 -22.5 6.95 -20.7 5.4 -18.15 6.0 -18.6 Q7.15 -19.75 8.25 -19.75 L9.95 -18.2 Q9.95 -18.0 8.6 -17.45 L7.1 -16.5 6.4 -15.95 6.05 -15.95 5.5 -15.95 5.55 -16.3 5.55 -16.4 5.55 -16.55 5.55 -16.8 5.5 -17.65 5.4 -18.15 5.35 -18.3 3.85 -20.1 2.85 -19.4 2.55 -18.85 2.55 -15.95 1.25 -15.95 1.4 -16.55 1.65 -16.9 1.8 -20.4" fill="#eea600" fill-rule="evenodd" stroke="none"/>
    <path d="M-7.45 -15.6 L-9.55 -17.5 -9.75 -17.85 -9.65 -18.15 -8.9 -19.25 -8.65 -19.45 -7.8 -19.75 -7.95 -20.65 -7.85 -21.2 -7.5 -21.6 -7.0 -21.95 -7.05 -21.95 -6.65 -22.1 -6.6 -22.15 -6.05 -22.2 -6.05 -23.85 -5.9 -24.2 -5.55 -24.35 -4.95 -24.35 -3.7 -24.5 -3.45 -24.45 -2.85 -24.25 Q-1.65 -24.1 -1.3 -22.95 L-1.25 -23.0 -1.0 -23.1 1.35 -23.15 1.7 -23.0 1.85 -22.65 1.9 -21.55 2.05 -22.0 2.2 -22.3 2.55 -22.4 4.4 -22.35 4.7 -22.2 4.85 -21.9 4.85 -21.75 5.8 -23.2 6.0 -23.4 6.35 -23.4 7.8 -23.05 8.0 -22.95 8.15 -22.7 8.15 -22.45 7.55 -20.65 7.5 -20.55 7.2 -20.1 8.35 -20.35 8.7 -20.2 10.4 -18.65 10.5 -18.5 10.55 -18.3 Q10.7 -17.8 8.9 -17.05 L7.45 -16.15 7.1 -15.95 6.4 -15.95 7.1 -16.5 8.6 -17.45 Q9.95 -18.0 9.95 -18.2 L8.25 -19.75 Q7.15 -19.75 6.0 -18.6 L5.4 -18.15 6.95 -20.7 7.55 -22.5 6.1 -22.85 4.4 -20.15 4.25 -21.75 2.4 -21.8 2.15 -20.9 1.8 -20.4 1.6 -20.6 1.3 -20.65 1.25 -22.55 -1.1 -22.5 -1.9 -20.75 Q-1.75 -21.55 -1.85 -22.4 -2.0 -23.5 -3.05 -23.65 L-3.75 -23.9 -5.0 -23.75 -5.65 -23.75 -5.65 -21.7 -6.6 -21.55 -6.8 -21.45 -7.3 -21.1 -7.5 -20.9 -7.55 -20.6 -7.35 -19.3 -8.6 -18.9 -9.35 -17.8 -7.3 -15.95 -7.5 -15.95 -7.45 -15.6 M1.8 -21.25 L1.8 -21.2 1.9 -21.15 1.9 -21.55 1.8 -21.25 1.85 -21.3 1.8 -21.2 1.8 -21.25 M5.5 -17.65 L5.35 -18.3 5.4 -18.15 5.5 -17.65" fill="#995b00" fill-rule="evenodd" stroke="none"/>
    <path d="M7.1 -15.95 L7.45 -16.15 8.9 -17.05 Q10.7 -17.8 10.55 -18.3 L10.5 -18.5 10.4 -18.65 8.7 -20.2 8.35 -20.35 7.2 -20.1 7.5 -20.55 7.55 -20.65 8.15 -22.45 8.15 -22.7 8.0 -22.95 7.8 -23.05 6.35 -23.4 6.0 -23.4 5.8 -23.2 4.85 -21.75 4.85 -21.9 4.7 -22.2 4.4 -22.35 2.55 -22.4 2.2 -22.3 2.05 -22.0 1.9 -21.55 1.85 -22.65 1.7 -23.0 1.35 -23.15 -1.0 -23.1 -1.25 -23.0 -1.3 -22.95 Q-1.65 -24.1 -2.85 -24.25 L-3.45 -24.45 -3.7 -24.5 -4.95 -24.35 -5.55 -24.35 -5.9 -24.2 -6.05 -23.85 -6.05 -22.2 -6.6 -22.15 -6.65 -22.1 -7.05 -21.95 -7.0 -21.95 -7.5 -21.6 -7.85 -21.2 -7.95 -20.65 -7.8 -19.75 -8.65 -19.45 -8.9 -19.25 -9.65 -18.15 -9.75 -17.85 -9.55 -17.5 -7.45 -15.6 -7.45 -15.4 -7.5 -15.4 -5.0 -0.6 -2.15 -0.1 -5.55 -0.25 -5.6 -0.3 -5.75 -0.7 -8.5 -15.4 -8.45 -15.4 -8.5 -15.9 -9.9 -17.2 -10.25 -17.8 -10.05 -18.5 -10.1 -18.5 -9.35 -19.6 -9.3 -19.6 Q-9.15 -19.9 -8.8 -20.0 L-8.35 -20.15 -8.45 -20.6 -8.45 -20.7 -8.3 -21.5 -8.2 -21.6 -7.75 -22.1 -7.55 -22.15 -7.5 -22.15 -7.45 -22.25 -7.35 -22.4 -6.8 -22.65 -6.65 -22.7 -6.55 -22.7 -6.55 -23.9 -6.25 -24.6 -5.55 -24.9 -5.0 -24.9 -3.75 -25.05 -3.3 -25.0 -2.75 -24.8 Q-1.55 -24.6 -1.0 -23.65 L1.35 -23.7 2.05 -23.4 2.35 -22.9 2.55 -22.95 4.4 -22.9 4.85 -22.75 5.35 -23.55 5.35 -23.5 5.8 -23.9 5.85 -23.95 6.5 -23.95 7.9 -23.6 8.35 -23.35 8.65 -22.85 8.6 -22.9 8.6 -22.35 8.15 -20.9 8.35 -20.9 9.05 -20.65 9.0 -20.65 10.7 -19.1 10.75 -19.1 10.95 -18.75 11.05 -18.45 Q11.35 -17.6 9.2 -16.7 L8.5 -16.25 8.5 -16.05 8.45 -15.4 5.95 -0.8 5.65 -0.35 5.6 -0.3 2.35 -0.2 5.15 -0.7 7.45 -15.4 7.5 -15.4 7.5 -15.95 7.1 -15.95 M1.8 -21.25 L1.8 -21.2 1.85 -21.3 1.8 -21.25 1.9 -21.55 1.9 -21.15 1.8 -21.2 1.8 -21.25" fill="#000000" fill-rule="evenodd" stroke="none"/>
  </g>
</svg>
