<?xml version="1.0" encoding="UTF-8" standalone="no"?>
<svg xmlns:xlink="http://www.w3.org/1999/xlink" height="28.1px" width="44.95px" xmlns="http://www.w3.org/2000/svg">
  <g transform="matrix(1.0, 0.0, 0.0, 1.0, 24.4, 24.3)">
    <path d="M10.55 -19.4 L10.75 -18.95 10.55 -18.5 10.1 -18.3 9.65 -18.5 9.45 -18.95 9.65 -19.4 10.1 -19.6 10.55 -19.4 M0.95 -20.3 L1.25 -20.4 2.2 -19.65 1.8 -19.4 Q0.4 -19.4 0.95 -20.3 M6.4 -20.25 Q6.6 -20.45 6.95 -20.45 L7.55 -20.25 7.75 -19.85 7.55 -19.4 6.95 -19.25 Q6.6 -19.25 6.4 -19.4 L6.15 -19.85 6.4 -20.25 M3.75 -19.7 Q4.3 -20.15 4.8 -19.85 L4.95 -18.8 3.75 -19.7 M5.25 -9.8 Q5.35 -10.0 5.55 -10.0 L5.95 -9.6 6.05 -9.55 6.05 -9.5 Q6.55 -8.7 5.85 -8.35 L5.65 -8.35 Q5.2 -8.65 5.15 -9.25 L5.25 -9.8 M8.55 -13.3 L8.65 -13.3 Q9.55 -12.8 9.0 -12.0 L8.75 -11.9 Q7.65 -12.2 8.3 -13.15 8.4 -13.3 8.55 -13.3 M7.75 -17.5 Q8.75 -17.3 8.3 -16.5 L7.2 -17.25 7.75 -17.5 M3.2 -15.65 L3.35 -15.75 Q4.15 -15.6 4.3 -14.65 L4.4 -14.3 Q4.8 -13.25 3.7 -13.15 L3.5 -13.25 Q2.35 -14.35 3.2 -15.65 M0.6 -8.6 L0.1 -8.6 0.1 -9.05 0.6 -9.05 0.6 -8.6 M11.6 -8.5 Q11.4 -8.1 10.95 -8.4 L11.05 -10.0 Q12.15 -9.45 11.6 -8.5 M-0.4 -15.05 Q-0.7 -14.45 -1.05 -15.0 L-1.2 -15.4 Q-1.15 -15.95 -0.65 -16.1 -0.1 -15.75 -0.4 -15.05 M-3.55 -14.05 L-3.95 -14.1 Q-4.15 -14.4 -4.0 -14.8 -3.9 -14.9 -3.95 -15.0 L-3.6 -15.25 -3.55 -15.3 -3.5 -15.3 Q-2.85 -14.8 -3.55 -14.05 M-6.65 -14.6 Q-7.2 -15.1 -6.55 -15.35 -5.55 -15.0 -6.35 -14.55 L-6.65 -14.6 M-3.45 -9.35 L-3.25 -9.45 -2.9 -9.2 -2.85 -9.15 -2.85 -8.9 -2.95 -8.75 -3.5 -8.85 -3.5 -9.15 -3.45 -9.35" fill="#fff2f2" fill-rule="evenodd" stroke="none"/>
    <path d="M10.55 -19.4 L10.1 -19.6 9.65 -19.4 9.45 -18.95 9.65 -18.5 10.1 -18.3 10.55 -18.5 10.75 -18.95 10.55 -19.4 M10.35 -15.0 Q10.05 -12.6 12.45 -12.0 14.2 -11.55 15.1 -13.1 16.95 -16.35 13.45 -17.65 L12.95 -17.55 Q10.6 -17.25 10.35 -15.0 M1.25 -20.4 L4.75 -20.7 7.0 -20.55 9.05 -20.3 Q11.25 -19.95 13.0 -18.7 L16.0 -16.15 Q17.6 -14.55 17.5 -12.35 L17.2 -10.95 16.1 -8.65 17.0 -8.65 18.2 -10.3 19.65 -8.9 16.55 -5.5 7.15 -2.75 6.7 -5.25 6.2 -2.7 4.2 -2.65 3.5 -9.0 4.75 -11.2 4.3 -11.6 2.7 -9.4 1.95 -10.2 1.6 -10.6 1.3 -11.15 1.05 -11.85 0.9 -12.65 1.05 -15.6 -0.6 -10.3 2.55 -8.6 1.9 -2.8 0.85 -2.95 0.15 -4.5 1.45 -8.1 -1.25 -4.65 -6.4 -11.6 -4.95 -13.4 -6.8 -12.55 -7.55 -10.85 -9.0 -9.8 -9.75 -12.65 -9.75 -12.7 Q-8.7 -14.6 -7.1 -16.05 -5.85 -17.15 -4.45 -18.05 L-1.75 -19.35 0.95 -20.3 Q0.4 -19.4 1.8 -19.4 L2.2 -19.65 1.25 -20.4 M-22.05 -5.2 L-23.25 -5.2 Q-24.2 -6.7 -23.8 -8.35 L-23.25 -9.75 Q-23.65 -13.3 -21.55 -16.35 L-20.5 -17.95 -16.15 -17.9 -14.15 -14.55 -18.8 -17.1 -14.1 -12.1 -21.4 -13.9 -14.45 -10.5 Q-14.75 -10.3 -15.05 -10.2 L-16.3 -9.6 -21.6 -9.5 -14.4 -8.95 -15.3 -7.85 -20.35 -5.3 -14.8 -7.6 -15.05 -5.65 -19.25 -2.45 -15.45 -4.2 -18.4 -1.2 Q-19.4 -1.75 -20.25 -2.45 -21.7 -3.55 -22.05 -5.2 M6.4 -20.25 L6.15 -19.85 6.4 -19.4 Q6.6 -19.25 6.95 -19.25 L7.55 -19.4 7.75 -19.85 7.55 -20.25 6.95 -20.45 Q6.6 -20.45 6.4 -20.25 M0.5 -21.9 L0.15 -21.85 0.5 -21.9 Q0.25 -21.75 -0.2 -21.9 L-1.9 -23.1 Q2.75 -23.55 4.25 -22.65 L0.5 -21.9 M3.75 -19.7 L4.95 -18.8 4.8 -19.85 Q4.3 -20.15 3.75 -19.7 M3.2 -15.65 Q2.35 -14.35 3.5 -13.25 L3.7 -13.15 Q4.8 -13.25 4.4 -14.3 L4.3 -14.65 Q4.15 -15.6 3.35 -15.75 L3.2 -15.65 M7.75 -17.5 L7.2 -17.25 8.3 -16.5 Q8.75 -17.3 7.75 -17.5 M8.55 -13.3 Q8.4 -13.3 8.3 -13.15 7.65 -12.2 8.75 -11.9 L9.0 -12.0 Q9.55 -12.8 8.65 -13.3 L8.55 -13.3 M5.25 -9.8 L5.15 -9.25 Q5.2 -8.65 5.65 -8.35 L5.85 -8.35 Q6.55 -8.7 6.05 -9.5 L6.05 -9.55 5.95 -9.6 5.55 -10.0 Q5.35 -10.0 5.25 -9.8 M6.25 -9.65 L6.45 -9.35 6.7 -13.3 Q5.6 -11.4 6.25 -9.65 M0.6 -8.6 L0.6 -9.05 0.1 -9.05 0.1 -8.6 0.6 -8.6 M9.4 -5.4 L9.75 -5.1 Q9.1 -7.65 10.05 -9.95 7.45 -8.1 9.4 -5.4 M11.6 -8.5 Q12.15 -9.45 11.05 -10.0 L10.95 -8.4 Q11.4 -8.1 11.6 -8.5 M0.85 1.85 L0.2 2.5 -0.65 2.4 -1.5 1.75 -1.6 1.15 -0.6 0.85 0.85 1.85 M3.5 2.5 L2.75 2.7 Q2.3 2.7 2.0 2.5 L1.7 1.95 Q1.7 1.65 2.0 1.45 2.3 1.2 2.75 1.2 3.2 1.2 3.5 1.45 L3.8 1.95 3.5 2.5 M6.5 1.65 L5.95 2.05 5.0 1.55 6.1 1.1 6.5 1.65 M-6.65 -14.6 L-6.35 -14.55 Q-5.55 -15.0 -6.55 -15.35 -7.2 -15.1 -6.65 -14.6 M-3.55 -14.05 Q-2.85 -14.8 -3.5 -15.3 L-3.55 -15.3 -3.6 -15.25 -3.95 -15.0 Q-3.9 -14.9 -4.0 -14.8 -4.15 -14.4 -3.95 -14.1 L-3.55 -14.05 M-0.4 -15.05 Q-0.1 -15.75 -0.65 -16.1 -1.15 -15.95 -1.2 -15.4 L-1.05 -15.0 Q-0.7 -14.45 -0.4 -15.05 M-1.7 -15.2 L-2.2 -15.5 Q-3.05 -14.55 -3.15 -13.3 L-3.4 -9.75 -2.9 -10.15 -1.65 -6.3 -1.0 -6.3 -2.4 -14.65 -1.7 -15.2 M-3.45 -9.35 L-3.5 -9.15 -3.5 -8.85 -2.95 -8.75 -2.85 -8.9 -2.85 -9.15 -2.9 -9.2 -3.25 -9.45 -3.45 -9.35 M-6.85 -8.05 L-4.45 -4.3 -6.9 -5.65 -6.85 -8.05" fill="#fe6767" fill-rule="evenodd" stroke="none"/>
    <path d="M11.1 -20.8 L14.55 -18.6 16.6 -16.75 Q17.95 -15.2 18.5 -13.05 L19.3 -10.95 20.55 -9.2 19.15 -6.55 Q18.25 -4.8 16.4 -3.6 L10.7 0.1 10.35 1.3 10.1 1.5 Q8.25 2.4 6.45 2.95 L2.4 3.8 0.55 3.7 -1.3 3.05 -2.65 2.75 -2.8 -0.2 -9.9 -6.7 -13.05 -2.85 Q-14.15 -1.55 -16.1 -0.65 L-17.45 -0.15 -18.6 -0.15 -19.75 -0.35 -20.45 -0.6 Q-21.25 -0.95 -21.75 -1.55 L-22.7 -3.25 -23.1 -4.35 -24.25 -4.95 -24.35 -6.45 -24.35 -9.7 -23.9 -12.2 -23.25 -14.25 Q-22.85 -15.45 -22.75 -16.75 L-19.85 -19.35 -17.5 -18.6 Q-15.4 -18.1 -13.9 -16.8 L-10.3 -13.4 -3.15 -20.0 -2.6 -24.0 0.95 -24.3 Q3.25 -24.0 5.35 -23.15 L11.1 -20.8 M10.35 -15.0 Q10.6 -17.25 12.95 -17.55 L13.45 -17.65 Q16.95 -16.35 15.1 -13.1 14.2 -11.55 12.45 -12.0 10.05 -12.6 10.35 -15.0 M14.2 -14.55 Q15.95 -16.0 13.7 -16.75 12.05 -16.3 12.75 -14.85 13.3 -13.8 14.2 -14.55 M16.55 -5.5 L19.65 -8.9 18.2 -10.3 17.0 -8.65 16.1 -8.65 17.2 -10.95 17.5 -12.35 Q17.6 -14.55 16.0 -16.15 L13.0 -18.7 Q11.25 -19.95 9.05 -20.3 L7.0 -20.55 4.75 -20.7 1.25 -20.4 0.95 -20.3 -1.75 -19.35 -4.45 -18.05 Q-5.85 -17.15 -7.1 -16.05 -8.7 -14.6 -9.75 -12.7 L-9.75 -12.65 -10.0 -10.1 Q-10.1 -11.85 -11.05 -13.3 L-11.7 -14.1 -16.15 -17.9 -20.5 -17.95 -21.55 -16.35 Q-23.65 -13.3 -23.25 -9.75 L-23.8 -8.35 Q-24.2 -6.7 -23.25 -5.2 L-22.05 -5.2 -22.6 -3.8 -19.65 -0.75 -15.75 -2.15 Q-13.8 -2.85 -12.55 -4.35 -11.05 -6.15 -10.3 -8.35 L-10.0 -9.25 -9.7 -8.45 Q-8.5 -5.9 -6.4 -4.25 L-4.05 -2.4 -1.9 -0.95 -0.35 -1.8 -2.65 1.7 -1.75 2.2 0.95 2.85 6.7 2.4 7.9 1.85 Q9.5 1.1 9.8 -0.7 L9.95 -1.95 10.6 -1.05 16.55 -5.5 M-1.9 -23.1 L-1.9 -20.55 1.8 -20.8 Q5.0 -21.1 7.4 -21.85 4.8 -23.35 1.8 -23.5 L-1.9 -23.1" fill="#000000" fill-rule="evenodd" stroke="none"/>
    <path d="M14.2 -14.55 Q13.3 -13.8 12.75 -14.85 12.05 -16.3 13.7 -16.75 15.95 -16.0 14.2 -14.55" fill="#e7e7e7" fill-rule="evenodd" stroke="none"/>
    <path d="M0.5 -21.9 L0.15 -21.85 0.5 -21.9" fill="#6364cb" fill-rule="evenodd" stroke="none"/>
    <path d="M16.55 -5.5 L10.6 -1.05 9.95 -1.95 9.8 -0.7 Q9.5 1.1 7.9 1.85 L6.7 2.4 0.95 2.85 -1.75 2.2 -2.65 1.7 -0.35 -1.8 -1.9 -0.95 -4.05 -2.4 -6.4 -4.25 Q-8.5 -5.9 -9.7 -8.45 L-10.0 -9.25 -10.3 -8.35 Q-11.05 -6.15 -12.55 -4.35 -13.8 -2.85 -15.75 -2.15 L-19.65 -0.75 -22.6 -3.8 -22.05 -5.2 Q-21.7 -3.55 -20.25 -2.45 -19.4 -1.75 -18.4 -1.2 L-15.45 -4.2 -19.25 -2.45 -15.05 -5.65 -14.8 -7.6 -20.35 -5.3 -15.3 -7.85 -14.4 -8.95 -21.6 -9.5 -16.3 -9.6 -15.05 -10.2 Q-14.75 -10.3 -14.45 -10.5 L-21.4 -13.9 -14.1 -12.1 -18.8 -17.1 -14.15 -14.55 -16.15 -17.9 -11.7 -14.1 -11.05 -13.3 Q-10.1 -11.85 -10.0 -10.1 L-9.75 -12.65 -9.0 -9.8 -7.55 -10.85 -6.8 -12.55 -4.95 -13.4 -6.4 -11.6 -1.25 -4.65 1.45 -8.1 0.15 -4.5 0.85 -2.95 1.9 -2.8 2.55 -8.6 -0.6 -10.3 1.05 -15.6 0.9 -12.65 1.05 -11.85 1.3 -11.15 1.6 -10.6 1.95 -10.2 2.7 -9.4 4.3 -11.6 4.75 -11.2 3.5 -9.0 4.2 -2.65 6.2 -2.7 6.7 -5.25 7.15 -2.75 16.55 -5.5 M-1.9 -23.1 L-0.2 -21.9 Q0.25 -21.75 0.5 -21.9 L4.25 -22.65 Q2.75 -23.55 -1.9 -23.1 L1.8 -23.5 Q4.8 -23.35 7.4 -21.85 5.0 -21.1 1.8 -20.8 L-1.9 -20.55 -1.9 -23.1 M6.25 -9.65 Q5.6 -11.4 6.7 -13.3 L6.45 -9.35 6.25 -9.65 M9.4 -5.4 Q7.45 -8.1 10.05 -9.95 9.1 -7.65 9.75 -5.1 L9.4 -5.4 M6.5 1.65 L6.1 1.1 5.0 1.55 5.95 2.05 6.5 1.65 M3.5 2.5 L3.8 1.95 3.5 1.45 Q3.2 1.2 2.75 1.2 2.3 1.2 2.0 1.45 1.7 1.65 1.7 1.95 L2.0 2.5 Q2.3 2.7 2.75 2.7 L3.5 2.5 M0.85 1.85 L-0.6 0.85 -1.6 1.15 -1.5 1.75 -0.65 2.4 0.2 2.5 0.85 1.85 M-1.7 -15.2 L-2.4 -14.65 -1.0 -6.3 -1.65 -6.3 -2.9 -10.15 -3.4 -9.75 -3.15 -13.3 Q-3.05 -14.55 -2.2 -15.5 L-1.7 -15.2 M-6.85 -8.05 L-6.9 -5.65 -4.45 -4.3 -6.85 -8.05" fill="#a30101" fill-rule="evenodd" stroke="none"/>
  </g>
</svg>
