<?xml version="1.0" encoding="UTF-8" standalone="no"?>
<svg xmlns:xlink="http://www.w3.org/1999/xlink" height="31.9px" width="31.9px" xmlns="http://www.w3.org/2000/svg">
  <g transform="matrix(1.0, 0.0, 0.0, 1.0, 15.95, 30.9)">
    <path d="M-10.1 -5.15 Q-13.65 -9.2 -13.7 -14.55 -13.75 -20.95 -9.25 -25.1 -5.55 -28.5 -0.55 -28.6 L4.25 -28.35 Q5.95 -27.35 7.2 -25.8 L8.0 -24.8 Q2.85 -26.25 -2.5 -25.35 L7.4 -23.7 8.7 -23.4 9.25 -21.4 -6.0 -20.4 9.35 -19.15 9.25 -16.8 -8.5 -15.1 Q-3.7 -14.25 1.8 -14.9 L9.0 -15.15 8.0 -11.8 -8.95 -10.7 7.15 -10.15 7.4 -10.5 6.1 -8.6 -7.6 -7.75 -9.65 -7.15 -9.65 -7.0 Q-6.9 -5.45 -1.9 -6.1 L3.85 -6.65 Q-1.8 -3.95 -8.0 -4.75 L-10.1 -5.15" fill="#996600" fill-rule="evenodd" stroke="none"/>
    <path d="M4.25 -28.35 Q6.55 -27.35 8.4 -25.85 13.25 -21.8 13.7 -15.75 14.2 -9.5 9.85 -5.1 5.85 -0.95 0.25 -1.0 -5.55 -1.05 -10.1 -5.15 L-8.0 -4.75 Q-1.8 -3.95 3.85 -6.65 L-1.9 -6.1 Q-6.9 -5.45 -9.65 -7.0 L-9.65 -7.15 -7.6 -7.75 6.1 -8.6 7.4 -10.5 7.15 -10.15 -8.95 -10.7 8.0 -11.8 9.0 -15.15 1.8 -14.9 Q-3.7 -14.25 -8.5 -15.1 L9.25 -16.8 9.35 -19.15 -6.0 -20.4 9.25 -21.4 8.7 -23.4 7.4 -23.7 -2.5 -25.35 Q2.85 -26.25 8.0 -24.8 L7.2 -25.8 Q5.95 -27.35 4.25 -28.35" fill="#633e01" fill-rule="evenodd" stroke="none"/>
    <path d="M-0.45 -10.4 L0.0 -10.3 0.3 -10.4 0.45 -10.6 1.0 -10.3 1.1 -8.4 0.15 -8.35 0.25 -7.45 Q0.4 -6.75 0.7 -6.1 L0.65 -5.4 Q0.55 -4.35 -0.2 -3.6 L-0.45 -10.4" fill="#ffff99" fill-rule="evenodd" stroke="none"/>
    <path d="M-0.45 -10.4 L-0.2 -3.6 -0.5 -3.9 Q-1.2 -4.85 -1.25 -6.1 L-1.1 -5.6 -0.95 -6.1 -0.5 -6.35 -0.55 -7.75 -0.85 -8.2 -0.9 -8.8 -1.8 -10.6 -0.65 -10.65 -0.45 -10.4" fill="#ffcc00" fill-rule="evenodd" stroke="none"/>
    <path d="M0.7 -6.1 Q0.4 -6.75 0.25 -7.45 L0.15 -8.35 1.1 -8.4 0.7 -6.1" fill="#ffffff" fill-rule="evenodd" stroke="none"/>
    <path d="M-1.8 -10.6 L-0.9 -8.8 -0.85 -8.2 -0.55 -7.75 -0.5 -6.35 -0.95 -6.1 -1.1 -5.6 -1.25 -6.1 -1.8 -10.6" fill="#000000" fill-rule="evenodd" stroke="none"/>
    <path d="M9.45 -13.85 L9.5 -14.1 9.55 -14.15 9.45 -13.8 9.45 -13.85 M8.75 -19.9 L8.65 -19.95 8.75 -19.95 8.75 -19.9" fill="#996600" fill-rule="evenodd" stroke="none"/>
    <path d="M3.6 -29.9 L3.45 -29.9 3.4 -30.25 3.05 -30.5 0.8 -30.2 0.5 -30.25 -1.55 -29.55 -2.5 -29.6 -2.45 -29.7 Q-2.55 -30.15 -2.95 -30.25 L-2.9 -30.35 Q-2.7 -30.45 -2.8 -30.65 L-2.85 -30.7 0.0 -30.9 4.8 -30.25 5.05 -30.15 3.6 -29.9 M4.6 -27.85 L5.0 -27.95 5.85 -28.1 6.1 -28.1 7.7 -28.15 8.0 -27.6 Q8.5 -27.1 9.2 -27.0 L8.8 -27.1 8.8 -26.9 8.2 -27.15 Q7.45 -27.9 6.55 -28.0 6.15 -28.2 5.9 -28.0 L5.7 -27.75 Q5.7 -27.3 6.0 -26.95 L6.45 -26.5 6.95 -26.2 5.75 -26.85 5.4 -27.3 4.6 -27.85 M1.3 -1.7 Q5.9 -2.15 9.3 -5.55 L9.75 -5.95 9.35 -4.75 9.45 -4.1 9.3 -3.95 9.25 -3.95 7.9 -2.95 6.6 -2.2 2.8 -0.5 -2.8 -0.55 0.2 0.1 -0.8 0.25 -2.55 0.45 -2.4 0.25 -2.45 0.1 -2.6 -0.1 Q-4.1 -0.3 -5.2 -1.1 L-4.95 -1.35 -4.9 -1.6 -5.1 -1.6 -1.4 -1.35 1.3 -1.7 M13.15 -13.3 L13.2 -14.9 Q13.5 -15.85 14.25 -16.65 L14.2 -16.7 14.05 -16.7 13.95 -16.6 13.35 -15.8 13.7 -17.7 13.85 -18.35 14.15 -19.2 14.05 -19.95 14.3 -18.45 14.4 -17.35 14.55 -15.15 14.5 -14.05 14.35 -13.2 14.3 -12.85 14.25 -12.6 Q14.0 -13.1 13.45 -13.35 L13.15 -13.3 M13.1 -16.8 L13.05 -17.2 13.1 -16.85 13.1 -17.0 13.1 -16.8 M6.7 -29.5 L6.85 -29.45 6.6 -29.4 6.7 -29.5 M9.0 -28.2 L9.15 -28.1 8.95 -28.15 9.0 -28.2 M-4.25 0.45 L-4.3 0.45 -4.1 0.45 -4.25 0.45 M-5.65 0.0 Q-7.4 -0.65 -9.0 -1.75 L-9.15 -1.85 -9.3 -1.95 -9.45 -2.05 -9.65 -2.2 -9.85 -2.35 -10.0 -2.5 -10.2 -2.65 -10.35 -2.8 -10.5 -2.95 -10.65 -3.1 -10.8 -3.25 -11.0 -3.4 -11.15 -3.55 -11.35 -3.7 -11.5 -3.85 -12.35 -4.8 -11.8 -4.9 Q-11.45 -5.05 -11.55 -5.35 L-11.7 -6.15 -11.65 -6.15 -11.5 -5.7 -11.15 -5.45 -11.1 -5.35 -10.9 -5.05 -10.15 -4.3 -8.6 -3.1 -8.9 -3.3 -8.6 -2.8 -8.7 -2.55 -8.65 -2.3 -6.0 -0.2 -5.65 0.0 M-13.3 -6.05 L-13.55 -6.45 -13.45 -6.5 -13.3 -6.1 -13.3 -6.05 M-14.8 -8.85 Q-16.0 -11.7 -15.95 -14.95 -16.0 -19.7 -13.6 -23.45 L-12.3 -23.35 -12.65 -22.85 Q-13.55 -21.25 -13.85 -19.4 L-14.1 -17.85 -14.2 -14.4 -14.15 -13.95 Q-14.5 -13.9 -14.65 -13.6 L-14.7 -13.2 -14.7 -13.05 -14.8 -13.05 -14.9 -13.15 -15.1 -13.1 -15.15 -13.0 -14.95 -10.9 -14.8 -8.85 M-9.0 -28.25 Q-6.45 -30.0 -3.35 -30.6 L-4.6 -29.95 -7.8 -27.8 Q-7.9 -28.3 -8.4 -28.6 L-9.0 -28.25 M13.85 -20.8 L13.9 -20.55 14.0 -20.2 13.75 -20.1 13.85 -20.8 M-7.95 -26.8 L-7.9 -26.9 -4.6 -28.9 -3.85 -29.2 -5.1 -28.35 -6.0 -27.7 -7.95 -26.8 M-1.8 -29.45 L-3.35 -28.7 -2.5 -29.55 -1.8 -29.45" fill="#ffff99" fill-rule="evenodd" stroke="none"/>
    <path d="M2.45 -28.65 L3.2 -28.45 4.3 -28.0 4.6 -27.85 5.4 -27.3 5.75 -26.85 3.95 -27.55 -0.05 -28.15 Q-4.65 -28.15 -8.1 -25.45 L-10.05 -25.55 -9.55 -26.0 -9.35 -26.1 -7.95 -26.8 -6.0 -27.7 -5.4 -28.0 -4.3 -28.35 -1.05 -29.0 0.9 -28.95 2.45 -28.65 M-13.2 -16.45 L-13.3 -14.9 Q-13.3 -12.35 -12.45 -10.15 L-11.75 -6.85 -11.45 -6.15 -12.9 -9.35 -12.95 -9.4 -13.05 -10.05 -13.5 -11.05 -14.15 -13.7 -14.15 -13.95 -14.2 -14.4 -13.2 -16.45 M-10.3 -6.5 L-9.55 -5.65 -9.45 -5.55 -9.3 -5.4 -9.15 -5.25 -9.0 -5.15 -8.85 -5.0 -8.75 -4.9 -8.6 -4.8 -8.5 -4.65 -8.35 -4.55 -8.2 -4.4 -8.05 -4.3 -7.9 -4.15 -7.75 -4.05 -7.6 -4.0 -7.5 -3.9 Q-6.55 -3.25 -5.5 -2.75 L-6.9 -2.9 -5.1 -1.6 Q-6.9 -2.05 -8.5 -3.05 L-8.6 -3.1 -10.15 -4.3 -10.9 -5.05 -10.45 -4.6 -10.5 -4.8 -9.8 -4.1 -9.65 -4.05 -9.5 -4.1 -9.25 -4.3 -9.15 -4.15 -8.95 -3.9 -8.7 -3.75 Q-8.15 -3.05 -7.45 -3.05 L-7.35 -3.2 -7.3 -3.35 -10.0 -5.9 Q-10.25 -6.1 -10.3 -6.4 L-10.3 -6.5 M-2.05 -1.75 L-1.4 -1.7 -0.05 -1.65 0.6 -1.65 1.3 -1.7 -1.4 -1.35 -2.05 -1.75 M11.55 -25.95 Q14.75 -22.6 15.65 -18.2 L15.95 -14.95 Q15.9 -10.65 13.9 -7.15 L14.15 -9.15 14.45 -12.1 14.3 -12.85 14.35 -13.2 14.5 -14.05 14.55 -15.15 14.4 -17.35 14.3 -18.45 14.05 -19.95 14.0 -20.2 13.9 -20.55 13.85 -20.8 13.45 -22.15 12.1 -25.0 11.55 -25.95 M11.15 -3.65 L10.6 -3.1 11.45 -5.25 11.15 -3.65 M7.3 -0.75 Q4.0 0.95 0.0 1.0 L-1.65 0.9 -1.7 0.9 -4.25 0.45 -4.1 0.45 -4.05 0.45 -2.55 0.45 -0.8 0.25 0.2 0.1 2.8 -0.5 6.6 -2.2 7.9 -2.95 9.25 -3.95 9.3 -3.95 8.45 -2.2 Q7.7 -1.6 7.3 -0.75 M-11.75 -24.1 L-14.1 -17.85 -13.85 -19.4 Q-13.55 -21.25 -12.65 -22.85 L-12.3 -23.35 -11.75 -24.1" fill="#ffcc00" fill-rule="evenodd" stroke="none"/>
    <path d="M-2.5 -29.6 L-1.55 -29.55 3.8 -29.1 2.45 -28.65 0.9 -28.95 -1.8 -29.45 -2.5 -29.55 -3.25 -29.7 -2.5 -29.6 M-8.1 -25.45 Q-12.3 -22.2 -13.2 -16.45 L-14.2 -14.4 -14.1 -17.85 -11.75 -24.1 -10.05 -25.55 -8.1 -25.45 M-5.5 -2.75 L-2.05 -1.75 -1.4 -1.35 -5.1 -1.6 -6.9 -2.9 -5.5 -2.75 M12.3 -21.25 L10.55 -24.05 10.05 -24.2 9.65 -24.9 9.4 -25.9 9.75 -25.65 11.95 -23.4 12.5 -22.5 12.65 -22.25 Q13.35 -20.9 13.6 -19.15 L12.3 -21.25 M-12.9 -9.35 L-11.45 -6.15 -11.15 -5.45 -11.5 -5.7 -11.65 -6.15 -11.7 -6.15 -12.1 -6.35 -12.35 -6.85 -12.65 -6.25 Q-13.85 -8.65 -14.3 -11.3 L-13.65 -10.45 -13.65 -10.0 -12.9 -9.35 M0.2 0.1 L-2.8 -0.55 2.8 -0.5 0.2 0.1" fill="#000000" fill-rule="evenodd" stroke="none"/>
    <path d="M-1.55 -29.55 L0.5 -30.25 0.8 -30.2 3.05 -30.5 3.4 -30.25 3.45 -29.9 3.6 -29.9 Q3.65 -28.9 4.8 -29.5 L5.85 -28.1 5.0 -27.95 4.6 -27.85 4.3 -28.0 3.2 -28.45 2.45 -28.65 3.8 -29.1 -1.55 -29.55 M-2.85 -30.7 L-2.8 -30.65 Q-2.7 -30.45 -2.9 -30.35 L-2.95 -30.25 Q-2.55 -30.15 -2.45 -29.7 L-2.5 -29.6 -3.25 -29.7 -2.5 -29.55 -3.35 -28.7 -1.8 -29.45 0.9 -28.95 -1.05 -29.0 -4.3 -28.35 -5.4 -28.0 -6.0 -27.7 -5.1 -28.35 -3.85 -29.2 -4.6 -28.9 -7.9 -26.9 -8.15 -26.75 -8.25 -26.75 Q-8.5 -26.75 -8.6 -26.95 L-8.6 -27.1 -8.6 -27.2 -7.8 -27.8 -4.6 -29.95 -3.35 -30.6 -2.85 -30.7 M-12.45 -10.15 Q-11.75 -8.25 -10.45 -6.65 L-10.5 -6.65 -10.6 -6.6 -10.7 -6.5 -10.7 -6.4 -10.7 -6.3 -10.7 -6.2 -10.7 -6.1 -10.45 -5.8 -10.3 -5.5 -10.4 -5.4 -10.4 -5.3 -9.8 -4.1 -10.5 -4.8 -10.45 -4.6 -10.9 -5.05 -11.1 -5.35 -11.15 -5.45 -11.45 -6.15 -11.75 -6.85 -12.45 -10.15 M13.2 -14.9 L13.1 -16.75 13.1 -16.8 13.1 -17.0 13.1 -16.85 13.05 -17.2 12.95 -17.6 Q12.6 -19.5 11.7 -21.15 L12.1 -21.2 12.3 -21.25 13.6 -19.15 Q13.35 -20.9 12.65 -22.25 L12.5 -22.5 12.15 -24.15 10.85 -26.7 11.25 -26.3 11.55 -25.95 12.1 -25.0 13.45 -22.15 13.85 -20.8 13.75 -20.1 14.0 -20.2 14.05 -19.95 14.15 -19.2 13.85 -18.35 13.7 -17.7 13.35 -15.8 13.95 -16.6 14.05 -16.7 14.2 -16.7 14.25 -16.65 Q13.5 -15.85 13.2 -14.9 M7.1 -26.1 L6.95 -26.2 6.45 -26.5 6.0 -26.95 Q5.7 -27.3 5.7 -27.75 L5.9 -28.0 6.15 -27.7 6.85 -26.55 7.1 -26.1 M6.85 -29.45 Q7.25 -29.25 7.7 -29.0 L7.7 -28.7 7.85 -28.05 7.2 -28.9 6.85 -29.45 M13.9 -7.15 Q12.85 -5.3 11.25 -3.7 L11.15 -3.65 11.45 -5.25 10.6 -3.1 Q9.05 -1.7 7.3 -0.75 7.7 -1.6 8.45 -2.2 L9.3 -3.95 9.45 -4.1 10.35 -4.8 11.1 -5.5 Q11.95 -6.75 12.4 -8.2 L12.95 -9.35 Q13.9 -10.9 14.25 -12.6 L14.3 -12.85 14.45 -12.1 14.15 -9.15 13.9 -7.15 M-4.3 0.45 L-5.65 0.0 -6.0 -0.2 -8.65 -2.3 -8.7 -2.55 -8.6 -2.8 -8.9 -3.3 -8.6 -3.1 -8.5 -3.05 Q-6.9 -2.05 -5.1 -1.6 L-4.9 -1.6 -4.95 -1.35 -5.2 -1.1 Q-4.1 -0.3 -2.6 -0.1 L-2.45 0.1 -2.4 0.25 -2.55 0.45 -4.05 0.45 -4.1 0.45 -4.3 0.45" fill="#cc9900" fill-rule="evenodd" stroke="none"/>
    <path d="M3.6 -29.9 L5.05 -30.15 6.7 -29.5 6.6 -29.4 6.85 -29.45 7.2 -28.9 7.85 -28.05 7.7 -28.7 7.7 -29.0 9.0 -28.2 8.95 -28.15 9.15 -28.1 9.9 -27.5 10.8 -26.7 10.85 -26.7 12.15 -24.15 12.5 -22.5 11.95 -23.4 9.75 -25.65 9.4 -25.9 9.65 -24.9 10.05 -24.2 10.55 -24.05 12.3 -21.25 12.1 -21.2 11.7 -21.15 9.3 -24.3 9.1 -24.5 7.1 -26.1 6.85 -26.55 6.15 -27.7 5.9 -28.0 Q6.15 -28.2 6.55 -28.0 7.45 -27.9 8.2 -27.15 L8.8 -26.9 8.8 -27.1 9.2 -27.0 Q8.5 -27.1 8.0 -27.6 L7.7 -28.15 6.1 -28.1 5.85 -28.1 4.8 -29.5 Q3.65 -28.9 3.6 -29.9 M-10.45 -6.65 L-10.3 -6.5 -10.3 -6.4 Q-10.25 -6.1 -10.0 -5.9 L-7.3 -3.35 -7.35 -3.2 -7.45 -3.05 Q-8.15 -3.05 -8.7 -3.75 L-8.95 -3.9 -9.15 -4.15 -9.25 -4.3 -9.5 -4.1 -9.65 -4.05 -9.8 -4.1 -10.4 -5.3 -10.4 -5.4 -10.3 -5.5 -10.45 -5.8 -10.7 -6.1 -10.7 -6.2 -10.7 -6.3 -10.7 -6.4 -10.7 -6.5 -10.6 -6.6 -10.5 -6.65 -10.45 -6.65 M9.75 -5.95 L9.75 -6.0 10.55 -6.9 12.3 -9.95 13.1 -13.1 13.15 -13.3 13.45 -13.35 Q14.0 -13.1 14.25 -12.6 13.9 -10.9 12.95 -9.35 L12.4 -8.2 Q11.95 -6.75 11.1 -5.5 L10.35 -4.8 9.45 -4.1 9.35 -4.75 9.75 -5.95 M-12.35 -4.8 L-12.8 -5.4 -13.05 -5.75 -13.2 -5.95 -13.3 -6.05 -13.3 -6.1 -13.45 -6.5 -13.55 -6.45 -14.8 -8.85 -14.95 -10.9 -15.15 -13.0 -15.1 -13.1 -14.9 -13.15 -14.8 -13.05 -14.7 -13.05 -14.7 -13.2 -14.65 -13.6 Q-14.5 -13.9 -14.15 -13.95 L-14.15 -13.7 -13.5 -11.05 -13.05 -10.05 -12.95 -9.4 -12.9 -9.35 -13.65 -10.0 -13.65 -10.45 -14.3 -11.3 Q-13.85 -8.65 -12.65 -6.25 L-12.35 -6.85 -12.1 -6.35 -11.7 -6.15 -11.55 -5.35 Q-11.45 -5.05 -11.8 -4.9 L-12.35 -4.8 M-13.6 -23.45 L-11.35 -26.3 -10.7 -26.9 -9.0 -28.25 -8.4 -28.6 Q-7.9 -28.3 -7.8 -27.8 L-8.6 -27.2 -8.6 -27.1 -8.6 -26.95 Q-8.5 -26.75 -8.25 -26.75 L-8.15 -26.75 -7.9 -26.9 -7.95 -26.8 -9.35 -26.1 -9.55 -26.0 -10.05 -25.55 -11.75 -24.1 -12.3 -23.35 -13.6 -23.45" fill="#ffffff" fill-rule="evenodd" stroke="none"/>
    <path d="M-1.5 -21.15 L-0.55 -21.25 -0.45 -22.95 -1.05 -23.5 -0.2 -26.0 0.05 -19.2 -1.6 -19.25 -1.5 -21.15" fill="#ffff99" fill-rule="evenodd" stroke="none"/>
    <path d="M0.05 -19.2 L-0.2 -26.0 0.3 -25.55 0.9 -23.45 0.7 -23.95 0.55 -23.5 0.1 -23.25 0.15 -21.85 0.45 -21.4 0.45 -20.5 1.45 -18.9 0.7 -18.75 0.05 -19.2" fill="#ffcc00" fill-rule="evenodd" stroke="none"/>
    <path d="M-1.05 -23.5 L-0.45 -22.95 -0.55 -21.25 -1.5 -21.15 -1.05 -23.5" fill="#ffffff" fill-rule="evenodd" stroke="none"/>
    <path d="M1.45 -18.9 L0.45 -20.5 0.45 -21.4 0.15 -21.85 0.1 -23.25 0.55 -23.5 0.7 -23.95 0.9 -23.45 1.45 -18.9" fill="#000000" fill-rule="evenodd" stroke="none"/>
    <path d="M-0.4 -19.55 L-0.9 -18.9 -0.1 -18.3 -0.3 -16.4 0.0 -16.0 -0.15 -15.5 -1.25 -17.3 -1.5 -17.9 -1.55 -18.0 -2.1 -18.95 -2.2 -19.05 Q-1.4 -19.5 -0.4 -19.55 M0.4 -15.75 L0.45 -16.5 0.9 -17.1 1.85 -17.4 2.45 -18.8 3.25 -18.15 3.8 -17.5 Q2.25 -16.6 0.55 -15.95 L0.5 -15.85 0.4 -15.75 M4.2 -12.7 L3.55 -11.75 Q2.3 -12.8 1.5 -14.15 L1.7 -14.05 4.0 -12.8 4.2 -12.7 M3.25 -11.4 L2.25 -10.65 1.4 -13.3 1.6 -12.95 1.75 -12.85 Q2.3 -11.9 3.25 -11.4 M1.4 -10.25 L-0.1 -10.05 -1.2 -10.15 -0.5 -10.05 -0.45 -10.55 -0.55 -14.25 -0.6 -14.6 1.4 -10.25 M-3.15 -11.15 L-3.45 -11.45 Q-4.85 -12.85 -4.85 -14.8 -4.85 -16.0 -4.3 -17.0 L-4.15 -16.95 Q-3.9 -16.45 -3.3 -16.35 L-0.6 -14.65 -1.55 -15.05 -2.7 -14.7 -2.45 -13.6 -3.85 -14.45 -3.8 -13.95 -4.05 -13.4 -2.9 -11.5 -3.15 -11.15 M-1.5 -14.2 L-1.7 -13.8 -1.85 -14.2 -1.5 -14.2" fill="#ffff99" fill-rule="evenodd" stroke="none"/>
    <path d="M-0.4 -19.55 L1.25 -19.3 2.45 -18.8 1.85 -17.4 0.9 -17.1 0.45 -16.5 0.4 -15.75 -0.05 -15.25 -0.15 -15.5 0.0 -16.0 -0.3 -16.4 -0.1 -18.3 -0.9 -18.9 -0.4 -19.55 M3.55 -11.75 L3.25 -11.45 3.25 -11.4 Q2.3 -11.9 1.75 -12.85 L1.6 -12.95 1.4 -13.3 1.05 -14.35 1.5 -14.15 Q2.3 -12.8 3.55 -11.75 M-0.55 -14.25 L-1.0 -14.05 -1.4 -13.45 -1.25 -12.55 -1.85 -11.05 -2.9 -11.5 -4.05 -13.4 -3.8 -13.95 -3.85 -14.45 -2.45 -13.6 -2.7 -14.7 -1.55 -15.05 -0.6 -14.65 -0.6 -14.6 -0.55 -14.25 M-1.5 -14.2 L-1.85 -14.2 -1.7 -13.8 -1.5 -14.2" fill="#000000" fill-rule="evenodd" stroke="none"/>
    <path d="M-0.15 -15.5 L-0.05 -15.25 1.05 -14.35 1.4 -13.3 2.25 -10.65 1.4 -10.25 -0.6 -14.6 -0.6 -14.65 -3.3 -16.35 Q-2.55 -15.95 -1.75 -16.55 L-1.4 -16.85 -1.25 -17.3 -0.15 -15.5 M-4.3 -17.0 L-4.25 -17.1 -4.15 -16.95 -4.3 -17.0 M-2.25 -19.05 L-2.2 -19.05 -2.1 -18.95 -2.25 -19.05" fill="#cc9900" fill-rule="evenodd" stroke="none"/>
    <path d="M-0.05 -15.25 L0.4 -15.75 0.5 -15.85 0.55 -15.95 Q2.25 -16.6 3.8 -17.5 L4.45 -16.25 4.65 -15.2 4.65 -15.05 4.65 -14.95 4.65 -14.8 Q4.65 -13.65 4.2 -12.7 L4.0 -12.8 1.7 -14.05 1.5 -14.15 1.05 -14.35 -0.05 -15.25 M-1.2 -10.15 L-3.15 -11.15 -2.9 -11.5 -1.85 -11.05 -1.25 -12.55 -1.4 -13.45 -1.0 -14.05 -0.55 -14.25 -0.45 -10.55 -0.5 -10.05 -1.2 -10.15" fill="#ffcc00" fill-rule="evenodd" stroke="none"/>
    <path d="M-4.25 -17.1 L-3.45 -18.15 -3.35 -18.2 -2.85 -18.65 -2.25 -19.05 -2.1 -18.95 -1.55 -18.0 -1.5 -17.9 -1.25 -17.3 -1.4 -16.85 -1.75 -16.55 Q-2.55 -15.95 -3.3 -16.35 -3.9 -16.45 -4.15 -16.95 L-4.25 -17.1" fill="#ffffff" fill-rule="evenodd" stroke="none"/>
    <path d="M-4.5 -15.2 L-4.55 -13.55 -6.45 -13.65 -6.55 -14.6 -8.1 -14.4 -8.8 -14.05 -9.4 -14.0 Q-10.45 -14.15 -11.3 -14.95 L-4.5 -15.2" fill="#ffff99" fill-rule="evenodd" stroke="none"/>
    <path d="M-4.5 -15.2 L-11.3 -14.95 -9.2 -15.85 Q-8.25 -15.35 -7.15 -15.3 L-6.7 -15.6 -6.1 -15.4 -5.45 -15.65 -5.2 -16.05 -4.3 -16.45 -3.95 -16.1 -4.5 -15.2" fill="#ffcc00" fill-rule="evenodd" stroke="none"/>
    <path d="M-8.8 -14.05 L-8.1 -14.4 -6.55 -14.6 -6.45 -13.65 -8.8 -14.05" fill="#ffffff" fill-rule="evenodd" stroke="none"/>
    <path d="M-4.3 -16.45 L-5.2 -16.05 -5.45 -15.65 -6.1 -15.4 -6.7 -15.6 -7.15 -15.3 Q-8.25 -15.35 -9.2 -15.85 L-4.3 -16.45" fill="#000000" fill-rule="evenodd" stroke="none"/>
    <path d="M6.3 -16.25 L6.35 -15.3 Q7.4 -14.65 8.25 -15.3 L8.6 -15.8 11.1 -14.95 4.3 -14.7 4.55 -15.15 4.1 -15.55 4.35 -16.35 6.3 -16.25" fill="#ffff99" fill-rule="evenodd" stroke="none"/>
    <path d="M11.1 -14.95 L10.7 -14.45 8.55 -13.85 9.1 -14.05 8.6 -14.2 8.35 -14.65 6.95 -14.6 6.5 -14.3 5.9 -14.5 4.1 -13.35 4.3 -14.7 11.1 -14.95" fill="#ffcc00" fill-rule="evenodd" stroke="none"/>
    <path d="M6.3 -16.25 L8.6 -15.8 8.25 -15.3 Q7.4 -14.65 6.35 -15.3 L6.3 -16.25" fill="#ffffff" fill-rule="evenodd" stroke="none"/>
    <path d="M8.55 -13.85 L4.1 -13.35 5.9 -14.5 6.5 -14.3 6.95 -14.6 8.35 -14.65 8.6 -14.2 9.1 -14.05 8.55 -13.85" fill="#000000" fill-rule="evenodd" stroke="none"/>
  </g>
</svg>
