<?xml version="1.0" encoding="UTF-8" standalone="no"?>
<svg xmlns:xlink="http://www.w3.org/1999/xlink" height="20.8px" width="50.2px" xmlns="http://www.w3.org/2000/svg">
  <g transform="matrix(1.0, 0.0, 0.0, 1.0, 24.55, 20.15)">
    <path d="M20.55 -17.6 L15.35 -16.65 Q13.4 -16.3 11.95 -15.2 L13.6 -16.7 11.1 -15.55 10.05 -13.5 11.1 -14.45 10.25 -13.4 11.4 -13.9 9.95 -11.9 Q12.65 -13.8 15.45 -15.25 17.5 -16.2 19.65 -15.75 L22.1 -15.45 21.65 -15.35 19.65 -15.75 21.25 -15.35 19.95 -15.25 16.65 -14.75 Q12.9 -13.6 9.9 -11.1 L16.3 -12.25 Q19.5 -13.1 22.4 -11.7 L21.85 -11.6 13.4 -10.9 15.15 -10.85 10.15 -9.8 22.25 -8.05 23.15 -7.8 21.25 -7.0 20.65 -7.15 21.8 -7.75 11.4 -9.15 Q14.05 -8.45 16.6 -7.2 18.25 -6.5 19.8 -6.85 L20.45 -6.6 19.85 -6.35 22.45 -5.8 22.6 -5.25 22.95 -5.25 23.1 -4.55 23.0 -3.75 22.35 -3.8 14.55 -4.65 11.4 -5.4 20.75 -2.4 19.8 -2.05 21.7 -2.3 22.1 -2.05 19.7 -1.6 13.7 -2.1 9.3 -6.6 9.85 -6.55 9.05 -7.95 10.25 -7.9 9.15 -8.45 9.15 -9.65 10.0 -10.4 8.95 -10.3 9.7 -12.0 8.8 -11.4 8.85 -12.2 8.3 -8.05 7.85 -6.6 Q7.0 -4.95 5.2 -4.15 3.5 -3.25 1.65 -3.0 L1.75 -3.4 1.9 -4.15 4.8 -4.85 Q7.3 -5.8 8.1 -8.25 L7.65 -12.45 1.85 -17.25 3.2 -17.2 2.4 -17.2 Q4.95 -16.75 6.1 -14.45 L6.4 -14.15 6.45 -14.2 6.6 -14.35 7.65 -12.55 7.4 -14.45 8.5 -12.3 Q9.65 -15.65 13.05 -17.3 L11.3 -15.95 15.5 -17.55 Q17.9 -18.15 20.55 -17.65 L20.55 -17.6 M2.5 -13.1 L1.05 -13.25 1.05 -13.2 -0.25 -13.4 -1.0 -13.4 -2.65 -13.25 -3.6 -13.0 -4.7 -12.6 -5.3 -12.25 -7.6 -11.35 -6.85 -12.55 Q-2.2 -14.15 2.5 -13.1 M-1.1 -12.55 L0.55 -12.4 1.5 -12.25 1.6 -12.15 1.95 -11.75 2.85 -11.05 3.15 -10.9 -2.7 -11.1 -2.65 -11.15 -2.1 -11.55 -1.3 -12.3 -1.1 -12.55 M-6.9 -15.0 L-8.25 -11.15 -8.7 -12.05 -9.2 -10.5 -10.15 -10.35 -9.05 -9.45 -17.2 -6.1 -9.05 -8.0 -9.3 -6.3 Q-10.25 -4.8 -11.8 -4.2 -14.95 -2.8 -18.05 -1.0 -17.95 -1.5 -18.55 -1.45 L-19.2 -1.1 -20.85 -1.1 -18.75 -1.5 -21.45 -2.05 -21.05 -2.3 -19.45 -2.05 -20.25 -2.4 -11.3 -5.4 -14.5 -4.65 -21.6 -3.8 -22.15 -3.75 -22.3 -4.55 -21.35 -6.2 -20.65 -6.4 -13.45 -8.55 -11.35 -9.15 -21.15 -7.75 -20.15 -7.15 -20.65 -7.0 -22.3 -7.8 -21.5 -8.05 -10.0 -9.8 -15.0 -10.85 -13.35 -10.9 -20.5 -11.5 -20.85 -11.6 -21.2 -11.6 -21.6 -11.7 Q-20.5 -12.55 -19.15 -12.55 L-9.85 -11.1 Q-11.95 -12.9 -14.55 -14.2 -16.95 -15.35 -19.6 -15.25 L-20.65 -15.35 -15.4 -15.05 Q-12.3 -13.95 -9.85 -11.9 L-11.3 -13.9 -10.15 -13.4 Q-11.6 -15.2 -13.75 -16.05 L-17.35 -17.2 -20.1 -17.6 -20.1 -17.65 -16.4 -17.75 Q-14.1 -17.2 -11.8 -16.2 L-11.2 -15.6 -13.55 -16.7 -9.95 -13.5 -10.95 -15.4 -8.55 -13.1 -6.9 -15.0 M-8.35 -9.45 L-8.35 -9.05 -1.1 -8.05 -1.35 -7.65 -4.55 -7.8 -2.4 -7.0 -8.35 -9.05 -7.95 -8.2 -5.6 -6.9 -6.5 -7.65 Q-4.4 -6.4 -2.0 -6.1 L-1.65 -6.1 -1.65 -6.05 -1.7 -5.05 -1.7 -4.85 -2.85 -5.1 -2.05 -4.85 -4.35 -5.15 -2.05 -4.55 -1.7 -4.45 -1.7 -3.55 -1.7 -3.3 -2.0 -3.4 -4.0 -3.9 -1.65 -2.95 -1.6 -2.2 -2.95 -2.65 -5.7 -4.05 Q-7.4 -5.05 -8.4 -7.05 L-5.3 -6.2 -8.25 -7.45 -7.25 -7.1 -8.45 -8.25 -8.35 -9.45 M1.35 -7.95 L5.7 -8.2 4.6 -7.7 1.8 -7.0 1.7 -7.25 3.4 -7.5 1.6 -7.55 1.45 -7.85 1.35 -7.95 M1.95 -6.35 Q4.7 -6.9 7.2 -8.25 L6.95 -7.15 Q6.65 -6.05 5.3 -5.6 3.65 -4.95 2.0 -4.75 L2.0 -5.15 1.95 -6.1 1.95 -6.35 M2.5 -14.55 L6.15 -12.55 Q2.0 -14.5 -2.6 -14.45 L-5.55 -14.25 Q-2.45 -15.35 0.5 -15.25 L-1.65 -16.0 1.6 -15.75 Q4.5 -15.3 6.5 -13.2 L2.5 -14.55 M7.25 -10.3 L7.25 -10.35 7.75 -9.8 7.2 -10.25 7.25 -10.3 M3.85 -10.55 L3.9 -10.55 Q4.9 -10.15 6.2 -10.0 L6.5 -10.05 7.4 -8.65 -7.6 -9.95 -7.05 -10.2 Q-6.8 -9.7 -5.8 -10.0 L-4.25 -10.5 -2.8 -11.05 3.85 -10.55 M-7.1 -10.4 L-8.3 -10.05 -7.8 -10.3 -7.2 -10.8 -6.5 -11.2 -7.1 -10.4 M1.5 -2.6 Q4.05 -2.85 6.25 -4.25 4.55 -2.85 2.5 -2.25 L1.35 -2.0 1.45 -2.4 1.5 -2.6 M4.0 -5.95 L6.2 -6.1 6.6 -6.9 4.0 -5.95 M-21.0 -15.35 L-21.45 -15.45 -20.05 -15.6 -21.0 -15.35" fill="#e4b001" fill-rule="evenodd" stroke="none"/>
    <path d="M22.1 -15.45 L19.65 -15.75 Q17.5 -16.2 15.45 -15.25 12.65 -13.8 9.95 -11.9 L11.4 -13.9 10.25 -13.4 11.1 -14.45 10.05 -13.5 11.1 -15.55 13.6 -16.7 11.95 -15.2 Q13.4 -16.3 15.35 -16.65 L20.55 -17.6 22.25 -17.95 20.55 -17.65 Q17.9 -18.15 15.5 -17.55 L11.3 -15.95 13.05 -17.3 Q15.85 -19.0 19.2 -19.2 21.4 -19.25 23.4 -18.2 L22.75 -17.8 24.45 -17.0 22.55 -16.85 20.35 -16.65 21.65 -16.2 24.5 -16.05 22.85 -15.45 22.1 -15.45 M22.4 -11.7 Q19.5 -13.1 16.3 -12.25 L9.9 -11.1 Q12.9 -13.6 16.65 -14.75 L19.95 -15.25 22.05 -14.6 24.7 -13.8 23.4 -13.2 17.0 -14.25 23.45 -12.2 24.2 -12.0 22.4 -11.7 M21.25 -15.35 L19.65 -15.75 21.65 -15.35 21.25 -15.35 M1.05 -13.2 L1.0 -12.9 1.5 -12.25 0.55 -12.4 -1.1 -12.55 -0.9 -12.85 -0.9 -13.1 -1.0 -13.4 -0.25 -13.4 1.05 -13.2 M5.7 -12.05 L4.3 -12.8 2.5 -13.1 Q-2.2 -14.15 -6.85 -12.55 L-7.6 -11.35 -5.3 -12.25 -6.4 -11.35 -6.5 -11.2 -7.2 -10.8 -7.8 -10.3 -8.3 -10.05 -7.1 -10.4 -7.05 -10.2 -7.6 -9.95 7.4 -8.65 6.5 -10.05 7.2 -10.25 7.75 -9.8 7.25 -10.35 7.15 -10.55 7.2 -10.55 7.15 -10.6 6.9 -10.9 6.5 -11.35 5.7 -12.05 M7.4 -14.45 L7.65 -12.55 6.6 -14.35 6.45 -14.2 6.4 -14.15 6.1 -14.45 Q4.95 -16.75 2.4 -17.2 L3.2 -17.2 1.85 -17.25 7.65 -12.45 8.1 -8.25 Q7.3 -5.8 4.8 -4.85 L1.9 -4.15 1.95 -4.3 2.0 -4.75 Q3.65 -4.95 5.3 -5.6 6.65 -6.05 6.95 -7.15 L7.2 -8.25 Q4.7 -6.9 1.95 -6.35 L1.85 -6.85 1.8 -6.9 1.8 -7.0 4.6 -7.7 5.7 -8.2 1.35 -7.95 1.3 -8.05 Q0.45 -9.0 -0.65 -8.35 L-1.1 -8.05 -8.35 -9.05 -8.35 -9.45 -8.25 -11.15 -6.9 -15.0 Q-6.0 -16.6 -4.4 -17.95 0.75 -20.05 5.25 -16.6 L7.4 -14.45 M22.1 -2.05 L21.7 -2.3 22.4 -2.85 20.75 -2.4 11.4 -5.4 14.55 -4.65 13.7 -4.7 21.95 -3.2 22.65 -3.05 22.1 -2.05 M23.1 -4.55 L22.95 -5.25 22.6 -5.25 22.45 -5.8 19.85 -6.35 20.45 -6.6 21.2 -6.4 23.8 -5.8 24.0 -5.15 23.1 -4.55 M19.8 -6.85 Q18.25 -6.5 16.6 -7.2 14.05 -8.45 11.4 -9.15 L21.8 -7.75 20.65 -7.15 13.45 -8.55 19.8 -6.85 M21.25 -7.0 L23.15 -7.8 22.9 -7.05 Q22.6 -6.75 22.25 -6.75 L21.25 -7.0 M22.25 -8.05 L10.15 -9.8 15.15 -10.85 20.7 -10.7 24.0 -10.15 22.35 -9.7 23.1 -8.65 21.85 -8.85 21.3 -8.25 22.25 -8.05 M2.5 -14.55 L6.5 -13.2 Q4.5 -15.3 1.6 -15.75 L-1.65 -16.0 0.5 -15.25 Q-2.45 -15.35 -5.55 -14.25 L-2.6 -14.45 Q2.0 -14.5 6.15 -12.55 L2.5 -14.55 M3.15 -10.9 Q3.45 -10.7 3.85 -10.55 L-2.8 -11.05 -2.7 -11.1 3.15 -10.9 M-1.7 -4.7 L-1.7 -4.45 -2.05 -4.55 -4.35 -5.15 -2.05 -4.85 -2.85 -5.1 -1.7 -4.85 -1.7 -4.7 M-21.45 -2.05 L-21.85 -3.05 -21.35 -3.2 -13.65 -4.7 -14.5 -4.65 -11.3 -5.4 -20.25 -2.4 -21.65 -2.85 -21.05 -2.3 -21.45 -2.05 M-22.3 -4.55 L-23.0 -5.15 -22.8 -5.8 -21.35 -6.2 -22.3 -4.55 M-21.55 -6.75 Q-21.85 -6.75 -22.05 -7.05 L-22.3 -7.8 -20.65 -7.0 -21.55 -6.75 M-21.5 -8.05 L-20.75 -8.25 -21.25 -8.85 -22.3 -8.65 -21.6 -9.7 -23.0 -10.15 -20.25 -10.7 -15.0 -10.85 -10.0 -9.8 -21.5 -8.05 M-21.6 -11.7 L-23.15 -12.0 -22.55 -12.2 -17.1 -14.25 -22.55 -13.2 -23.55 -13.8 -21.35 -14.6 -19.6 -15.25 Q-16.95 -15.35 -14.55 -14.2 -11.95 -12.9 -9.85 -11.1 L-19.15 -12.55 Q-20.5 -12.55 -21.6 -11.7 M-22.05 -15.45 L-23.45 -16.05 -21.0 -16.2 -19.95 -16.65 -21.85 -16.85 -23.4 -17.0 -21.95 -17.8 -22.0 -18.45 Q-19.65 -19.45 -17.35 -18.95 -13.8 -18.25 -11.25 -15.95 L-11.8 -16.2 Q-14.1 -17.2 -16.4 -17.75 L-20.1 -17.65 -21.55 -17.95 -20.1 -17.6 -17.35 -17.2 -13.75 -16.05 Q-11.6 -15.2 -10.15 -13.4 L-11.3 -13.9 -9.85 -11.9 Q-12.3 -13.95 -15.4 -15.05 L-20.65 -15.35 -21.0 -15.35 -20.05 -15.6 -21.45 -15.45 -22.05 -15.45 M-11.2 -15.6 L-10.95 -15.4 -9.95 -13.5 -13.55 -16.7 -11.2 -15.6 M21.85 -18.4 L20.4 -18.85 20.65 -18.3 21.85 -18.4 M-20.5 -11.5 L-20.75 -11.5 -20.85 -11.6 -20.5 -11.5 M-20.15 -7.15 L-21.15 -7.75 -11.35 -9.15 -13.45 -8.55 -20.15 -7.15 M-20.15 -18.3 L-20.0 -18.85 -21.2 -18.4 -20.15 -18.3 M-1.6 -6.8 L-1.6 -6.4 -1.65 -6.1 -2.0 -6.1 Q-4.4 -6.4 -6.5 -7.65 L-5.6 -6.9 -7.95 -8.2 -8.35 -9.05 -2.4 -7.0 -1.6 -6.9 -1.6 -6.85 -1.6 -6.8" fill="#ffcc00" fill-rule="evenodd" stroke="none"/>
    <path d="M22.1 -15.45 L22.85 -15.45 23.5 -14.9 22.05 -14.6 19.95 -15.25 21.25 -15.35 21.65 -15.35 22.1 -15.45 M21.65 -16.2 L20.35 -16.65 22.55 -16.85 23.75 -16.55 21.65 -16.2 M20.55 -17.65 L22.25 -17.95 20.55 -17.6 20.55 -17.65 M-8.25 -11.15 L-8.35 -9.45 -8.45 -8.25 -7.25 -7.1 -8.25 -7.45 -5.3 -6.2 -8.4 -7.05 Q-7.4 -5.05 -5.7 -4.05 L-2.95 -2.65 -1.6 -2.2 -1.25 -1.35 Q0.2 -0.65 1.25 -1.75 L1.35 -2.0 2.5 -2.25 Q4.55 -2.85 6.25 -4.25 4.05 -2.85 1.5 -2.6 L1.55 -2.75 1.55 -2.85 1.65 -3.0 Q3.5 -3.25 5.2 -4.15 7.0 -4.95 7.85 -6.6 L8.3 -8.05 8.85 -12.2 8.8 -11.4 9.7 -12.0 8.95 -10.3 10.0 -10.4 9.15 -9.65 9.15 -8.45 10.25 -7.9 9.05 -7.95 9.85 -6.55 9.3 -6.6 13.7 -2.1 Q10.8 -3.25 9.3 -5.7 L8.55 -7.1 Q8.4 -4.5 6.35 -2.65 4.7 -1.15 2.55 -0.6 -1.85 0.4 -5.6 -2.3 -7.25 -3.45 -8.2 -4.95 L-8.85 -6.1 Q-10.3 -3.8 -12.75 -2.45 -15.15 -1.05 -18.15 -0.6 L-19.85 -0.55 -18.05 -1.0 -19.2 -1.1 -18.55 -1.45 Q-17.95 -1.5 -18.05 -1.0 -14.95 -2.8 -11.8 -4.2 -10.25 -4.8 -9.3 -6.3 L-9.05 -8.0 -17.2 -6.1 -9.05 -9.45 -10.15 -10.35 -9.2 -10.5 -8.7 -12.05 -8.25 -11.15 M21.7 -2.3 L19.8 -2.05 20.75 -2.4 22.4 -2.85 21.7 -2.3 M14.55 -4.65 L22.35 -3.8 Q23.1 -3.15 22.25 -3.25 L21.95 -3.2 13.7 -4.7 14.55 -4.65 M20.45 -6.6 L19.8 -6.85 13.45 -8.55 20.65 -7.15 21.25 -7.0 22.25 -6.75 21.2 -6.4 20.45 -6.6 M15.15 -10.85 L13.4 -10.9 21.85 -11.6 23.35 -11.15 20.7 -10.7 15.15 -10.85 M23.45 -12.2 L17.0 -14.25 23.4 -13.2 23.45 -12.2 M1.6 -7.55 L3.4 -7.5 1.7 -7.25 1.65 -7.5 1.6 -7.55 M-21.35 -3.2 L-21.6 -3.8 -14.5 -4.65 -13.65 -4.7 -21.35 -3.2 M-20.65 -6.4 L-21.55 -6.75 -20.65 -7.0 -20.15 -7.15 -13.45 -8.55 -20.65 -6.4 M-20.25 -10.7 L-22.45 -11.1 -21.2 -11.6 -20.85 -11.6 -20.75 -11.5 -20.5 -11.5 -13.35 -10.9 -15.0 -10.85 -20.25 -10.7 M-22.55 -12.2 L-22.55 -13.2 -17.1 -14.25 -22.55 -12.2 M-21.35 -14.6 L-22.6 -14.8 -22.05 -15.45 -21.45 -15.45 -21.0 -15.35 -20.65 -15.35 -19.6 -15.25 -21.35 -14.6 M-21.0 -16.2 L-22.8 -16.55 -21.85 -16.85 -19.95 -16.65 -21.0 -16.2 M4.0 -5.95 L6.6 -6.9 6.2 -6.1 4.0 -5.95 M21.85 -18.4 L20.65 -18.3 20.4 -18.85 21.85 -18.4 M-21.05 -2.3 L-21.65 -2.85 -20.25 -2.4 -19.45 -2.05 -21.05 -2.3 M-20.1 -17.65 L-20.1 -17.6 -21.55 -17.95 -20.1 -17.65 M-20.15 -18.3 L-21.2 -18.4 -20.0 -18.85 -20.15 -18.3 M-1.35 -7.65 L-1.6 -7.4 -1.6 -6.9 -2.4 -7.0 -4.55 -7.8 -1.35 -7.65 M-1.65 -2.95 L-4.0 -3.9 -2.0 -3.4 -1.7 -3.3 -1.65 -2.95" fill="#ba9101" fill-rule="evenodd" stroke="none"/>
    <path d="M22.85 -15.45 L24.5 -16.05 21.65 -16.2 23.75 -16.55 22.55 -16.85 24.45 -17.0 22.75 -17.8 23.4 -18.2 Q21.4 -19.25 19.2 -19.2 15.85 -19.0 13.05 -17.3 9.65 -15.65 8.5 -12.3 L7.4 -14.45 5.25 -16.6 Q0.75 -20.05 -4.4 -17.95 -6.0 -16.6 -6.9 -15.0 L-8.55 -13.1 -10.95 -15.4 -11.2 -15.6 -11.8 -16.2 -11.25 -15.95 Q-13.8 -18.25 -17.35 -18.95 -19.65 -19.45 -22.0 -18.45 L-21.95 -17.8 -23.4 -17.0 -21.85 -16.85 -22.8 -16.55 -21.0 -16.2 -23.45 -16.05 -22.05 -15.45 -22.6 -14.8 -21.35 -14.6 -23.55 -13.8 -22.55 -13.2 -22.55 -12.2 -23.15 -12.0 -21.6 -11.7 -21.2 -11.6 -22.45 -11.1 -20.25 -10.7 -23.0 -10.15 -21.6 -9.7 -22.3 -8.65 -21.25 -8.85 -20.75 -8.25 -21.5 -8.05 -22.3 -7.8 -22.05 -7.05 Q-21.85 -6.75 -21.55 -6.75 L-20.65 -6.4 -21.35 -6.2 -22.8 -5.8 -23.0 -5.15 -22.3 -4.55 -22.15 -3.75 -21.6 -3.8 -21.35 -3.2 -21.85 -3.05 -21.45 -2.05 -18.75 -1.5 -20.85 -1.1 -19.2 -1.1 -18.05 -1.0 -19.85 -0.55 -18.15 -0.6 Q-15.15 -1.05 -12.75 -2.45 -10.3 -3.8 -8.85 -6.1 L-8.2 -4.95 Q-7.25 -3.45 -5.6 -2.3 -1.85 0.4 2.55 -0.6 4.7 -1.15 6.35 -2.65 8.4 -4.5 8.55 -7.1 L9.3 -5.7 Q10.8 -3.25 13.7 -2.1 L19.7 -1.6 22.1 -2.05 22.65 -3.05 21.95 -3.2 22.25 -3.25 Q23.1 -3.15 22.35 -3.8 L23.0 -3.75 23.1 -4.55 24.0 -5.15 23.8 -5.8 21.2 -6.4 22.25 -6.75 Q22.6 -6.75 22.9 -7.05 L23.15 -7.8 22.25 -8.05 21.3 -8.25 21.85 -8.85 23.1 -8.65 22.35 -9.7 24.0 -10.15 20.7 -10.7 23.35 -11.15 21.85 -11.6 22.4 -11.7 24.2 -12.0 23.45 -12.2 23.4 -13.2 24.7 -13.8 22.05 -14.6 23.5 -14.9 22.85 -15.45 M1.5 -19.35 Q6.1 -18.35 8.5 -14.45 10.55 -17.15 13.7 -18.7 18.75 -21.15 24.0 -19.05 L24.25 -18.85 24.3 -18.55 24.3 -18.25 25.25 -17.45 25.35 -17.3 25.4 -17.1 25.4 -16.0 25.35 -15.8 25.25 -15.6 24.7 -15.1 25.5 -14.35 25.65 -14.1 25.65 -13.85 25.5 -13.65 24.65 -12.75 24.9 -12.5 25.05 -12.3 25.05 -12.0 24.9 -11.8 24.45 -11.3 24.85 -10.2 24.85 -9.9 24.65 -9.65 23.85 -9.0 23.85 -8.9 23.75 -8.45 23.65 -8.35 23.6 -8.3 23.55 -8.2 23.9 -7.6 23.95 -7.25 23.75 -6.95 24.25 -6.8 24.45 -6.7 24.6 -6.5 24.95 -5.3 24.95 -5.05 24.9 -4.85 22.75 -1.5 22.55 -1.35 22.35 -1.3 16.7 -1.2 Q11.85 -1.15 8.85 -5.0 7.55 -2.15 4.85 -0.6 1.55 1.35 -2.25 0.3 -6.45 -0.85 -8.9 -4.3 -10.45 -2.05 -13.05 -0.95 -16.95 0.9 -21.05 -0.3 L-21.25 -0.45 -21.35 -0.6 -21.6 -1.3 -22.15 -1.6 -22.4 -1.8 -23.95 -4.95 -23.95 -5.3 -23.65 -6.45 -23.55 -6.7 -23.35 -6.8 -22.75 -7.0 -23.05 -7.35 -23.2 -7.6 -23.15 -7.85 -23.0 -8.1 -22.8 -8.2 -22.95 -8.25 -23.2 -8.4 -23.35 -8.65 -23.3 -8.95 -23.1 -9.4 -23.8 -9.9 -24.05 -10.25 -23.95 -10.6 -23.6 -11.2 -24.1 -11.85 -24.2 -12.1 -24.1 -12.4 -23.7 -13.05 -24.4 -13.85 -24.55 -14.15 -24.5 -14.45 -24.25 -14.65 -23.35 -15.1 -24.15 -15.55 -24.35 -15.75 -24.45 -16.0 -24.45 -17.1 -24.3 -17.4 -22.5 -19.4 -22.3 -19.55 Q-19.25 -20.7 -16.1 -19.65 -11.5 -18.3 -8.55 -14.75 -5.05 -18.45 -3.05 -18.9 L-0.45 -19.45 1.5 -19.35 M1.0 -12.9 L5.7 -12.05 6.5 -11.35 1.6 -12.15 1.5 -12.25 1.0 -12.9 M-1.0 -13.4 L-0.9 -13.1 -2.35 -13.2 -2.65 -13.25 -1.0 -13.4 M-0.9 -12.85 L-1.1 -12.55 -1.3 -12.3 -2.65 -12.45 -4.45 -12.6 -4.7 -12.6 -3.6 -13.0 -3.35 -13.0 -0.9 -12.85 M-1.1 -8.05 L-0.65 -8.35 -0.4 -8.3 0.7 -7.95 1.45 -7.85 1.6 -7.55 1.65 -7.5 -1.6 -7.4 -1.35 -7.65 -1.1 -8.05 M1.8 -6.9 L1.85 -6.85 -1.6 -6.8 -1.6 -6.85 Q0.1 -6.8 1.8 -6.9 M1.95 -4.3 L1.9 -4.15 1.75 -3.4 -1.7 -3.55 -1.7 -4.45 1.95 -4.3 M1.95 -11.75 L7.15 -10.55 7.25 -10.35 7.25 -10.3 7.15 -10.3 2.85 -11.05 1.95 -11.75 M7.15 -10.6 L5.15 -11.25 6.9 -10.9 7.15 -10.6 M-6.5 -11.2 L-6.4 -11.35 -6.2 -11.35 -2.1 -11.55 -2.65 -11.15 -2.95 -11.1 -3.0 -11.1 -7.1 -10.4 -6.5 -11.2 M2.0 -5.15 L2.0 -4.75 1.8 -4.75 Q0.45 -4.6 -0.85 -4.75 L-1.7 -4.7 -1.7 -4.85 -1.7 -5.05 2.0 -5.15 M1.55 -2.85 L1.55 -2.75 1.35 -2.8 1.55 -2.85 M1.35 -2.0 L1.25 -1.75 -1.6 -2.2 -1.65 -2.95 1.45 -2.4 1.35 -2.0 M1.95 -6.35 L1.95 -6.1 -1.65 -6.05 -1.65 -6.1 -1.6 -6.4 1.95 -6.35" fill="#000000" fill-rule="evenodd" stroke="none"/>
    <path d="M1.0 -12.9 L1.05 -13.2 1.05 -13.25 2.5 -13.1 4.3 -12.8 5.7 -12.05 1.0 -12.9 M-0.9 -13.1 L-0.9 -12.85 -3.35 -13.0 -3.6 -13.0 -2.65 -13.25 -2.35 -13.2 -0.9 -13.1 M-0.65 -8.35 Q0.45 -9.0 1.3 -8.05 L1.35 -7.95 1.45 -7.85 0.7 -7.95 -0.4 -8.3 -0.65 -8.35 M1.8 -7.0 L1.8 -6.9 Q0.1 -6.8 -1.6 -6.85 L-1.6 -6.9 -1.6 -7.4 1.65 -7.5 1.7 -7.25 1.8 -7.0 M1.85 -6.85 L1.95 -6.35 -1.6 -6.4 -1.6 -6.8 1.85 -6.85 M2.0 -4.75 L1.95 -4.3 -1.7 -4.45 -1.7 -4.7 -0.85 -4.75 Q0.45 -4.6 1.8 -4.75 L2.0 -4.75 M1.75 -3.4 L1.65 -3.0 1.55 -2.85 1.35 -2.8 1.55 -2.75 1.5 -2.6 1.45 -2.4 -1.65 -2.95 -1.7 -3.3 -1.7 -3.55 1.75 -3.4 M6.5 -11.35 L6.9 -10.9 5.15 -11.25 7.15 -10.6 7.2 -10.55 7.15 -10.55 1.95 -11.75 1.6 -12.15 6.5 -11.35 M7.25 -10.3 L7.2 -10.25 6.5 -10.05 6.2 -10.0 Q4.9 -10.15 3.9 -10.55 L3.85 -10.55 Q3.45 -10.7 3.15 -10.9 L2.85 -11.05 7.15 -10.3 7.25 -10.3 M-7.05 -10.2 L-7.1 -10.4 -3.0 -11.1 -2.95 -11.1 -2.65 -11.15 -2.7 -11.1 -2.8 -11.05 -4.25 -10.5 -5.8 -10.0 Q-6.8 -9.7 -7.05 -10.2 M-6.4 -11.35 L-5.3 -12.25 -4.7 -12.6 -4.45 -12.6 -2.65 -12.45 -1.3 -12.3 -2.1 -11.55 -6.2 -11.35 -6.4 -11.35 M1.95 -6.1 L2.0 -5.15 -1.7 -5.05 -1.65 -6.05 1.95 -6.1 M1.25 -1.75 Q0.2 -0.65 -1.25 -1.35 L-1.6 -2.2 1.25 -1.75" fill="#6b4b01" fill-rule="evenodd" stroke="none"/>
  </g>
</svg>
