<?xml version="1.0" encoding="UTF-8" standalone="no"?>
<svg xmlns:xlink="http://www.w3.org/1999/xlink" height="19.65px" width="21.25px" xmlns="http://www.w3.org/2000/svg">
  <g transform="matrix(1.0, 0.0, 0.0, 1.0, 10.6, 19.65)">
    <path d="M0.25 -19.65 L0.65 -19.6 0.6 -19.6 Q5.9 -18.7 8.95 -14.6 L8.95 -14.65 10.0 -12.75 10.05 -12.6 10.5 -10.95 10.55 -8.15 Q10.1 -5.05 7.1 -2.7 L7.15 -2.7 Q5.9 -1.7 4.85 -1.05 L4.85 -1.1 4.55 -0.95 4.55 -0.9 Q-0.55 0.9 -4.05 -0.9 -5.2 -1.25 -7.8 -3.15 L-7.8 -3.1 Q-10.4 -4.85 -10.55 -8.15 -10.65 -9.35 -10.35 -10.75 L-10.35 -10.95 Q-9.45 -15.75 -6.6 -17.45 L-6.65 -17.45 Q-3.55 -19.55 0.2 -19.65 L0.25 -19.65" fill="#000000" fill-rule="evenodd" stroke="none"/>
    <path d="M4.2 -1.85 Q-0.5 -0.15 -3.7 -1.85 -4.75 -2.15 -7.25 -3.95 -10.25 -6.0 -9.4 -10.6 -8.6 -15.05 -6.1 -16.6 -3.25 -18.55 0.2 -18.65 L0.4 -18.6 Q5.35 -17.8 8.15 -14.0 L9.05 -12.4 9.05 -12.35 Q10.95 -7.05 6.5 -3.45 L4.35 -1.95 4.2 -1.85" fill="#ff75f4" fill-rule="evenodd" stroke="none"/>
    <path d="M-5.45 -13.75 Q-3.35 -12.8 -4.95 -10.9 -5.8 -9.95 -6.7 -10.9 -7.95 -12.2 -6.35 -13.35 L-5.45 -13.75 M-1.1 -16.3 Q-0.2 -16.3 -0.1 -15.45 L-0.1 -15.4 Q-1.2 -13.85 -1.7 -15.55 -1.9 -16.1 -1.3 -16.25 L-1.1 -16.3" fill="#ffffff" fill-rule="evenodd" stroke="none"/>
    <path d="M-6.8 -8.75 L-7.3 -8.3 -7.45 -9.1 -6.8 -8.75" fill="#be6d01" fill-rule="evenodd" stroke="none"/>
    <path d="M7.2 -13.4 L7.95 -12.05 Q9.6 -7.35 5.7 -4.25 L3.7 -2.8 Q-0.65 -1.25 -3.55 -2.8 -4.45 -3.05 -6.8 -4.75 -9.3 -6.55 -8.55 -10.4 -7.9 -14.35 -5.7 -15.8 -3.05 -17.55 0.1 -17.65 4.6 -16.85 7.2 -13.4 M1.4 -15.2 Q1.5 -16.2 0.1 -16.95 -0.65 -16.95 -1.3 -16.5 L-2.3 -15.35 -4.4 -14.6 -5.0 -14.8 Q-8.35 -13.65 -8.0 -10.2 -7.95 -9.5 -7.45 -9.1 L-7.3 -8.3 -6.8 -8.75 -6.65 -8.7 Q-5.05 -8.4 -4.05 -9.1 -2.15 -8.45 -2.6 -6.45 -2.85 -5.15 -4.2 -4.5 L-0.8 -3.8 Q-1.7 -4.6 -1.85 -5.9 L-2.0 -7.1 Q-2.1 -8.05 -1.65 -8.85 -0.8 -10.45 0.85 -11.0 3.95 -10.8 5.35 -8.0 5.85 -10.2 5.15 -12.3 4.8 -13.5 3.75 -14.15 2.65 -14.9 1.4 -15.2 M2.05 -13.65 Q4.7 -13.0 3.05 -11.2 2.5 -10.65 1.8 -10.95 -0.6 -11.95 1.45 -13.4 L2.05 -13.65 M-2.85 -11.0 L-1.8 -11.35 Q-1.1 -11.25 -1.05 -10.55 L-1.05 -10.45 Q-2.05 -8.7 -3.35 -9.9 L-2.85 -11.0" fill="#cc00bd" fill-rule="evenodd" stroke="none"/>
    <path d="M1.4 -15.2 Q2.65 -14.9 3.75 -14.15 4.8 -13.5 5.15 -12.3 5.85 -10.2 5.35 -8.0 3.95 -10.8 0.85 -11.0 -0.8 -10.45 -1.65 -8.85 -2.1 -8.05 -2.0 -7.1 L-1.85 -5.9 Q-1.7 -4.6 -0.8 -3.8 L-4.2 -4.5 Q-2.85 -5.15 -2.6 -6.45 -2.15 -8.45 -4.05 -9.1 L-3.35 -9.9 Q-2.05 -8.7 -1.05 -10.45 L-1.05 -10.55 Q-1.1 -11.25 -1.8 -11.35 L-2.85 -11.0 -2.7 -11.55 Q-2.2 -12.0 -2.6 -12.45 -2.65 -14.05 -4.4 -14.6 L-2.3 -15.35 Q-2.55 -14.6 -1.65 -13.9 L-0.5 -13.35 Q0.0 -13.3 0.45 -13.7 1.3 -14.55 1.4 -15.2 M2.05 -13.65 L1.45 -13.4 Q-0.6 -11.95 1.8 -10.95 2.5 -10.65 3.05 -11.2 4.7 -13.0 2.05 -13.65" fill="#97008b" fill-rule="evenodd" stroke="none"/>
    <path d="M-2.3 -15.35 L-1.3 -16.5 Q-0.65 -16.95 0.1 -16.95 1.5 -16.2 1.4 -15.2 1.3 -14.55 0.45 -13.7 0.0 -13.3 -0.5 -13.35 L-1.65 -13.9 Q-2.55 -14.6 -2.3 -15.35 M-4.05 -9.1 Q-5.05 -8.4 -6.65 -8.7 L-6.8 -8.75 -7.45 -9.1 Q-7.95 -9.5 -8.0 -10.2 -8.35 -13.65 -5.0 -14.8 L-4.4 -14.6 Q-2.65 -14.05 -2.6 -12.45 -2.2 -12.0 -2.7 -11.55 L-2.85 -11.0 -3.35 -9.9 -4.05 -9.1 M-1.1 -16.3 L-1.3 -16.25 Q-1.9 -16.1 -1.7 -15.55 -1.2 -13.85 -0.1 -15.4 L-0.1 -15.45 Q-0.2 -16.3 -1.1 -16.3 M-5.45 -13.75 L-6.35 -13.35 Q-7.95 -12.2 -6.7 -10.9 -5.8 -9.95 -4.95 -10.9 -3.35 -12.8 -5.45 -13.75" fill="#ff97f8" fill-rule="evenodd" stroke="none"/>
  </g>
</svg>
