<?xml version="1.0" encoding="UTF-8" standalone="no"?>
<svg xmlns:xlink="http://www.w3.org/1999/xlink" height="13.1px" width="33.45px" xmlns="http://www.w3.org/2000/svg">
  <g transform="matrix(1.0, 0.0, 0.0, 1.0, 10.35, 11.1)">
    <path d="M5.9 -6.5 L7.95 -6.55 7.9 -6.6 Q10.6 -6.2 13.35 -6.65 L13.25 -6.65 Q15.3 -7.2 17.1 -8.1 L17.15 -8.1 19.95 -9.25 20.6 -9.25 21.1 -8.9 22.4 -6.9 22.4 -6.85 23.1 -5.05 23.05 -4.45 22.65 -3.95 22.05 -3.8 Q21.7 -3.85 21.45 -4.05 L19.25 -5.95 12.65 -3.85 Q12.75 -2.05 11.5 -0.5 L11.45 -0.5 Q8.65 2.75 4.45 1.8 L4.5 1.8 1.7 1.05 1.15 0.55 Q0.55 -0.75 0.35 -2.0 L0.3 -2.05 0.25 -2.55 -0.55 -2.6 Q-0.85 -1.65 -1.45 -0.85 -3.6 2.05 -7.0 1.25 L-7.05 1.25 Q-10.6 0.3 -10.35 -3.35 -10.05 -7.45 -6.15 -8.65 L-6.2 -8.65 -1.65 -10.25 -1.6 -10.25 2.65 -11.1 3.25 -10.95 3.65 -10.55 4.9 -8.15 5.0 -7.7 4.9 -7.25 4.65 -6.7 4.25 -6.25 3.65 -6.15 3.05 -6.4 1.4 -8.0 0.3 -7.7 -3.4 -6.45 Q-1.6 -5.6 0.5 -5.5 L5.9 -6.5" fill="#000000" fill-rule="evenodd" stroke="none"/>
    <path d="M3.8 -1.1 L4.05 -0.4 3.6 -0.4 Q3.15 -1.15 3.0 -1.95 L2.95 -2.65 3.0 -3.6 3.15 -2.9 3.8 -1.1 M5.55 -0.1 L5.1 -0.85 Q4.2 -2.55 4.05 -4.4 L5.55 -0.1 M-7.45 -5.2 L-6.95 -5.25 -5.55 -0.65 -5.85 -0.05 -5.9 0.0 -6.75 -0.7 Q-8.85 -2.4 -8.7 -5.15 L-7.45 -5.2 M-4.7 -1.0 L-5.05 -1.6 Q-5.8 -3.05 -5.9 -4.8 -4.35 -3.15 -4.7 -1.0" fill="#ffffff" fill-rule="evenodd" stroke="none"/>
    <path d="M7.9 -0.5 Q6.0 -0.95 5.35 -3.05 L5.2 -3.7 5.9 -4.5 6.45 -4.65 7.1 -4.3 Q9.25 -2.8 7.9 -0.5 M-3.3 -1.55 L-4.25 -2.75 -3.85 -4.35 -3.75 -4.3 -3.4 -4.1 -2.9 -3.65 -2.75 -2.2 -3.3 -1.55" fill="#003399" fill-rule="evenodd" stroke="none"/>
    <path d="M6.45 -4.65 L7.85 -5.15 Q10.2 -3.6 8.85 -1.6 L7.9 -0.5 Q9.25 -2.8 7.1 -4.3 L6.45 -4.65" fill="#003366" fill-rule="evenodd" stroke="none"/>
    <path d="M4.0 -7.65 L3.75 -7.1 1.6 -9.15 -0.05 -8.6 -4.1 -7.25 -6.5 -6.5 -4.3 -5.75 Q-2.05 -4.55 0.5 -4.45 L6.1 -5.5 7.75 -5.55 Q10.6 -5.15 13.5 -5.65 15.65 -6.2 17.55 -7.15 L20.3 -8.25 21.5 -6.4 22.1 -4.75 19.45 -7.05 11.5 -4.5 Q11.95 -2.65 10.7 -1.1 8.3 1.7 4.65 0.85 L2.05 0.15 Q1.5 -1.0 1.3 -2.15 L1.15 -3.45 -1.4 -3.65 Q-1.5 -2.4 -2.25 -1.4 -4.0 0.95 -6.8 0.3 -9.55 -0.4 -9.35 -3.25 -9.1 -6.65 -5.85 -7.65 L-1.35 -9.25 2.75 -10.05 4.0 -7.65 M3.8 -1.1 L4.05 -0.5 Q4.4 -0.25 4.9 -0.2 L6.25 0.0 8.35 -0.55 8.6 -0.65 Q10.35 -1.55 10.2 -3.45 L10.15 -3.75 Q9.85 -4.9 8.6 -5.05 L8.55 -5.05 8.0 -5.2 6.75 -5.0 4.8 -4.75 Q3.55 -4.55 2.9 -3.5 L2.8 -3.25 2.75 -3.0 2.85 -2.85 2.95 -2.65 3.0 -1.95 Q3.15 -1.15 3.6 -0.4 L4.05 -0.4 3.8 -1.1 M-3.75 -4.3 Q-4.2 -4.95 -5.1 -5.1 L-5.15 -5.1 -6.9 -5.4 -7.3 -5.35 -7.45 -5.2 -8.7 -5.15 Q-8.85 -2.4 -6.75 -0.7 L-5.9 0.0 -5.85 -0.05 -5.2 -0.1 Q-4.15 -0.5 -3.5 -1.4 L-3.3 -1.55 -2.75 -2.2 -2.9 -3.65 -3.4 -4.1 -3.75 -4.3" fill="#999999" fill-rule="evenodd" stroke="none"/>
    <path d="M2.95 -2.65 L2.85 -2.85 2.75 -3.0 2.8 -3.25 2.9 -3.5 Q3.55 -4.55 4.8 -4.75 L6.75 -5.0 8.0 -5.2 8.55 -5.05 8.6 -5.05 Q9.85 -4.9 10.15 -3.75 L10.2 -3.45 Q10.35 -1.55 8.6 -0.65 L8.35 -0.55 6.25 0.0 4.9 -0.2 Q4.4 -0.25 4.05 -0.5 L3.8 -1.1 3.15 -2.9 3.0 -3.6 2.95 -2.65 M6.45 -4.65 L5.9 -4.5 5.2 -3.7 5.35 -3.05 Q6.0 -0.95 7.9 -0.5 L8.85 -1.6 Q10.2 -3.6 7.85 -5.15 L6.45 -4.65 M5.55 -0.1 L4.05 -4.4 Q4.2 -2.55 5.1 -0.85 L5.55 -0.1 M-7.45 -5.2 L-7.3 -5.35 -6.9 -5.4 -5.15 -5.1 -5.1 -5.1 Q-4.2 -4.95 -3.75 -4.3 L-3.85 -4.35 -4.25 -2.75 -3.3 -1.55 -3.5 -1.4 Q-4.15 -0.5 -5.2 -0.1 L-5.85 -0.05 -5.55 -0.65 -6.95 -5.25 -7.45 -5.2 M-4.7 -1.0 Q-4.35 -3.15 -5.9 -4.8 -5.8 -3.05 -5.05 -1.6 L-4.7 -1.0" fill="#0066ff" fill-rule="evenodd" stroke="none"/>
  </g>
</svg>
