<?xml version="1.0" encoding="UTF-8" standalone="no"?>
<svg xmlns:xlink="http://www.w3.org/1999/xlink" height="30.7px" width="40.35px" xmlns="http://www.w3.org/2000/svg">
  <g transform="matrix(1.0, 0.0, 0.0, 1.0, 20.05, 30.6)">
    <path d="M-1.25 -27.35 L1.8 -27.35 2.05 -25.9 Q-2.7 -22.3 -6.35 -17.45 L-7.15 -16.35 -5.4 -17.4 Q-3.35 -18.5 -0.8 -18.5 4.2 -18.45 7.4 -14.7 L7.3 -14.7 4.9 -16.2 3.0 -17.0 Q-2.05 -18.45 -6.8 -15.95 L-7.35 -15.6 -7.8 -15.55 -7.7 -15.65 -9.0 -14.5 -9.55 -14.95 -1.25 -27.35 -2.4 -24.95 -1.8 -24.65 0.7 -26.7 -1.25 -27.35 M-7.9 -11.25 L-6.0 -10.5 Q-4.0 -9.15 -1.5 -8.65 L1.05 -8.5 Q4.9 -8.85 8.2 -10.85 L8.4 -11.6 8.55 -11.4 Q8.55 -10.15 7.7 -9.45 L6.95 -9.05 2.0 -7.95 -2.4 -8.15 Q-5.65 -8.85 -7.9 -11.25 M-10.35 -10.4 L-14.8 -4.15 -16.5 -3.65 -16.8 -4.7 -11.25 -11.05 -10.35 -10.4" fill="#fee89e" fill-rule="evenodd" stroke="none"/>
    <path d="M-1.25 -27.35 L-9.55 -14.95 -9.0 -14.5 -7.7 -15.65 -7.8 -15.55 -7.35 -15.6 -6.8 -15.95 Q-2.05 -18.45 3.0 -17.0 L4.9 -16.2 7.3 -14.7 7.4 -14.7 Q4.2 -18.45 -0.8 -18.5 -3.35 -18.5 -5.4 -17.4 L-7.15 -16.35 -6.35 -17.45 Q-2.7 -22.3 2.05 -25.9 L1.8 -27.35 -1.25 -27.35 M-9.1 -13.3 L-10.7 -12.3 -7.9 -11.25 Q-5.65 -8.85 -2.4 -8.15 L2.0 -7.95 6.95 -9.05 Q3.75 -7.4 0.05 -7.35 -4.65 -7.7 -8.55 -10.4 L-8.85 -10.05 Q-4.55 -7.0 -1.2 -6.1 7.1 -7.25 8.65 -9.9 L8.65 -10.1 7.7 -9.45 Q8.55 -10.15 8.55 -11.4 9.0 -12.35 7.85 -13.25 L6.5 -14.3 Q4.15 -16.1 1.15 -16.7 -1.65 -17.1 -4.5 -16.05 -7.1 -15.25 -9.1 -13.3 M9.2 -18.35 Q12.8 -12.7 13.95 -7.2 16.15 -2.8 11.55 -2.55 L-14.95 -1.75 -17.75 -1.9 Q-18.6 -2.2 -18.75 -3.0 L-1.65 -28.6 Q0.9 -30.7 2.2 -28.6 L9.2 -18.35 M-10.35 -10.4 L-11.25 -11.05 -16.8 -4.7 -16.5 -3.65 -14.8 -4.15 -10.35 -10.4" fill="#ffcc00" fill-rule="evenodd" stroke="none"/>
    <path d="M2.65 -15.2 L1.2 -15.05 1.7 -14.6 1.1 -12.9 -0.3 -12.6 -1.05 -13.3 -0.4 -15.35 -1.8 -15.55 -3.3 -15.3 -3.65 -15.2 -8.35 -12.35 -6.0 -10.5 -7.9 -11.25 -10.7 -12.3 -9.1 -13.3 Q-6.4 -14.9 -3.2 -15.9 -0.3 -16.85 2.55 -15.8 4.6 -15.15 6.45 -13.85 L8.45 -11.7 4.5 -14.6 4.0 -14.8 3.4 -14.95 2.8 -15.15 2.65 -15.2 M-18.75 -3.0 Q-19.65 -1.15 -17.75 -0.35 L-16.75 -0.05 17.4 -0.05 Q18.25 -0.4 18.75 -0.9 19.9 -2.0 19.0 -3.95 L9.2 -18.35 2.2 -28.6 Q0.9 -30.7 -1.65 -28.6 L-18.75 -3.0 M19.7 -4.45 Q20.5 -3.3 20.25 -1.9 20.0 -0.6 19.05 0.1 L-19.0 0.1 Q-19.8 -0.5 -20.0 -1.75 -20.15 -2.7 -19.6 -3.5 L-2.3 -28.95 Q-1.4 -30.25 -0.05 -30.55 1.9 -30.8 3.0 -29.15 L19.7 -4.45" fill="#000000" fill-rule="evenodd" stroke="none"/>
    <path d="M-1.8 -15.55 L-0.4 -15.35 -1.05 -13.3 -0.3 -12.6 1.1 -12.9 1.7 -14.6 1.2 -15.05 2.65 -15.2 Q2.3 -14.8 2.65 -15.0 L2.8 -15.15 3.4 -14.95 2.8 -14.4 4.0 -14.6 3.95 -14.4 2.8 -13.85 3.9 -14.1 3.8 -13.7 2.8 -13.5 3.7 -13.5 3.55 -13.05 Q2.55 -12.95 3.25 -12.7 L3.35 -12.75 3.2 -12.45 2.2 -12.7 2.9 -12.1 2.7 -11.9 1.65 -12.25 2.1 -11.55 0.8 -12.4 0.95 -11.2 0.9 -11.2 0.45 -11.75 0.15 -11.15 -0.05 -11.15 -0.65 -12.25 -1.5 -11.4 -1.55 -11.4 -1.0 -12.45 -1.85 -12.4 -2.05 -13.5 -3.35 -13.9 -1.65 -14.5 -2.25 -14.85 -1.8 -15.55" fill="#014383" fill-rule="evenodd" stroke="none"/>
    <path d="M4.0 -14.8 L4.5 -14.6 4.55 -13.8 Q3.95 -10.55 0.6 -10.3 -1.4 -10.3 -2.8 -11.3 -4.25 -12.5 -3.85 -14.35 L-3.65 -15.2 -3.3 -15.3 Q-3.9 -12.25 -1.55 -11.4 L-1.5 -11.4 -0.05 -11.15 0.15 -11.15 0.9 -11.2 0.95 -11.2 2.1 -11.55 2.7 -11.9 2.9 -12.1 3.2 -12.45 3.35 -12.75 3.55 -13.05 3.7 -13.5 3.8 -13.7 3.9 -14.1 3.95 -14.4 4.0 -14.6 4.0 -14.8" fill="#3399ff" fill-rule="evenodd" stroke="none"/>
    <path d="M2.65 -15.2 L2.8 -15.15 2.65 -15.0 Q2.3 -14.8 2.65 -15.2 M3.4 -14.95 L4.0 -14.8 4.0 -14.6 2.8 -14.4 3.4 -14.95 M-3.3 -15.3 L-1.8 -15.55 -2.25 -14.85 -1.65 -14.5 -3.35 -13.9 -2.05 -13.5 -1.85 -12.4 -1.0 -12.45 -1.55 -11.4 Q-3.9 -12.25 -3.3 -15.3 M-1.5 -11.4 L-0.65 -12.25 -0.05 -11.15 -1.5 -11.4 M0.15 -11.15 L0.45 -11.75 0.9 -11.2 0.15 -11.15 M0.95 -11.2 L0.8 -12.4 2.1 -11.55 1.65 -12.25 2.7 -11.9 2.1 -11.55 0.95 -11.2 M2.9 -12.1 L2.2 -12.7 3.2 -12.45 2.9 -12.1 M3.35 -12.75 L3.25 -12.7 Q2.55 -12.95 3.55 -13.05 L3.35 -12.75 M3.7 -13.5 L2.8 -13.5 3.8 -13.7 3.7 -13.5 M3.9 -14.1 L2.8 -13.85 3.95 -14.4 3.9 -14.1" fill="#0170de" fill-rule="evenodd" stroke="none"/>
    <path d="M4.5 -14.6 L8.45 -11.7 8.4 -11.6 8.2 -10.85 Q4.9 -8.85 1.05 -8.5 L-1.5 -8.65 Q-4.0 -9.15 -6.0 -10.5 L-8.35 -12.35 -3.65 -15.2 -3.85 -14.35 -6.3 -13.15 -6.4 -13.05 Q-4.1 -10.0 0.05 -9.75 3.25 -9.45 6.1 -11.2 L6.1 -12.0 5.15 -13.6 4.55 -13.8 4.5 -14.6" fill="#dadada" fill-rule="evenodd" stroke="none"/>
    <path d="M8.45 -11.7 L6.45 -13.85 Q4.6 -15.15 2.55 -15.8 -0.3 -16.85 -3.2 -15.9 -6.4 -14.9 -9.1 -13.3 -7.1 -15.25 -4.5 -16.05 -1.65 -17.1 1.15 -16.7 4.15 -16.1 6.5 -14.3 L7.85 -13.25 Q9.0 -12.35 8.55 -11.4 L8.4 -11.6 8.45 -11.7 M7.7 -9.45 L8.65 -10.1 8.65 -9.9 Q7.1 -7.25 -1.2 -6.1 -4.55 -7.0 -8.85 -10.05 L-8.55 -10.4 Q-4.65 -7.7 0.05 -7.35 3.75 -7.4 6.95 -9.05 L7.7 -9.45 M9.2 -18.35 L19.0 -3.95 Q19.9 -2.0 18.75 -0.9 18.25 -0.4 17.4 -0.05 L-16.75 -0.05 -17.75 -0.35 Q-19.65 -1.15 -18.75 -3.0 -18.6 -2.2 -17.75 -1.9 L-14.95 -1.75 11.55 -2.55 Q16.15 -2.8 13.95 -7.2 12.8 -12.7 9.2 -18.35" fill="#c09501" fill-rule="evenodd" stroke="none"/>
    <path d="M-1.25 -27.35 L0.7 -26.7 -1.8 -24.65 -2.4 -24.95 -1.25 -27.35 M4.55 -13.8 L5.15 -13.6 6.1 -12.0 6.1 -11.2 Q3.25 -9.45 0.05 -9.75 -4.1 -10.0 -6.4 -13.05 L-6.3 -13.15 -3.85 -14.35 Q-4.25 -12.5 -2.8 -11.3 -1.4 -10.3 0.6 -10.3 3.95 -10.55 4.55 -13.8" fill="#ffffff" fill-rule="evenodd" stroke="none"/>
    <path d="M-0.3 -12.6 L-0.8 -12.2 Q-1.05 -11.6 -0.35 -11.6 -0.15 -11.6 -0.1 -11.75 0.4 -12.35 -0.3 -12.6 M-0.25 -12.85 Q0.75 -12.6 0.3 -11.65 -0.05 -11.05 -0.65 -11.25 L-1.25 -11.85 Q-1.45 -12.65 -0.5 -12.8 L-0.25 -12.85 M0.1 -13.3 L-0.1 -13.4 Q-0.35 -13.8 0.05 -14.05 L0.2 -14.15 Q1.0 -14.1 0.55 -13.5 L0.1 -13.3 M-2.9 -13.2 L-2.7 -13.05 Q-1.6 -12.9 -1.3 -14.0 -1.0 -14.8 -1.75 -15.0 -2.9 -14.75 -3.0 -13.7 L-2.9 -13.2 M-2.1 -12.4 Q-3.1 -12.15 -3.45 -13.0 L-3.5 -14.0 Q-3.05 -15.45 -1.55 -15.55 -0.65 -15.45 -0.6 -14.65 -0.4 -13.75 -1.05 -13.0 L-2.1 -12.4" fill="#ffffff" fill-opacity="0.5019608" fill-rule="evenodd" stroke="none"/>
    <path d="M-0.3 -12.6 Q0.4 -12.35 -0.1 -11.75 -0.15 -11.6 -0.35 -11.6 -1.05 -11.6 -0.8 -12.2 L-0.3 -12.6 M-2.9 -13.2 L-3.0 -13.7 Q-2.9 -14.75 -1.75 -15.0 -1.0 -14.8 -1.3 -14.0 -1.6 -12.9 -2.7 -13.05 L-2.9 -13.2" fill="#ffffff" fill-rule="evenodd" stroke="none"/>
  </g>
</svg>
