newmtl Default
Ns 100.000
d 1.00000
illum 2
Kd 1.00000 1.00000 1.00000
Ka 0.00000 0.00000 0.00000
Ks 1.00000 1.00000 1.00000
Ke 0.00000e+0 0.00000e+0 0.00000e+0
map_Kd key_color.png
map_bump key_nmap.png
