%YAML 1.1
%TAG !u! tag:unity3d.com,2011:
--- !u!1 &3905198944547220528
GameObject:
  m_ObjectHideFlags: 0
  m_CorrespondingSourceObject: {fileID: 0}
  m_PrefabInstance: {fileID: 0}
  m_PrefabAsset: {fileID: 0}
  serializedVersion: 6
  m_Component:
  - component: {fileID: 6259527264763344473}
  - component: {fileID: 2337048048059769536}
  - component: {fileID: 7174970395446647322}
  m_Layer: 0
  m_Name: Layer1
  m_TagString: Untagged
  m_Icon: {fileID: 0}
  m_NavMeshLayer: 0
  m_StaticEditorFlags: 0
  m_IsActive: 1
--- !u!4 &6259527264763344473
Transform:
  m_ObjectHideFlags: 0
  m_CorrespondingSourceObject: {fileID: 0}
  m_PrefabInstance: {fileID: 0}
  m_PrefabAsset: {fileID: 0}
  m_GameObject: {fileID: 3905198944547220528}
  m_LocalRotation: {x: -0, y: -0, z: -0, w: 1}
  m_LocalPosition: {x: 0, y: 0, z: 0}
  m_LocalScale: {x: 1, y: 1, z: 1}
  m_ConstrainProportionsScale: 0
  m_Children: []
  m_Father: {fileID: 6615866517913052759}
  m_RootOrder: 0
  m_LocalEulerAnglesHint: {x: 0, y: 0, z: 0}
--- !u!1839735485 &2337048048059769536
Tilemap:
  m_ObjectHideFlags: 0
  m_CorrespondingSourceObject: {fileID: 0}
  m_PrefabInstance: {fileID: 0}
  m_PrefabAsset: {fileID: 0}
  m_GameObject: {fileID: 3905198944547220528}
  m_Enabled: 1
  m_Tiles:
  - first: {x: -1, y: -10, z: 0}
    second:
      serializedVersion: 2
      m_TileIndex: 90
      m_TileSpriteIndex: 90
      m_TileMatrixIndex: 0
      m_TileColorIndex: 0
      m_TileObjectToInstantiateIndex: 65535
      dummyAlignment: 0
      m_AllTileFlags: 1073741825
  - first: {x: 0, y: -10, z: 0}
    second:
      serializedVersion: 2
      m_TileIndex: 91
      m_TileSpriteIndex: 91
      m_TileMatrixIndex: 0
      m_TileColorIndex: 0
      m_TileObjectToInstantiateIndex: 65535
      dummyAlignment: 0
      m_AllTileFlags: 1073741825
  - first: {x: 1, y: -10, z: 0}
    second:
      serializedVersion: 2
      m_TileIndex: 92
      m_TileSpriteIndex: 92
      m_TileMatrixIndex: 0
      m_TileColorIndex: 0
      m_TileObjectToInstantiateIndex: 65535
      dummyAlignment: 0
      m_AllTileFlags: 1073741825
  - first: {x: 2, y: -10, z: 0}
    second:
      serializedVersion: 2
      m_TileIndex: 93
      m_TileSpriteIndex: 93
      m_TileMatrixIndex: 0
      m_TileColorIndex: 0
      m_TileObjectToInstantiateIndex: 65535
      dummyAlignment: 0
      m_AllTileFlags: 1073741825
  - first: {x: 3, y: -10, z: 0}
    second:
      serializedVersion: 2
      m_TileIndex: 94
      m_TileSpriteIndex: 94
      m_TileMatrixIndex: 0
      m_TileColorIndex: 0
      m_TileObjectToInstantiateIndex: 65535
      dummyAlignment: 0
      m_AllTileFlags: 1073741825
  - first: {x: 4, y: -10, z: 0}
    second:
      serializedVersion: 2
      m_TileIndex: 95
      m_TileSpriteIndex: 95
      m_TileMatrixIndex: 0
      m_TileColorIndex: 0
      m_TileObjectToInstantiateIndex: 65535
      dummyAlignment: 0
      m_AllTileFlags: 1073741825
  - first: {x: 5, y: -10, z: 0}
    second:
      serializedVersion: 2
      m_TileIndex: 96
      m_TileSpriteIndex: 96
      m_TileMatrixIndex: 0
      m_TileColorIndex: 0
      m_TileObjectToInstantiateIndex: 65535
      dummyAlignment: 0
      m_AllTileFlags: 1073741825
  - first: {x: 6, y: -10, z: 0}
    second:
      serializedVersion: 2
      m_TileIndex: 97
      m_TileSpriteIndex: 97
      m_TileMatrixIndex: 0
      m_TileColorIndex: 0
      m_TileObjectToInstantiateIndex: 65535
      dummyAlignment: 0
      m_AllTileFlags: 1073741825
  - first: {x: 7, y: -10, z: 0}
    second:
      serializedVersion: 2
      m_TileIndex: 98
      m_TileSpriteIndex: 98
      m_TileMatrixIndex: 0
      m_TileColorIndex: 0
      m_TileObjectToInstantiateIndex: 65535
      dummyAlignment: 0
      m_AllTileFlags: 1073741825
  - first: {x: 8, y: -10, z: 0}
    second:
      serializedVersion: 2
      m_TileIndex: 99
      m_TileSpriteIndex: 99
      m_TileMatrixIndex: 0
      m_TileColorIndex: 0
      m_TileObjectToInstantiateIndex: 65535
      dummyAlignment: 0
      m_AllTileFlags: 1073741825
  - first: {x: -1, y: -9, z: 0}
    second:
      serializedVersion: 2
      m_TileIndex: 80
      m_TileSpriteIndex: 80
      m_TileMatrixIndex: 0
      m_TileColorIndex: 0
      m_TileObjectToInstantiateIndex: 65535
      dummyAlignment: 0
      m_AllTileFlags: 1073741825
  - first: {x: 0, y: -9, z: 0}
    second:
      serializedVersion: 2
      m_TileIndex: 81
      m_TileSpriteIndex: 81
      m_TileMatrixIndex: 0
      m_TileColorIndex: 0
      m_TileObjectToInstantiateIndex: 65535
      dummyAlignment: 0
      m_AllTileFlags: 1073741825
  - first: {x: 1, y: -9, z: 0}
    second:
      serializedVersion: 2
      m_TileIndex: 82
      m_TileSpriteIndex: 82
      m_TileMatrixIndex: 0
      m_TileColorIndex: 0
      m_TileObjectToInstantiateIndex: 65535
      dummyAlignment: 0
      m_AllTileFlags: 1073741825
  - first: {x: 2, y: -9, z: 0}
    second:
      serializedVersion: 2
      m_TileIndex: 83
      m_TileSpriteIndex: 83
      m_TileMatrixIndex: 0
      m_TileColorIndex: 0
      m_TileObjectToInstantiateIndex: 65535
      dummyAlignment: 0
      m_AllTileFlags: 1073741825
  - first: {x: 3, y: -9, z: 0}
    second:
      serializedVersion: 2
      m_TileIndex: 84
      m_TileSpriteIndex: 84
      m_TileMatrixIndex: 0
      m_TileColorIndex: 0
      m_TileObjectToInstantiateIndex: 65535
      dummyAlignment: 0
      m_AllTileFlags: 1073741825
  - first: {x: 4, y: -9, z: 0}
    second:
      serializedVersion: 2
      m_TileIndex: 85
      m_TileSpriteIndex: 85
      m_TileMatrixIndex: 0
      m_TileColorIndex: 0
      m_TileObjectToInstantiateIndex: 65535
      dummyAlignment: 0
      m_AllTileFlags: 1073741825
  - first: {x: 5, y: -9, z: 0}
    second:
      serializedVersion: 2
      m_TileIndex: 86
      m_TileSpriteIndex: 86
      m_TileMatrixIndex: 0
      m_TileColorIndex: 0
      m_TileObjectToInstantiateIndex: 65535
      dummyAlignment: 0
      m_AllTileFlags: 1073741825
  - first: {x: 6, y: -9, z: 0}
    second:
      serializedVersion: 2
      m_TileIndex: 87
      m_TileSpriteIndex: 87
      m_TileMatrixIndex: 0
      m_TileColorIndex: 0
      m_TileObjectToInstantiateIndex: 65535
      dummyAlignment: 0
      m_AllTileFlags: 1073741825
  - first: {x: 7, y: -9, z: 0}
    second:
      serializedVersion: 2
      m_TileIndex: 88
      m_TileSpriteIndex: 88
      m_TileMatrixIndex: 0
      m_TileColorIndex: 0
      m_TileObjectToInstantiateIndex: 65535
      dummyAlignment: 0
      m_AllTileFlags: 1073741825
  - first: {x: 8, y: -9, z: 0}
    second:
      serializedVersion: 2
      m_TileIndex: 89
      m_TileSpriteIndex: 89
      m_TileMatrixIndex: 0
      m_TileColorIndex: 0
      m_TileObjectToInstantiateIndex: 65535
      dummyAlignment: 0
      m_AllTileFlags: 1073741825
  - first: {x: -1, y: -8, z: 0}
    second:
      serializedVersion: 2
      m_TileIndex: 70
      m_TileSpriteIndex: 70
      m_TileMatrixIndex: 0
      m_TileColorIndex: 0
      m_TileObjectToInstantiateIndex: 65535
      dummyAlignment: 0
      m_AllTileFlags: 1073741825
  - first: {x: 0, y: -8, z: 0}
    second:
      serializedVersion: 2
      m_TileIndex: 71
      m_TileSpriteIndex: 71
      m_TileMatrixIndex: 0
      m_TileColorIndex: 0
      m_TileObjectToInstantiateIndex: 65535
      dummyAlignment: 0
      m_AllTileFlags: 1073741825
  - first: {x: 1, y: -8, z: 0}
    second:
      serializedVersion: 2
      m_TileIndex: 72
      m_TileSpriteIndex: 72
      m_TileMatrixIndex: 0
      m_TileColorIndex: 0
      m_TileObjectToInstantiateIndex: 65535
      dummyAlignment: 0
      m_AllTileFlags: 1073741825
  - first: {x: 2, y: -8, z: 0}
    second:
      serializedVersion: 2
      m_TileIndex: 73
      m_TileSpriteIndex: 73
      m_TileMatrixIndex: 0
      m_TileColorIndex: 0
      m_TileObjectToInstantiateIndex: 65535
      dummyAlignment: 0
      m_AllTileFlags: 1073741825
  - first: {x: 3, y: -8, z: 0}
    second:
      serializedVersion: 2
      m_TileIndex: 74
      m_TileSpriteIndex: 74
      m_TileMatrixIndex: 0
      m_TileColorIndex: 0
      m_TileObjectToInstantiateIndex: 65535
      dummyAlignment: 0
      m_AllTileFlags: 1073741825
  - first: {x: 4, y: -8, z: 0}
    second:
      serializedVersion: 2
      m_TileIndex: 75
      m_TileSpriteIndex: 75
      m_TileMatrixIndex: 0
      m_TileColorIndex: 0
      m_TileObjectToInstantiateIndex: 65535
      dummyAlignment: 0
      m_AllTileFlags: 1073741825
  - first: {x: 5, y: -8, z: 0}
    second:
      serializedVersion: 2
      m_TileIndex: 76
      m_TileSpriteIndex: 76
      m_TileMatrixIndex: 0
      m_TileColorIndex: 0
      m_TileObjectToInstantiateIndex: 65535
      dummyAlignment: 0
      m_AllTileFlags: 1073741825
  - first: {x: 6, y: -8, z: 0}
    second:
      serializedVersion: 2
      m_TileIndex: 77
      m_TileSpriteIndex: 77
      m_TileMatrixIndex: 0
      m_TileColorIndex: 0
      m_TileObjectToInstantiateIndex: 65535
      dummyAlignment: 0
      m_AllTileFlags: 1073741825
  - first: {x: 7, y: -8, z: 0}
    second:
      serializedVersion: 2
      m_TileIndex: 78
      m_TileSpriteIndex: 78
      m_TileMatrixIndex: 0
      m_TileColorIndex: 0
      m_TileObjectToInstantiateIndex: 65535
      dummyAlignment: 0
      m_AllTileFlags: 1073741825
  - first: {x: 8, y: -8, z: 0}
    second:
      serializedVersion: 2
      m_TileIndex: 79
      m_TileSpriteIndex: 79
      m_TileMatrixIndex: 0
      m_TileColorIndex: 0
      m_TileObjectToInstantiateIndex: 65535
      dummyAlignment: 0
      m_AllTileFlags: 1073741825
  - first: {x: -1, y: -7, z: 0}
    second:
      serializedVersion: 2
      m_TileIndex: 60
      m_TileSpriteIndex: 60
      m_TileMatrixIndex: 0
      m_TileColorIndex: 0
      m_TileObjectToInstantiateIndex: 65535
      dummyAlignment: 0
      m_AllTileFlags: 1073741825
  - first: {x: 0, y: -7, z: 0}
    second:
      serializedVersion: 2
      m_TileIndex: 61
      m_TileSpriteIndex: 61
      m_TileMatrixIndex: 0
      m_TileColorIndex: 0
      m_TileObjectToInstantiateIndex: 65535
      dummyAlignment: 0
      m_AllTileFlags: 1073741825
  - first: {x: 1, y: -7, z: 0}
    second:
      serializedVersion: 2
      m_TileIndex: 62
      m_TileSpriteIndex: 62
      m_TileMatrixIndex: 0
      m_TileColorIndex: 0
      m_TileObjectToInstantiateIndex: 65535
      dummyAlignment: 0
      m_AllTileFlags: 1073741825
  - first: {x: 2, y: -7, z: 0}
    second:
      serializedVersion: 2
      m_TileIndex: 63
      m_TileSpriteIndex: 63
      m_TileMatrixIndex: 0
      m_TileColorIndex: 0
      m_TileObjectToInstantiateIndex: 65535
      dummyAlignment: 0
      m_AllTileFlags: 1073741825
  - first: {x: 3, y: -7, z: 0}
    second:
      serializedVersion: 2
      m_TileIndex: 64
      m_TileSpriteIndex: 64
      m_TileMatrixIndex: 0
      m_TileColorIndex: 0
      m_TileObjectToInstantiateIndex: 65535
      dummyAlignment: 0
      m_AllTileFlags: 1073741825
  - first: {x: 4, y: -7, z: 0}
    second:
      serializedVersion: 2
      m_TileIndex: 65
      m_TileSpriteIndex: 65
      m_TileMatrixIndex: 0
      m_TileColorIndex: 0
      m_TileObjectToInstantiateIndex: 65535
      dummyAlignment: 0
      m_AllTileFlags: 1073741825
  - first: {x: 5, y: -7, z: 0}
    second:
      serializedVersion: 2
      m_TileIndex: 66
      m_TileSpriteIndex: 66
      m_TileMatrixIndex: 0
      m_TileColorIndex: 0
      m_TileObjectToInstantiateIndex: 65535
      dummyAlignment: 0
      m_AllTileFlags: 1073741825
  - first: {x: 6, y: -7, z: 0}
    second:
      serializedVersion: 2
      m_TileIndex: 67
      m_TileSpriteIndex: 67
      m_TileMatrixIndex: 0
      m_TileColorIndex: 0
      m_TileObjectToInstantiateIndex: 65535
      dummyAlignment: 0
      m_AllTileFlags: 1073741825
  - first: {x: 7, y: -7, z: 0}
    second:
      serializedVersion: 2
      m_TileIndex: 68
      m_TileSpriteIndex: 68
      m_TileMatrixIndex: 0
      m_TileColorIndex: 0
      m_TileObjectToInstantiateIndex: 65535
      dummyAlignment: 0
      m_AllTileFlags: 1073741825
  - first: {x: 8, y: -7, z: 0}
    second:
      serializedVersion: 2
      m_TileIndex: 69
      m_TileSpriteIndex: 69
      m_TileMatrixIndex: 0
      m_TileColorIndex: 0
      m_TileObjectToInstantiateIndex: 65535
      dummyAlignment: 0
      m_AllTileFlags: 1073741825
  - first: {x: -1, y: -6, z: 0}
    second:
      serializedVersion: 2
      m_TileIndex: 50
      m_TileSpriteIndex: 50
      m_TileMatrixIndex: 0
      m_TileColorIndex: 0
      m_TileObjectToInstantiateIndex: 65535
      dummyAlignment: 0
      m_AllTileFlags: 1073741825
  - first: {x: 0, y: -6, z: 0}
    second:
      serializedVersion: 2
      m_TileIndex: 51
      m_TileSpriteIndex: 51
      m_TileMatrixIndex: 0
      m_TileColorIndex: 0
      m_TileObjectToInstantiateIndex: 65535
      dummyAlignment: 0
      m_AllTileFlags: 1073741825
  - first: {x: 1, y: -6, z: 0}
    second:
      serializedVersion: 2
      m_TileIndex: 52
      m_TileSpriteIndex: 52
      m_TileMatrixIndex: 0
      m_TileColorIndex: 0
      m_TileObjectToInstantiateIndex: 65535
      dummyAlignment: 0
      m_AllTileFlags: 1073741825
  - first: {x: 2, y: -6, z: 0}
    second:
      serializedVersion: 2
      m_TileIndex: 53
      m_TileSpriteIndex: 53
      m_TileMatrixIndex: 0
      m_TileColorIndex: 0
      m_TileObjectToInstantiateIndex: 65535
      dummyAlignment: 0
      m_AllTileFlags: 1073741825
  - first: {x: 3, y: -6, z: 0}
    second:
      serializedVersion: 2
      m_TileIndex: 54
      m_TileSpriteIndex: 54
      m_TileMatrixIndex: 0
      m_TileColorIndex: 0
      m_TileObjectToInstantiateIndex: 65535
      dummyAlignment: 0
      m_AllTileFlags: 1073741825
  - first: {x: 4, y: -6, z: 0}
    second:
      serializedVersion: 2
      m_TileIndex: 55
      m_TileSpriteIndex: 55
      m_TileMatrixIndex: 0
      m_TileColorIndex: 0
      m_TileObjectToInstantiateIndex: 65535
      dummyAlignment: 0
      m_AllTileFlags: 1073741825
  - first: {x: 5, y: -6, z: 0}
    second:
      serializedVersion: 2
      m_TileIndex: 56
      m_TileSpriteIndex: 56
      m_TileMatrixIndex: 0
      m_TileColorIndex: 0
      m_TileObjectToInstantiateIndex: 65535
      dummyAlignment: 0
      m_AllTileFlags: 1073741825
  - first: {x: 6, y: -6, z: 0}
    second:
      serializedVersion: 2
      m_TileIndex: 57
      m_TileSpriteIndex: 57
      m_TileMatrixIndex: 0
      m_TileColorIndex: 0
      m_TileObjectToInstantiateIndex: 65535
      dummyAlignment: 0
      m_AllTileFlags: 1073741825
  - first: {x: 7, y: -6, z: 0}
    second:
      serializedVersion: 2
      m_TileIndex: 58
      m_TileSpriteIndex: 58
      m_TileMatrixIndex: 0
      m_TileColorIndex: 0
      m_TileObjectToInstantiateIndex: 65535
      dummyAlignment: 0
      m_AllTileFlags: 1073741825
  - first: {x: 8, y: -6, z: 0}
    second:
      serializedVersion: 2
      m_TileIndex: 59
      m_TileSpriteIndex: 59
      m_TileMatrixIndex: 0
      m_TileColorIndex: 0
      m_TileObjectToInstantiateIndex: 65535
      dummyAlignment: 0
      m_AllTileFlags: 1073741825
  - first: {x: -1, y: -5, z: 0}
    second:
      serializedVersion: 2
      m_TileIndex: 40
      m_TileSpriteIndex: 40
      m_TileMatrixIndex: 0
      m_TileColorIndex: 0
      m_TileObjectToInstantiateIndex: 65535
      dummyAlignment: 0
      m_AllTileFlags: 1073741825
  - first: {x: 0, y: -5, z: 0}
    second:
      serializedVersion: 2
      m_TileIndex: 41
      m_TileSpriteIndex: 41
      m_TileMatrixIndex: 0
      m_TileColorIndex: 0
      m_TileObjectToInstantiateIndex: 65535
      dummyAlignment: 0
      m_AllTileFlags: 1073741825
  - first: {x: 1, y: -5, z: 0}
    second:
      serializedVersion: 2
      m_TileIndex: 42
      m_TileSpriteIndex: 42
      m_TileMatrixIndex: 0
      m_TileColorIndex: 0
      m_TileObjectToInstantiateIndex: 65535
      dummyAlignment: 0
      m_AllTileFlags: 1073741825
  - first: {x: 2, y: -5, z: 0}
    second:
      serializedVersion: 2
      m_TileIndex: 43
      m_TileSpriteIndex: 43
      m_TileMatrixIndex: 0
      m_TileColorIndex: 0
      m_TileObjectToInstantiateIndex: 65535
      dummyAlignment: 0
      m_AllTileFlags: 1073741825
  - first: {x: 3, y: -5, z: 0}
    second:
      serializedVersion: 2
      m_TileIndex: 44
      m_TileSpriteIndex: 44
      m_TileMatrixIndex: 0
      m_TileColorIndex: 0
      m_TileObjectToInstantiateIndex: 65535
      dummyAlignment: 0
      m_AllTileFlags: 1073741825
  - first: {x: 4, y: -5, z: 0}
    second:
      serializedVersion: 2
      m_TileIndex: 45
      m_TileSpriteIndex: 45
      m_TileMatrixIndex: 0
      m_TileColorIndex: 0
      m_TileObjectToInstantiateIndex: 65535
      dummyAlignment: 0
      m_AllTileFlags: 1073741825
  - first: {x: 5, y: -5, z: 0}
    second:
      serializedVersion: 2
      m_TileIndex: 46
      m_TileSpriteIndex: 46
      m_TileMatrixIndex: 0
      m_TileColorIndex: 0
      m_TileObjectToInstantiateIndex: 65535
      dummyAlignment: 0
      m_AllTileFlags: 1073741825
  - first: {x: 6, y: -5, z: 0}
    second:
      serializedVersion: 2
      m_TileIndex: 47
      m_TileSpriteIndex: 47
      m_TileMatrixIndex: 0
      m_TileColorIndex: 0
      m_TileObjectToInstantiateIndex: 65535
      dummyAlignment: 0
      m_AllTileFlags: 1073741825
  - first: {x: 7, y: -5, z: 0}
    second:
      serializedVersion: 2
      m_TileIndex: 48
      m_TileSpriteIndex: 48
      m_TileMatrixIndex: 0
      m_TileColorIndex: 0
      m_TileObjectToInstantiateIndex: 65535
      dummyAlignment: 0
      m_AllTileFlags: 1073741825
  - first: {x: 8, y: -5, z: 0}
    second:
      serializedVersion: 2
      m_TileIndex: 49
      m_TileSpriteIndex: 49
      m_TileMatrixIndex: 0
      m_TileColorIndex: 0
      m_TileObjectToInstantiateIndex: 65535
      dummyAlignment: 0
      m_AllTileFlags: 1073741825
  - first: {x: -1, y: -4, z: 0}
    second:
      serializedVersion: 2
      m_TileIndex: 30
      m_TileSpriteIndex: 30
      m_TileMatrixIndex: 0
      m_TileColorIndex: 0
      m_TileObjectToInstantiateIndex: 65535
      dummyAlignment: 0
      m_AllTileFlags: 1073741825
  - first: {x: 0, y: -4, z: 0}
    second:
      serializedVersion: 2
      m_TileIndex: 31
      m_TileSpriteIndex: 31
      m_TileMatrixIndex: 0
      m_TileColorIndex: 0
      m_TileObjectToInstantiateIndex: 65535
      dummyAlignment: 0
      m_AllTileFlags: 1073741825
  - first: {x: 1, y: -4, z: 0}
    second:
      serializedVersion: 2
      m_TileIndex: 32
      m_TileSpriteIndex: 32
      m_TileMatrixIndex: 0
      m_TileColorIndex: 0
      m_TileObjectToInstantiateIndex: 65535
      dummyAlignment: 0
      m_AllTileFlags: 1073741825
  - first: {x: 2, y: -4, z: 0}
    second:
      serializedVersion: 2
      m_TileIndex: 33
      m_TileSpriteIndex: 33
      m_TileMatrixIndex: 0
      m_TileColorIndex: 0
      m_TileObjectToInstantiateIndex: 65535
      dummyAlignment: 0
      m_AllTileFlags: 1073741825
  - first: {x: 3, y: -4, z: 0}
    second:
      serializedVersion: 2
      m_TileIndex: 34
      m_TileSpriteIndex: 34
      m_TileMatrixIndex: 0
      m_TileColorIndex: 0
      m_TileObjectToInstantiateIndex: 65535
      dummyAlignment: 0
      m_AllTileFlags: 1073741825
  - first: {x: 4, y: -4, z: 0}
    second:
      serializedVersion: 2
      m_TileIndex: 35
      m_TileSpriteIndex: 35
      m_TileMatrixIndex: 0
      m_TileColorIndex: 0
      m_TileObjectToInstantiateIndex: 65535
      dummyAlignment: 0
      m_AllTileFlags: 1073741825
  - first: {x: 5, y: -4, z: 0}
    second:
      serializedVersion: 2
      m_TileIndex: 36
      m_TileSpriteIndex: 36
      m_TileMatrixIndex: 0
      m_TileColorIndex: 0
      m_TileObjectToInstantiateIndex: 65535
      dummyAlignment: 0
      m_AllTileFlags: 1073741825
  - first: {x: 6, y: -4, z: 0}
    second:
      serializedVersion: 2
      m_TileIndex: 37
      m_TileSpriteIndex: 37
      m_TileMatrixIndex: 0
      m_TileColorIndex: 0
      m_TileObjectToInstantiateIndex: 65535
      dummyAlignment: 0
      m_AllTileFlags: 1073741825
  - first: {x: 7, y: -4, z: 0}
    second:
      serializedVersion: 2
      m_TileIndex: 38
      m_TileSpriteIndex: 38
      m_TileMatrixIndex: 0
      m_TileColorIndex: 0
      m_TileObjectToInstantiateIndex: 65535
      dummyAlignment: 0
      m_AllTileFlags: 1073741825
  - first: {x: 8, y: -4, z: 0}
    second:
      serializedVersion: 2
      m_TileIndex: 39
      m_TileSpriteIndex: 39
      m_TileMatrixIndex: 0
      m_TileColorIndex: 0
      m_TileObjectToInstantiateIndex: 65535
      dummyAlignment: 0
      m_AllTileFlags: 1073741825
  - first: {x: -1, y: -3, z: 0}
    second:
      serializedVersion: 2
      m_TileIndex: 20
      m_TileSpriteIndex: 20
      m_TileMatrixIndex: 0
      m_TileColorIndex: 0
      m_TileObjectToInstantiateIndex: 65535
      dummyAlignment: 0
      m_AllTileFlags: 1073741825
  - first: {x: 0, y: -3, z: 0}
    second:
      serializedVersion: 2
      m_TileIndex: 21
      m_TileSpriteIndex: 21
      m_TileMatrixIndex: 0
      m_TileColorIndex: 0
      m_TileObjectToInstantiateIndex: 65535
      dummyAlignment: 0
      m_AllTileFlags: 1073741825
  - first: {x: 1, y: -3, z: 0}
    second:
      serializedVersion: 2
      m_TileIndex: 22
      m_TileSpriteIndex: 22
      m_TileMatrixIndex: 0
      m_TileColorIndex: 0
      m_TileObjectToInstantiateIndex: 65535
      dummyAlignment: 0
      m_AllTileFlags: 1073741825
  - first: {x: 2, y: -3, z: 0}
    second:
      serializedVersion: 2
      m_TileIndex: 23
      m_TileSpriteIndex: 23
      m_TileMatrixIndex: 0
      m_TileColorIndex: 0
      m_TileObjectToInstantiateIndex: 65535
      dummyAlignment: 0
      m_AllTileFlags: 1073741825
  - first: {x: 3, y: -3, z: 0}
    second:
      serializedVersion: 2
      m_TileIndex: 24
      m_TileSpriteIndex: 24
      m_TileMatrixIndex: 0
      m_TileColorIndex: 0
      m_TileObjectToInstantiateIndex: 65535
      dummyAlignment: 0
      m_AllTileFlags: 1073741825
  - first: {x: 4, y: -3, z: 0}
    second:
      serializedVersion: 2
      m_TileIndex: 25
      m_TileSpriteIndex: 25
      m_TileMatrixIndex: 0
      m_TileColorIndex: 0
      m_TileObjectToInstantiateIndex: 65535
      dummyAlignment: 0
      m_AllTileFlags: 1073741825
  - first: {x: 5, y: -3, z: 0}
    second:
      serializedVersion: 2
      m_TileIndex: 26
      m_TileSpriteIndex: 26
      m_TileMatrixIndex: 0
      m_TileColorIndex: 0
      m_TileObjectToInstantiateIndex: 65535
      dummyAlignment: 0
      m_AllTileFlags: 1073741825
  - first: {x: 6, y: -3, z: 0}
    second:
      serializedVersion: 2
      m_TileIndex: 27
      m_TileSpriteIndex: 27
      m_TileMatrixIndex: 0
      m_TileColorIndex: 0
      m_TileObjectToInstantiateIndex: 65535
      dummyAlignment: 0
      m_AllTileFlags: 1073741825
  - first: {x: 7, y: -3, z: 0}
    second:
      serializedVersion: 2
      m_TileIndex: 28
      m_TileSpriteIndex: 28
      m_TileMatrixIndex: 0
      m_TileColorIndex: 0
      m_TileObjectToInstantiateIndex: 65535
      dummyAlignment: 0
      m_AllTileFlags: 1073741825
  - first: {x: 8, y: -3, z: 0}
    second:
      serializedVersion: 2
      m_TileIndex: 29
      m_TileSpriteIndex: 29
      m_TileMatrixIndex: 0
      m_TileColorIndex: 0
      m_TileObjectToInstantiateIndex: 65535
      dummyAlignment: 0
      m_AllTileFlags: 1073741825
  - first: {x: -1, y: -2, z: 0}
    second:
      serializedVersion: 2
      m_TileIndex: 10
      m_TileSpriteIndex: 10
      m_TileMatrixIndex: 0
      m_TileColorIndex: 0
      m_TileObjectToInstantiateIndex: 65535
      dummyAlignment: 0
      m_AllTileFlags: 1073741825
  - first: {x: 0, y: -2, z: 0}
    second:
      serializedVersion: 2
      m_TileIndex: 11
      m_TileSpriteIndex: 11
      m_TileMatrixIndex: 0
      m_TileColorIndex: 0
      m_TileObjectToInstantiateIndex: 65535
      dummyAlignment: 0
      m_AllTileFlags: 1073741825
  - first: {x: 1, y: -2, z: 0}
    second:
      serializedVersion: 2
      m_TileIndex: 12
      m_TileSpriteIndex: 12
      m_TileMatrixIndex: 0
      m_TileColorIndex: 0
      m_TileObjectToInstantiateIndex: 65535
      dummyAlignment: 0
      m_AllTileFlags: 1073741825
  - first: {x: 2, y: -2, z: 0}
    second:
      serializedVersion: 2
      m_TileIndex: 13
      m_TileSpriteIndex: 13
      m_TileMatrixIndex: 0
      m_TileColorIndex: 0
      m_TileObjectToInstantiateIndex: 65535
      dummyAlignment: 0
      m_AllTileFlags: 1073741825
  - first: {x: 3, y: -2, z: 0}
    second:
      serializedVersion: 2
      m_TileIndex: 14
      m_TileSpriteIndex: 14
      m_TileMatrixIndex: 0
      m_TileColorIndex: 0
      m_TileObjectToInstantiateIndex: 65535
      dummyAlignment: 0
      m_AllTileFlags: 1073741825
  - first: {x: 4, y: -2, z: 0}
    second:
      serializedVersion: 2
      m_TileIndex: 15
      m_TileSpriteIndex: 15
      m_TileMatrixIndex: 0
      m_TileColorIndex: 0
      m_TileObjectToInstantiateIndex: 65535
      dummyAlignment: 0
      m_AllTileFlags: 1073741825
  - first: {x: 5, y: -2, z: 0}
    second:
      serializedVersion: 2
      m_TileIndex: 16
      m_TileSpriteIndex: 16
      m_TileMatrixIndex: 0
      m_TileColorIndex: 0
      m_TileObjectToInstantiateIndex: 65535
      dummyAlignment: 0
      m_AllTileFlags: 1073741825
  - first: {x: 6, y: -2, z: 0}
    second:
      serializedVersion: 2
      m_TileIndex: 17
      m_TileSpriteIndex: 17
      m_TileMatrixIndex: 0
      m_TileColorIndex: 0
      m_TileObjectToInstantiateIndex: 65535
      dummyAlignment: 0
      m_AllTileFlags: 1073741825
  - first: {x: 7, y: -2, z: 0}
    second:
      serializedVersion: 2
      m_TileIndex: 18
      m_TileSpriteIndex: 18
      m_TileMatrixIndex: 0
      m_TileColorIndex: 0
      m_TileObjectToInstantiateIndex: 65535
      dummyAlignment: 0
      m_AllTileFlags: 1073741825
  - first: {x: 8, y: -2, z: 0}
    second:
      serializedVersion: 2
      m_TileIndex: 19
      m_TileSpriteIndex: 19
      m_TileMatrixIndex: 0
      m_TileColorIndex: 0
      m_TileObjectToInstantiateIndex: 65535
      dummyAlignment: 0
      m_AllTileFlags: 1073741825
  - first: {x: -1, y: -1, z: 0}
    second:
      serializedVersion: 2
      m_TileIndex: 0
      m_TileSpriteIndex: 0
      m_TileMatrixIndex: 0
      m_TileColorIndex: 0
      m_TileObjectToInstantiateIndex: 65535
      dummyAlignment: 0
      m_AllTileFlags: 1073741825
  - first: {x: 0, y: -1, z: 0}
    second:
      serializedVersion: 2
      m_TileIndex: 1
      m_TileSpriteIndex: 1
      m_TileMatrixIndex: 0
      m_TileColorIndex: 0
      m_TileObjectToInstantiateIndex: 65535
      dummyAlignment: 0
      m_AllTileFlags: 1073741825
  - first: {x: 1, y: -1, z: 0}
    second:
      serializedVersion: 2
      m_TileIndex: 2
      m_TileSpriteIndex: 2
      m_TileMatrixIndex: 0
      m_TileColorIndex: 0
      m_TileObjectToInstantiateIndex: 65535
      dummyAlignment: 0
      m_AllTileFlags: 1073741825
  - first: {x: 2, y: -1, z: 0}
    second:
      serializedVersion: 2
      m_TileIndex: 3
      m_TileSpriteIndex: 3
      m_TileMatrixIndex: 0
      m_TileColorIndex: 0
      m_TileObjectToInstantiateIndex: 65535
      dummyAlignment: 0
      m_AllTileFlags: 1073741825
  - first: {x: 3, y: -1, z: 0}
    second:
      serializedVersion: 2
      m_TileIndex: 4
      m_TileSpriteIndex: 4
      m_TileMatrixIndex: 0
      m_TileColorIndex: 0
      m_TileObjectToInstantiateIndex: 65535
      dummyAlignment: 0
      m_AllTileFlags: 1073741825
  - first: {x: 4, y: -1, z: 0}
    second:
      serializedVersion: 2
      m_TileIndex: 5
      m_TileSpriteIndex: 5
      m_TileMatrixIndex: 0
      m_TileColorIndex: 0
      m_TileObjectToInstantiateIndex: 65535
      dummyAlignment: 0
      m_AllTileFlags: 1073741825
  - first: {x: 5, y: -1, z: 0}
    second:
      serializedVersion: 2
      m_TileIndex: 6
      m_TileSpriteIndex: 6
      m_TileMatrixIndex: 0
      m_TileColorIndex: 0
      m_TileObjectToInstantiateIndex: 65535
      dummyAlignment: 0
      m_AllTileFlags: 1073741825
  - first: {x: 6, y: -1, z: 0}
    second:
      serializedVersion: 2
      m_TileIndex: 7
      m_TileSpriteIndex: 7
      m_TileMatrixIndex: 0
      m_TileColorIndex: 0
      m_TileObjectToInstantiateIndex: 65535
      dummyAlignment: 0
      m_AllTileFlags: 1073741825
  - first: {x: 7, y: -1, z: 0}
    second:
      serializedVersion: 2
      m_TileIndex: 8
      m_TileSpriteIndex: 8
      m_TileMatrixIndex: 0
      m_TileColorIndex: 0
      m_TileObjectToInstantiateIndex: 65535
      dummyAlignment: 0
      m_AllTileFlags: 1073741825
  - first: {x: 8, y: -1, z: 0}
    second:
      serializedVersion: 2
      m_TileIndex: 9
      m_TileSpriteIndex: 9
      m_TileMatrixIndex: 0
      m_TileColorIndex: 0
      m_TileObjectToInstantiateIndex: 65535
      dummyAlignment: 0
      m_AllTileFlags: 1073741825
  m_AnimatedTiles: {}
  m_TileAssetArray:
  - m_RefCount: 1
    m_Data: {fileID: 11400000, guid: dcbae9ba7bfbc3f4888cd869298857d1, type: 2}
  - m_RefCount: 1
    m_Data: {fileID: 11400000, guid: 8efda6e147051444f87d7525bd57ab3a, type: 2}
  - m_RefCount: 1
    m_Data: {fileID: 11400000, guid: 36cc4c60821d8ef478a272dded264ca5, type: 2}
  - m_RefCount: 1
    m_Data: {fileID: 11400000, guid: e593fd9362e86d34cae5b5bb9c7a732e, type: 2}
  - m_RefCount: 1
    m_Data: {fileID: 11400000, guid: a1f259ee5f418a84fa06e19ae610cdd0, type: 2}
  - m_RefCount: 1
    m_Data: {fileID: 11400000, guid: 8b3b753eae378374e841bf8f79910727, type: 2}
  - m_RefCount: 1
    m_Data: {fileID: 11400000, guid: 2d70c8087f470cc429a773e15c21d748, type: 2}
  - m_RefCount: 1
    m_Data: {fileID: 11400000, guid: 7061134e1f3042441bbf12bb43f0d570, type: 2}
  - m_RefCount: 1
    m_Data: {fileID: 11400000, guid: ed8d9d4b6bc11124d9ffe39dd9516f66, type: 2}
  - m_RefCount: 1
    m_Data: {fileID: 11400000, guid: b4f83a0cc2b6f834e81de956b8b20e7c, type: 2}
  - m_RefCount: 1
    m_Data: {fileID: 11400000, guid: 194583bec7a3cb44e847569b86ce94cb, type: 2}
  - m_RefCount: 1
    m_Data: {fileID: 11400000, guid: 15e3f5d3c6a8b39428ce0b9a1d6ed457, type: 2}
  - m_RefCount: 1
    m_Data: {fileID: 11400000, guid: 2ba5473c0df60844fb3949f196baa9b7, type: 2}
  - m_RefCount: 1
    m_Data: {fileID: 11400000, guid: 3a5a0ffa4b22b214c876ed0a7896103c, type: 2}
  - m_RefCount: 1
    m_Data: {fileID: 11400000, guid: 0dec0c3fec358714da214fe49d0c3196, type: 2}
  - m_RefCount: 1
    m_Data: {fileID: 11400000, guid: b100a8e66b6ebee449d6fd3423ed4fae, type: 2}
  - m_RefCount: 1
    m_Data: {fileID: 11400000, guid: 205da60a2209abe44a7a31586b4d4c42, type: 2}
  - m_RefCount: 1
    m_Data: {fileID: 11400000, guid: 259e79d3ab0290b4f9ecb9ee7548c92e, type: 2}
  - m_RefCount: 1
    m_Data: {fileID: 11400000, guid: 3c2f375c64c34834f8fc57628d4910e6, type: 2}
  - m_RefCount: 1
    m_Data: {fileID: 11400000, guid: 1a113624ef91a764cb635f3045665183, type: 2}
  - m_RefCount: 1
    m_Data: {fileID: 11400000, guid: d01b27b82395a0b439b4935253429d10, type: 2}
  - m_RefCount: 1
    m_Data: {fileID: 11400000, guid: 366abb819d102b34aadce745b0aac418, type: 2}
  - m_RefCount: 1
    m_Data: {fileID: 11400000, guid: ef7d0d7918ad5a84c86aa851ce239ed3, type: 2}
  - m_RefCount: 1
    m_Data: {fileID: 11400000, guid: d89afb48a3d2d90458f5d63a07d4ffed, type: 2}
  - m_RefCount: 1
    m_Data: {fileID: 11400000, guid: 93acc2ac61f8a734d9d0e29535e879a5, type: 2}
  - m_RefCount: 1
    m_Data: {fileID: 11400000, guid: 8e496d31dbdbf894487968b3d674c08b, type: 2}
  - m_RefCount: 1
    m_Data: {fileID: 11400000, guid: 3e5bc55d816590c498221ee5659442bb, type: 2}
  - m_RefCount: 1
    m_Data: {fileID: 11400000, guid: 0d773d763592fa348af3ddfd3a880678, type: 2}
  - m_RefCount: 1
    m_Data: {fileID: 11400000, guid: 49f1fdffb31ad4043849152502a63316, type: 2}
  - m_RefCount: 1
    m_Data: {fileID: 11400000, guid: 59798ddbfa1ffcb4291119ff87cc711f, type: 2}
  - m_RefCount: 1
    m_Data: {fileID: 11400000, guid: a36e55fc788cf10479a8d2eed04169a7, type: 2}
  - m_RefCount: 1
    m_Data: {fileID: 11400000, guid: 84a2d0472fc958f47be04b9f7c735604, type: 2}
  - m_RefCount: 1
    m_Data: {fileID: 11400000, guid: 289e801088f5d1447918f585beee889d, type: 2}
  - m_RefCount: 1
    m_Data: {fileID: 11400000, guid: 4f2009cc190ca3247993711244432b9b, type: 2}
  - m_RefCount: 1
    m_Data: {fileID: 11400000, guid: 710d9a6d964a0664ab6566d0a1db9153, type: 2}
  - m_RefCount: 1
    m_Data: {fileID: 11400000, guid: 697f6136ae2f53a4d8afc9bd47dca96b, type: 2}
  - m_RefCount: 1
    m_Data: {fileID: 11400000, guid: f4a35fd7e2507154ab577ca8e010fcdc, type: 2}
  - m_RefCount: 1
    m_Data: {fileID: 11400000, guid: deb23dd8bcb2e6a4a8db9622ac16d253, type: 2}
  - m_RefCount: 1
    m_Data: {fileID: 11400000, guid: f0bc22cf3a4331343818fa8ef758f072, type: 2}
  - m_RefCount: 1
    m_Data: {fileID: 11400000, guid: bc4c2808dfe5201479ee7b91788729bf, type: 2}
  - m_RefCount: 1
    m_Data: {fileID: 11400000, guid: 1cbfcb71577af5e429eeadc8e8401477, type: 2}
  - m_RefCount: 1
    m_Data: {fileID: 11400000, guid: 43c11b882c8143443bf81bd8712bc951, type: 2}
  - m_RefCount: 1
    m_Data: {fileID: 11400000, guid: 7db43d7617be6d44d93ef68317c04111, type: 2}
  - m_RefCount: 1
    m_Data: {fileID: 11400000, guid: 592fe3cb7e18a3a4e8fe771b2be26aa5, type: 2}
  - m_RefCount: 1
    m_Data: {fileID: 11400000, guid: c51407352346b1549ac8995f8c808849, type: 2}
  - m_RefCount: 1
    m_Data: {fileID: 11400000, guid: 51ab5838f7cc00b4d9d3930a95c08907, type: 2}
  - m_RefCount: 1
    m_Data: {fileID: 11400000, guid: 4f20ecc4f2eaf4f48b0f55da6db90ed9, type: 2}
  - m_RefCount: 1
    m_Data: {fileID: 11400000, guid: be6cbe39bda97d247a759ad8f39db189, type: 2}
  - m_RefCount: 1
    m_Data: {fileID: 11400000, guid: 5c90236e6c728274dae0545eb2ca85b9, type: 2}
  - m_RefCount: 1
    m_Data: {fileID: 11400000, guid: c058eec8d62d1bd42ad639c07058ea5e, type: 2}
  - m_RefCount: 1
    m_Data: {fileID: 11400000, guid: bd943f5efbd579c4f825b6c5b7d5df00, type: 2}
  - m_RefCount: 1
    m_Data: {fileID: 11400000, guid: 586c9c862be53ef48bb77d1c3b3fbbaf, type: 2}
  - m_RefCount: 1
    m_Data: {fileID: 11400000, guid: 60868de6d7ebd1e4bae3e19d700ab5b4, type: 2}
  - m_RefCount: 1
    m_Data: {fileID: 11400000, guid: 28fbd8bc5b7ebea4b85c67b74bd163b7, type: 2}
  - m_RefCount: 1
    m_Data: {fileID: 11400000, guid: c98a38055f9702745a0e85625f6d8cb1, type: 2}
  - m_RefCount: 1
    m_Data: {fileID: 11400000, guid: 1ec0a940fa738004cbf08b24b58d27ed, type: 2}
  - m_RefCount: 1
    m_Data: {fileID: 11400000, guid: 94b2f41a24c97514d8245af16bf2f05e, type: 2}
  - m_RefCount: 1
    m_Data: {fileID: 11400000, guid: b5379e9b35d5e3f47a457adf50be7691, type: 2}
  - m_RefCount: 1
    m_Data: {fileID: 11400000, guid: 6cd7c81a742bce54b9775b1b88a6546d, type: 2}
  - m_RefCount: 1
    m_Data: {fileID: 11400000, guid: 7fee2c971ca47ea4f9decb4419d37207, type: 2}
  - m_RefCount: 1
    m_Data: {fileID: 11400000, guid: 19933b67a54594c48a955f548e10a5d3, type: 2}
  - m_RefCount: 1
    m_Data: {fileID: 11400000, guid: 1c065410fffc38746985f053454c91e8, type: 2}
  - m_RefCount: 1
    m_Data: {fileID: 11400000, guid: c541b6dffe8b1894c814ac7d9f02de09, type: 2}
  - m_RefCount: 1
    m_Data: {fileID: 11400000, guid: c83f16c84ffce644eb974cff061da333, type: 2}
  - m_RefCount: 1
    m_Data: {fileID: 11400000, guid: 478fa1350ae4ef5469e6d07b6f4b8bed, type: 2}
  - m_RefCount: 1
    m_Data: {fileID: 11400000, guid: 5a9e72bd66e058b409ae2536c496ea9d, type: 2}
  - m_RefCount: 1
    m_Data: {fileID: 11400000, guid: f1c9ff66c8ab8684d897401a3b6c11c8, type: 2}
  - m_RefCount: 1
    m_Data: {fileID: 11400000, guid: 4fee11d622e8bc944a6993a12994a6b2, type: 2}
  - m_RefCount: 1
    m_Data: {fileID: 11400000, guid: cd009b04169dfd941aa0022abe8e9be5, type: 2}
  - m_RefCount: 1
    m_Data: {fileID: 11400000, guid: 58d537fd199d7c34286f8199d39f751d, type: 2}
  - m_RefCount: 1
    m_Data: {fileID: 11400000, guid: 083ecf5903909f54f8466e0af8df6d52, type: 2}
  - m_RefCount: 1
    m_Data: {fileID: 11400000, guid: c566c8060d578d74d98f869441b8cf6a, type: 2}
  - m_RefCount: 1
    m_Data: {fileID: 11400000, guid: ca7c55fc7f1e1d64ea268cb8a3549f11, type: 2}
  - m_RefCount: 1
    m_Data: {fileID: 11400000, guid: 15c3f55c3af86f34e91df790d54c2064, type: 2}
  - m_RefCount: 1
    m_Data: {fileID: 11400000, guid: 7f8e10575ce47a94eb95878241d34739, type: 2}
  - m_RefCount: 1
    m_Data: {fileID: 11400000, guid: bff1bf1fc7df12a4fa96a2f6d26bfb6d, type: 2}
  - m_RefCount: 1
    m_Data: {fileID: 11400000, guid: c3b03968434cf234fa85dd2f7dfbbb89, type: 2}
  - m_RefCount: 1
    m_Data: {fileID: 11400000, guid: bb98ac05ecf61574688bfd1ee6163019, type: 2}
  - m_RefCount: 1
    m_Data: {fileID: 11400000, guid: b78c5183af131eb4586ec38b341d1818, type: 2}
  - m_RefCount: 1
    m_Data: {fileID: 11400000, guid: 0f1ba47a2fb05d64abed11c98c7bc6d7, type: 2}
  - m_RefCount: 1
    m_Data: {fileID: 11400000, guid: a1e67221297d12a4e9a9122869b53fcb, type: 2}
  - m_RefCount: 1
    m_Data: {fileID: 11400000, guid: 2b9cf5fcfb17a244792f634c9b9a2965, type: 2}
  - m_RefCount: 1
    m_Data: {fileID: 11400000, guid: 6096be4312630604c8f048f378210b88, type: 2}
  - m_RefCount: 1
    m_Data: {fileID: 11400000, guid: 717c0a2abb1404142939427df22530ce, type: 2}
  - m_RefCount: 1
    m_Data: {fileID: 11400000, guid: 2c093ca5626509e4192aa94d88dba964, type: 2}
  - m_RefCount: 1
    m_Data: {fileID: 11400000, guid: a29bdf480eedd274faee503050939004, type: 2}
  - m_RefCount: 1
    m_Data: {fileID: 11400000, guid: ea12eb74b54a56043988b585c5e805cc, type: 2}
  - m_RefCount: 1
    m_Data: {fileID: 11400000, guid: 29bf9d35ab2227248877b6899fa8aadd, type: 2}
  - m_RefCount: 1
    m_Data: {fileID: 11400000, guid: bfa7b6183c9f2954ca05c7d90cd8afa3, type: 2}
  - m_RefCount: 1
    m_Data: {fileID: 11400000, guid: ad23065835870394a9be0d3c6bbbae09, type: 2}
  - m_RefCount: 1
    m_Data: {fileID: 11400000, guid: 9cb5cf963ef6f5f4d9f472ad1feaa15a, type: 2}
  - m_RefCount: 1
    m_Data: {fileID: 11400000, guid: 193a7d25c8a52524ba999826d3fab7a0, type: 2}
  - m_RefCount: 1
    m_Data: {fileID: 11400000, guid: 84a10dfbd2fe370439213c64fb0f61d2, type: 2}
  - m_RefCount: 1
    m_Data: {fileID: 11400000, guid: d0ceb3d3102d7b044aa6a9f47a7677f4, type: 2}
  - m_RefCount: 1
    m_Data: {fileID: 11400000, guid: cab71bb0880fdde45854e9901007f6b1, type: 2}
  - m_RefCount: 1
    m_Data: {fileID: 11400000, guid: f31b25afe459cab4f94d7fc6be0a61af, type: 2}
  - m_RefCount: 1
    m_Data: {fileID: 11400000, guid: 4e4df95d2ac226a418f4a7d9bebb26d5, type: 2}
  - m_RefCount: 1
    m_Data: {fileID: 11400000, guid: 0489a56b83f6f324b874f559fd3317ce, type: 2}
  - m_RefCount: 1
    m_Data: {fileID: 11400000, guid: dcc9037a4f7afb54590e900c96cc0b93, type: 2}
  - m_RefCount: 1
    m_Data: {fileID: 11400000, guid: d57562f37a23c7840852030d16b21283, type: 2}
  m_TileSpriteArray:
  - m_RefCount: 1
    m_Data: {fileID: -1651720120, guid: 14c86d43e48aec54482c830cdbfa8840, type: 3}
  - m_RefCount: 1
    m_Data: {fileID: -141447017, guid: 14c86d43e48aec54482c830cdbfa8840, type: 3}
  - m_RefCount: 1
    m_Data: {fileID: 718010249, guid: 14c86d43e48aec54482c830cdbfa8840, type: 3}
  - m_RefCount: 1
    m_Data: {fileID: 775267123, guid: 14c86d43e48aec54482c830cdbfa8840, type: 3}
  - m_RefCount: 1
    m_Data: {fileID: -1199164459, guid: 14c86d43e48aec54482c830cdbfa8840, type: 3}
  - m_RefCount: 1
    m_Data: {fileID: 1671854838, guid: 14c86d43e48aec54482c830cdbfa8840, type: 3}
  - m_RefCount: 1
    m_Data: {fileID: 31421668, guid: 14c86d43e48aec54482c830cdbfa8840, type: 3}
  - m_RefCount: 1
    m_Data: {fileID: -1765917151, guid: 14c86d43e48aec54482c830cdbfa8840, type: 3}
  - m_RefCount: 1
    m_Data: {fileID: -1810832677, guid: 14c86d43e48aec54482c830cdbfa8840, type: 3}
  - m_RefCount: 1
    m_Data: {fileID: 1763905379, guid: 14c86d43e48aec54482c830cdbfa8840, type: 3}
  - m_RefCount: 1
    m_Data: {fileID: 851843444, guid: 14c86d43e48aec54482c830cdbfa8840, type: 3}
  - m_RefCount: 1
    m_Data: {fileID: 1800408765, guid: 14c86d43e48aec54482c830cdbfa8840, type: 3}
  - m_RefCount: 1
    m_Data: {fileID: -56983475, guid: 14c86d43e48aec54482c830cdbfa8840, type: 3}
  - m_RefCount: 1
    m_Data: {fileID: -1195804852, guid: 14c86d43e48aec54482c830cdbfa8840, type: 3}
  - m_RefCount: 1
    m_Data: {fileID: 1914237086, guid: 14c86d43e48aec54482c830cdbfa8840, type: 3}
  - m_RefCount: 1
    m_Data: {fileID: 1518354985, guid: 14c86d43e48aec54482c830cdbfa8840, type: 3}
  - m_RefCount: 1
    m_Data: {fileID: 295604912, guid: 14c86d43e48aec54482c830cdbfa8840, type: 3}
  - m_RefCount: 1
    m_Data: {fileID: 1108706045, guid: 14c86d43e48aec54482c830cdbfa8840, type: 3}
  - m_RefCount: 1
    m_Data: {fileID: -1920897723, guid: 14c86d43e48aec54482c830cdbfa8840, type: 3}
  - m_RefCount: 1
    m_Data: {fileID: 233853838, guid: 14c86d43e48aec54482c830cdbfa8840, type: 3}
  - m_RefCount: 1
    m_Data: {fileID: 1071643282, guid: 14c86d43e48aec54482c830cdbfa8840, type: 3}
  - m_RefCount: 1
    m_Data: {fileID: -800050574, guid: 14c86d43e48aec54482c830cdbfa8840, type: 3}
  - m_RefCount: 1
    m_Data: {fileID: 1062192880, guid: 14c86d43e48aec54482c830cdbfa8840, type: 3}
  - m_RefCount: 1
    m_Data: {fileID: 483178911, guid: 14c86d43e48aec54482c830cdbfa8840, type: 3}
  - m_RefCount: 1
    m_Data: {fileID: 1841621624, guid: 14c86d43e48aec54482c830cdbfa8840, type: 3}
  - m_RefCount: 1
    m_Data: {fileID: 667631678, guid: 14c86d43e48aec54482c830cdbfa8840, type: 3}
  - m_RefCount: 1
    m_Data: {fileID: 3267248, guid: 14c86d43e48aec54482c830cdbfa8840, type: 3}
  - m_RefCount: 1
    m_Data: {fileID: -896053772, guid: 14c86d43e48aec54482c830cdbfa8840, type: 3}
  - m_RefCount: 1
    m_Data: {fileID: -1987603250, guid: 14c86d43e48aec54482c830cdbfa8840, type: 3}
  - m_RefCount: 1
    m_Data: {fileID: -797734064, guid: 14c86d43e48aec54482c830cdbfa8840, type: 3}
  - m_RefCount: 1
    m_Data: {fileID: -1699960115, guid: 14c86d43e48aec54482c830cdbfa8840, type: 3}
  - m_RefCount: 1
    m_Data: {fileID: -2047627332, guid: 14c86d43e48aec54482c830cdbfa8840, type: 3}
  - m_RefCount: 1
    m_Data: {fileID: -2117331114, guid: 14c86d43e48aec54482c830cdbfa8840, type: 3}
  - m_RefCount: 1
    m_Data: {fileID: 372521497, guid: 14c86d43e48aec54482c830cdbfa8840, type: 3}
  - m_RefCount: 1
    m_Data: {fileID: -1741389541, guid: 14c86d43e48aec54482c830cdbfa8840, type: 3}
  - m_RefCount: 1
    m_Data: {fileID: 1114889842, guid: 14c86d43e48aec54482c830cdbfa8840, type: 3}
  - m_RefCount: 1
    m_Data: {fileID: -1298442659, guid: 14c86d43e48aec54482c830cdbfa8840, type: 3}
  - m_RefCount: 1
    m_Data: {fileID: -1883309789, guid: 14c86d43e48aec54482c830cdbfa8840, type: 3}
  - m_RefCount: 1
    m_Data: {fileID: 907501532, guid: 14c86d43e48aec54482c830cdbfa8840, type: 3}
  - m_RefCount: 1
    m_Data: {fileID: 655227391, guid: 14c86d43e48aec54482c830cdbfa8840, type: 3}
  - m_RefCount: 1
    m_Data: {fileID: 476488211, guid: 14c86d43e48aec54482c830cdbfa8840, type: 3}
  - m_RefCount: 1
    m_Data: {fileID: 1924537823, guid: 14c86d43e48aec54482c830cdbfa8840, type: 3}
  - m_RefCount: 1
    m_Data: {fileID: 224864575, guid: 14c86d43e48aec54482c830cdbfa8840, type: 3}
  - m_RefCount: 1
    m_Data: {fileID: -963799849, guid: 14c86d43e48aec54482c830cdbfa8840, type: 3}
  - m_RefCount: 1
    m_Data: {fileID: 897852920, guid: 14c86d43e48aec54482c830cdbfa8840, type: 3}
  - m_RefCount: 1
    m_Data: {fileID: 25805122, guid: 14c86d43e48aec54482c830cdbfa8840, type: 3}
  - m_RefCount: 1
    m_Data: {fileID: 576722617, guid: 14c86d43e48aec54482c830cdbfa8840, type: 3}
  - m_RefCount: 1
    m_Data: {fileID: -1486194200, guid: 14c86d43e48aec54482c830cdbfa8840, type: 3}
  - m_RefCount: 1
    m_Data: {fileID: 1711385858, guid: 14c86d43e48aec54482c830cdbfa8840, type: 3}
  - m_RefCount: 1
    m_Data: {fileID: -1003805160, guid: 14c86d43e48aec54482c830cdbfa8840, type: 3}
  - m_RefCount: 1
    m_Data: {fileID: -517249540, guid: 14c86d43e48aec54482c830cdbfa8840, type: 3}
  - m_RefCount: 1
    m_Data: {fileID: -351668748, guid: 14c86d43e48aec54482c830cdbfa8840, type: 3}
  - m_RefCount: 1
    m_Data: {fileID: -1568921924, guid: 14c86d43e48aec54482c830cdbfa8840, type: 3}
  - m_RefCount: 1
    m_Data: {fileID: 214309223, guid: 14c86d43e48aec54482c830cdbfa8840, type: 3}
  - m_RefCount: 1
    m_Data: {fileID: 161854172, guid: 14c86d43e48aec54482c830cdbfa8840, type: 3}
  - m_RefCount: 1
    m_Data: {fileID: 1979228524, guid: 14c86d43e48aec54482c830cdbfa8840, type: 3}
  - m_RefCount: 1
    m_Data: {fileID: -941892607, guid: 14c86d43e48aec54482c830cdbfa8840, type: 3}
  - m_RefCount: 1
    m_Data: {fileID: -1348087448, guid: 14c86d43e48aec54482c830cdbfa8840, type: 3}
  - m_RefCount: 1
    m_Data: {fileID: -2559246, guid: 14c86d43e48aec54482c830cdbfa8840, type: 3}
  - m_RefCount: 1
    m_Data: {fileID: 1081261577, guid: 14c86d43e48aec54482c830cdbfa8840, type: 3}
  - m_RefCount: 1
    m_Data: {fileID: -1083319855, guid: 14c86d43e48aec54482c830cdbfa8840, type: 3}
  - m_RefCount: 1
    m_Data: {fileID: -2126406370, guid: 14c86d43e48aec54482c830cdbfa8840, type: 3}
  - m_RefCount: 1
    m_Data: {fileID: -1179610323, guid: 14c86d43e48aec54482c830cdbfa8840, type: 3}
  - m_RefCount: 1
    m_Data: {fileID: -1745456968, guid: 14c86d43e48aec54482c830cdbfa8840, type: 3}
  - m_RefCount: 1
    m_Data: {fileID: -1826078068, guid: 14c86d43e48aec54482c830cdbfa8840, type: 3}
  - m_RefCount: 1
    m_Data: {fileID: 1777301995, guid: 14c86d43e48aec54482c830cdbfa8840, type: 3}
  - m_RefCount: 1
    m_Data: {fileID: -1750591947, guid: 14c86d43e48aec54482c830cdbfa8840, type: 3}
  - m_RefCount: 1
    m_Data: {fileID: -1775844309, guid: 14c86d43e48aec54482c830cdbfa8840, type: 3}
  - m_RefCount: 1
    m_Data: {fileID: 204146837, guid: 14c86d43e48aec54482c830cdbfa8840, type: 3}
  - m_RefCount: 1
    m_Data: {fileID: -1398580308, guid: 14c86d43e48aec54482c830cdbfa8840, type: 3}
  - m_RefCount: 1
    m_Data: {fileID: 67579269, guid: 14c86d43e48aec54482c830cdbfa8840, type: 3}
  - m_RefCount: 1
    m_Data: {fileID: -1725331550, guid: 14c86d43e48aec54482c830cdbfa8840, type: 3}
  - m_RefCount: 1
    m_Data: {fileID: 2114259378, guid: 14c86d43e48aec54482c830cdbfa8840, type: 3}
  - m_RefCount: 1
    m_Data: {fileID: 1117915878, guid: 14c86d43e48aec54482c830cdbfa8840, type: 3}
  - m_RefCount: 1
    m_Data: {fileID: -332141715, guid: 14c86d43e48aec54482c830cdbfa8840, type: 3}
  - m_RefCount: 1
    m_Data: {fileID: -712355794, guid: 14c86d43e48aec54482c830cdbfa8840, type: 3}
  - m_RefCount: 1
    m_Data: {fileID: -556165282, guid: 14c86d43e48aec54482c830cdbfa8840, type: 3}
  - m_RefCount: 1
    m_Data: {fileID: 1363426252, guid: 14c86d43e48aec54482c830cdbfa8840, type: 3}
  - m_RefCount: 1
    m_Data: {fileID: 1647464921, guid: 14c86d43e48aec54482c830cdbfa8840, type: 3}
  - m_RefCount: 1
    m_Data: {fileID: -1301024266, guid: 14c86d43e48aec54482c830cdbfa8840, type: 3}
  - m_RefCount: 1
    m_Data: {fileID: -145815947, guid: 14c86d43e48aec54482c830cdbfa8840, type: 3}
  - m_RefCount: 1
    m_Data: {fileID: 2142400667, guid: 14c86d43e48aec54482c830cdbfa8840, type: 3}
  - m_RefCount: 1
    m_Data: {fileID: -1901476678, guid: 14c86d43e48aec54482c830cdbfa8840, type: 3}
  - m_RefCount: 1
    m_Data: {fileID: 1908646126, guid: 14c86d43e48aec54482c830cdbfa8840, type: 3}
  - m_RefCount: 1
    m_Data: {fileID: -6613032, guid: 14c86d43e48aec54482c830cdbfa8840, type: 3}
  - m_RefCount: 1
    m_Data: {fileID: 294317828, guid: 14c86d43e48aec54482c830cdbfa8840, type: 3}
  - m_RefCount: 1
    m_Data: {fileID: 726711030, guid: 14c86d43e48aec54482c830cdbfa8840, type: 3}
  - m_RefCount: 1
    m_Data: {fileID: -1684045887, guid: 14c86d43e48aec54482c830cdbfa8840, type: 3}
  - m_RefCount: 1
    m_Data: {fileID: 1042722911, guid: 14c86d43e48aec54482c830cdbfa8840, type: 3}
  - m_RefCount: 1
    m_Data: {fileID: -174312101, guid: 14c86d43e48aec54482c830cdbfa8840, type: 3}
  - m_RefCount: 1
    m_Data: {fileID: -1257464498, guid: 14c86d43e48aec54482c830cdbfa8840, type: 3}
  - m_RefCount: 1
    m_Data: {fileID: 228061211, guid: 14c86d43e48aec54482c830cdbfa8840, type: 3}
  - m_RefCount: 1
    m_Data: {fileID: -1910598963, guid: 14c86d43e48aec54482c830cdbfa8840, type: 3}
  - m_RefCount: 1
    m_Data: {fileID: -1469059291, guid: 14c86d43e48aec54482c830cdbfa8840, type: 3}
  - m_RefCount: 1
    m_Data: {fileID: 1709790309, guid: 14c86d43e48aec54482c830cdbfa8840, type: 3}
  - m_RefCount: 1
    m_Data: {fileID: -173497455, guid: 14c86d43e48aec54482c830cdbfa8840, type: 3}
  - m_RefCount: 1
    m_Data: {fileID: 646451026, guid: 14c86d43e48aec54482c830cdbfa8840, type: 3}
  - m_RefCount: 1
    m_Data: {fileID: 357126181, guid: 14c86d43e48aec54482c830cdbfa8840, type: 3}
  - m_RefCount: 1
    m_Data: {fileID: 1179350649, guid: 14c86d43e48aec54482c830cdbfa8840, type: 3}
  - m_RefCount: 1
    m_Data: {fileID: 1987656956, guid: 14c86d43e48aec54482c830cdbfa8840, type: 3}
  m_TileMatrixArray:
  - m_RefCount: 100
    m_Data:
      e00: 1
      e01: 0
      e02: 0
      e03: 0
      e10: 0
      e11: 1
      e12: 0
      e13: 0
      e20: 0
      e21: 0
      e22: 1
      e23: 0
      e30: 0
      e31: 0
      e32: 0
      e33: 1
  m_TileColorArray:
  - m_RefCount: 100
    m_Data: {r: 1, g: 1, b: 1, a: 1}
  m_TileObjectToInstantiateArray: []
  m_AnimationFrameRate: 1
  m_Color: {r: 1, g: 1, b: 1, a: 1}
  m_Origin: {x: -1, y: -10, z: 0}
  m_Size: {x: 10, y: 10, z: 1}
  m_TileAnchor: {x: 0.5, y: 0.5, z: 0}
  m_TileOrientation: 0
  m_TileOrientationMatrix:
    e00: 1
    e01: 0
    e02: 0
    e03: 0
    e10: 0
    e11: 1
    e12: 0
    e13: 0
    e20: 0
    e21: 0
    e22: 1
    e23: 0
    e30: 0
    e31: 0
    e32: 0
    e33: 1
--- !u!483693784 &7174970395446647322
TilemapRenderer:
  m_ObjectHideFlags: 0
  m_CorrespondingSourceObject: {fileID: 0}
  m_PrefabInstance: {fileID: 0}
  m_PrefabAsset: {fileID: 0}
  m_GameObject: {fileID: 3905198944547220528}
  m_Enabled: 1
  m_CastShadows: 0
  m_ReceiveShadows: 0
  m_DynamicOccludee: 0
  m_StaticShadowCaster: 0
  m_MotionVectors: 1
  m_LightProbeUsage: 0
  m_ReflectionProbeUsage: 0
  m_RayTracingMode: 0
  m_RayTraceProcedural: 0
  m_RenderingLayerMask: 1
  m_RendererPriority: 0
  m_Materials:
  - {fileID: 10754, guid: 0000000000000000f000000000000000, type: 0}
  m_StaticBatchInfo:
    firstSubMesh: 0
    subMeshCount: 0
  m_StaticBatchRoot: {fileID: 0}
  m_ProbeAnchor: {fileID: 0}
  m_LightProbeVolumeOverride: {fileID: 0}
  m_ScaleInLightmap: 1
  m_ReceiveGI: 1
  m_PreserveUVs: 0
  m_IgnoreNormalsForChartDetection: 0
  m_ImportantGI: 0
  m_StitchLightmapSeams: 1
  m_SelectedEditorRenderState: 0
  m_MinimumChartSize: 4
  m_AutoUVMaxDistance: 0.5
  m_AutoUVMaxAngle: 89
  m_LightmapParameters: {fileID: 0}
  m_SortingLayerID: 0
  m_SortingLayer: 0
  m_SortingOrder: 0
  m_ChunkSize: {x: 32, y: 32, z: 32}
  m_ChunkCullingBounds: {x: 0, y: 0, z: 0}
  m_MaxChunkCount: 16
  m_MaxFrameAge: 16
  m_SortOrder: 0
  m_Mode: 0
  m_DetectChunkCullingBounds: 0
  m_MaskInteraction: 0
--- !u!1 &3999916799618399447
GameObject:
  m_ObjectHideFlags: 0
  m_CorrespondingSourceObject: {fileID: 0}
  m_PrefabInstance: {fileID: 0}
  m_PrefabAsset: {fileID: 0}
  serializedVersion: 6
  m_Component:
  - component: {fileID: 6615866517913052759}
  - component: {fileID: 1316138303896417227}
  m_Layer: 0
  m_Name: Dungeon
  m_TagString: Untagged
  m_Icon: {fileID: 0}
  m_NavMeshLayer: 0
  m_StaticEditorFlags: 0
  m_IsActive: 1
--- !u!4 &6615866517913052759
Transform:
  m_ObjectHideFlags: 0
  m_CorrespondingSourceObject: {fileID: 0}
  m_PrefabInstance: {fileID: 0}
  m_PrefabAsset: {fileID: 0}
  m_GameObject: {fileID: 3999916799618399447}
  m_LocalRotation: {x: 0, y: 0, z: 0, w: 1}
  m_LocalPosition: {x: 0, y: 0, z: 0}
  m_LocalScale: {x: 1, y: 1, z: 1}
  m_ConstrainProportionsScale: 0
  m_Children:
  - {fileID: 6259527264763344473}
  m_Father: {fileID: 0}
  m_RootOrder: 0
  m_LocalEulerAnglesHint: {x: 0, y: 0, z: 0}
--- !u!156049354 &1316138303896417227
Grid:
  m_ObjectHideFlags: 0
  m_CorrespondingSourceObject: {fileID: 0}
  m_PrefabInstance: {fileID: 0}
  m_PrefabAsset: {fileID: 0}
  m_GameObject: {fileID: 3999916799618399447}
  m_Enabled: 1
  m_CellSize: {x: 1, y: 1, z: 0}
  m_CellGap: {x: 0, y: 0, z: 0}
  m_CellLayout: 0
  m_CellSwizzle: 0
--- !u!114 &3025301840443579889
MonoBehaviour:
  m_ObjectHideFlags: 0
  m_CorrespondingSourceObject: {fileID: 0}
  m_PrefabInstance: {fileID: 0}
  m_PrefabAsset: {fileID: 0}
  m_GameObject: {fileID: 0}
  m_Enabled: 1
  m_EditorHideFlags: 0
  m_Script: {fileID: 12395, guid: 0000000000000000e000000000000000, type: 0}
  m_Name: Palette Settings
  m_EditorClassIdentifier: 
  cellSizing: 0
  m_TransparencySortMode: 0
  m_TransparencySortAxis: {x: 0, y: 0, z: 1}
