%YAML 1.1
%TAG !u! tag:unity3d.com,2011:
--- !u!1 &5687248915313449004
GameObject:
  m_ObjectHideFlags: 0
  m_CorrespondingSourceObject: {fileID: 0}
  m_PrefabInstance: {fileID: 0}
  m_PrefabAsset: {fileID: 0}
  serializedVersion: 6
  m_Component:
  - component: {fileID: 4915026613250719921}
  - component: {fileID: 6303358729228914469}
  m_Layer: 0
  m_Name: Volcan
  m_TagString: Untagged
  m_Icon: {fileID: 0}
  m_NavMeshLayer: 0
  m_StaticEditorFlags: 0
  m_IsActive: 1
--- !u!4 &4915026613250719921
Transform:
  m_ObjectHideFlags: 0
  m_CorrespondingSourceObject: {fileID: 0}
  m_PrefabInstance: {fileID: 0}
  m_PrefabAsset: {fileID: 0}
  m_GameObject: {fileID: 5687248915313449004}
  m_LocalRotation: {x: 0, y: 0, z: 0, w: 1}
  m_LocalPosition: {x: 0, y: 0, z: 0}
  m_LocalScale: {x: 1, y: 1, z: 1}
  m_ConstrainProportionsScale: 0
  m_Children:
  - {fileID: 3586394308695800485}
  m_Father: {fileID: 0}
  m_RootOrder: 0
  m_LocalEulerAnglesHint: {x: 0, y: 0, z: 0}
--- !u!156049354 &6303358729228914469
Grid:
  m_ObjectHideFlags: 0
  m_CorrespondingSourceObject: {fileID: 0}
  m_PrefabInstance: {fileID: 0}
  m_PrefabAsset: {fileID: 0}
  m_GameObject: {fileID: 5687248915313449004}
  m_Enabled: 1
  m_CellSize: {x: 1, y: 1, z: 0}
  m_CellGap: {x: 0, y: 0, z: 0}
  m_CellLayout: 0
  m_CellSwizzle: 0
--- !u!1 &8261196127475519478
GameObject:
  m_ObjectHideFlags: 0
  m_CorrespondingSourceObject: {fileID: 0}
  m_PrefabInstance: {fileID: 0}
  m_PrefabAsset: {fileID: 0}
  serializedVersion: 6
  m_Component:
  - component: {fileID: 3586394308695800485}
  - component: {fileID: 1576599093432300720}
  - component: {fileID: 3429215270762061019}
  m_Layer: 0
  m_Name: Layer1
  m_TagString: Untagged
  m_Icon: {fileID: 0}
  m_NavMeshLayer: 0
  m_StaticEditorFlags: 0
  m_IsActive: 1
--- !u!4 &3586394308695800485
Transform:
  m_ObjectHideFlags: 0
  m_CorrespondingSourceObject: {fileID: 0}
  m_PrefabInstance: {fileID: 0}
  m_PrefabAsset: {fileID: 0}
  m_GameObject: {fileID: 8261196127475519478}
  m_LocalRotation: {x: -0, y: -0, z: -0, w: 1}
  m_LocalPosition: {x: 0, y: 0, z: 0}
  m_LocalScale: {x: 1, y: 1, z: 1}
  m_ConstrainProportionsScale: 0
  m_Children: []
  m_Father: {fileID: 4915026613250719921}
  m_RootOrder: 0
  m_LocalEulerAnglesHint: {x: 0, y: 0, z: 0}
--- !u!1839735485 &1576599093432300720
Tilemap:
  m_ObjectHideFlags: 0
  m_CorrespondingSourceObject: {fileID: 0}
  m_PrefabInstance: {fileID: 0}
  m_PrefabAsset: {fileID: 0}
  m_GameObject: {fileID: 8261196127475519478}
  m_Enabled: 1
  m_Tiles:
  - first: {x: 0, y: -5, z: 0}
    second:
      serializedVersion: 2
      m_TileIndex: 25
      m_TileSpriteIndex: 25
      m_TileMatrixIndex: 0
      m_TileColorIndex: 0
      m_TileObjectToInstantiateIndex: 65535
      dummyAlignment: 0
      m_AllTileFlags: 1073741825
  - first: {x: 1, y: -5, z: 0}
    second:
      serializedVersion: 2
      m_TileIndex: 26
      m_TileSpriteIndex: 26
      m_TileMatrixIndex: 0
      m_TileColorIndex: 0
      m_TileObjectToInstantiateIndex: 65535
      dummyAlignment: 0
      m_AllTileFlags: 1073741825
  - first: {x: 0, y: -4, z: 0}
    second:
      serializedVersion: 2
      m_TileIndex: 20
      m_TileSpriteIndex: 20
      m_TileMatrixIndex: 0
      m_TileColorIndex: 0
      m_TileObjectToInstantiateIndex: 65535
      dummyAlignment: 0
      m_AllTileFlags: 1073741825
  - first: {x: 1, y: -4, z: 0}
    second:
      serializedVersion: 2
      m_TileIndex: 21
      m_TileSpriteIndex: 21
      m_TileMatrixIndex: 0
      m_TileColorIndex: 0
      m_TileObjectToInstantiateIndex: 65535
      dummyAlignment: 0
      m_AllTileFlags: 1073741825
  - first: {x: 2, y: -4, z: 0}
    second:
      serializedVersion: 2
      m_TileIndex: 22
      m_TileSpriteIndex: 22
      m_TileMatrixIndex: 0
      m_TileColorIndex: 0
      m_TileObjectToInstantiateIndex: 65535
      dummyAlignment: 0
      m_AllTileFlags: 1073741825
  - first: {x: 3, y: -4, z: 0}
    second:
      serializedVersion: 2
      m_TileIndex: 23
      m_TileSpriteIndex: 23
      m_TileMatrixIndex: 0
      m_TileColorIndex: 0
      m_TileObjectToInstantiateIndex: 65535
      dummyAlignment: 0
      m_AllTileFlags: 1073741825
  - first: {x: 4, y: -4, z: 0}
    second:
      serializedVersion: 2
      m_TileIndex: 24
      m_TileSpriteIndex: 24
      m_TileMatrixIndex: 0
      m_TileColorIndex: 0
      m_TileObjectToInstantiateIndex: 65535
      dummyAlignment: 0
      m_AllTileFlags: 1073741825
  - first: {x: 0, y: -3, z: 0}
    second:
      serializedVersion: 2
      m_TileIndex: 15
      m_TileSpriteIndex: 15
      m_TileMatrixIndex: 0
      m_TileColorIndex: 0
      m_TileObjectToInstantiateIndex: 65535
      dummyAlignment: 0
      m_AllTileFlags: 1073741825
  - first: {x: 1, y: -3, z: 0}
    second:
      serializedVersion: 2
      m_TileIndex: 16
      m_TileSpriteIndex: 16
      m_TileMatrixIndex: 0
      m_TileColorIndex: 0
      m_TileObjectToInstantiateIndex: 65535
      dummyAlignment: 0
      m_AllTileFlags: 1073741825
  - first: {x: 2, y: -3, z: 0}
    second:
      serializedVersion: 2
      m_TileIndex: 17
      m_TileSpriteIndex: 17
      m_TileMatrixIndex: 0
      m_TileColorIndex: 0
      m_TileObjectToInstantiateIndex: 65535
      dummyAlignment: 0
      m_AllTileFlags: 1073741825
  - first: {x: 3, y: -3, z: 0}
    second:
      serializedVersion: 2
      m_TileIndex: 18
      m_TileSpriteIndex: 18
      m_TileMatrixIndex: 0
      m_TileColorIndex: 0
      m_TileObjectToInstantiateIndex: 65535
      dummyAlignment: 0
      m_AllTileFlags: 1073741825
  - first: {x: 4, y: -3, z: 0}
    second:
      serializedVersion: 2
      m_TileIndex: 19
      m_TileSpriteIndex: 19
      m_TileMatrixIndex: 0
      m_TileColorIndex: 0
      m_TileObjectToInstantiateIndex: 65535
      dummyAlignment: 0
      m_AllTileFlags: 1073741825
  - first: {x: 0, y: -2, z: 0}
    second:
      serializedVersion: 2
      m_TileIndex: 10
      m_TileSpriteIndex: 10
      m_TileMatrixIndex: 0
      m_TileColorIndex: 0
      m_TileObjectToInstantiateIndex: 65535
      dummyAlignment: 0
      m_AllTileFlags: 1073741825
  - first: {x: 1, y: -2, z: 0}
    second:
      serializedVersion: 2
      m_TileIndex: 11
      m_TileSpriteIndex: 11
      m_TileMatrixIndex: 0
      m_TileColorIndex: 0
      m_TileObjectToInstantiateIndex: 65535
      dummyAlignment: 0
      m_AllTileFlags: 1073741825
  - first: {x: 2, y: -2, z: 0}
    second:
      serializedVersion: 2
      m_TileIndex: 12
      m_TileSpriteIndex: 12
      m_TileMatrixIndex: 0
      m_TileColorIndex: 0
      m_TileObjectToInstantiateIndex: 65535
      dummyAlignment: 0
      m_AllTileFlags: 1073741825
  - first: {x: 3, y: -2, z: 0}
    second:
      serializedVersion: 2
      m_TileIndex: 13
      m_TileSpriteIndex: 13
      m_TileMatrixIndex: 0
      m_TileColorIndex: 0
      m_TileObjectToInstantiateIndex: 65535
      dummyAlignment: 0
      m_AllTileFlags: 1073741825
  - first: {x: 4, y: -2, z: 0}
    second:
      serializedVersion: 2
      m_TileIndex: 14
      m_TileSpriteIndex: 14
      m_TileMatrixIndex: 0
      m_TileColorIndex: 0
      m_TileObjectToInstantiateIndex: 65535
      dummyAlignment: 0
      m_AllTileFlags: 1073741825
  - first: {x: 0, y: -1, z: 0}
    second:
      serializedVersion: 2
      m_TileIndex: 5
      m_TileSpriteIndex: 5
      m_TileMatrixIndex: 0
      m_TileColorIndex: 0
      m_TileObjectToInstantiateIndex: 65535
      dummyAlignment: 0
      m_AllTileFlags: 1073741825
  - first: {x: 1, y: -1, z: 0}
    second:
      serializedVersion: 2
      m_TileIndex: 6
      m_TileSpriteIndex: 6
      m_TileMatrixIndex: 0
      m_TileColorIndex: 0
      m_TileObjectToInstantiateIndex: 65535
      dummyAlignment: 0
      m_AllTileFlags: 1073741825
  - first: {x: 2, y: -1, z: 0}
    second:
      serializedVersion: 2
      m_TileIndex: 7
      m_TileSpriteIndex: 7
      m_TileMatrixIndex: 0
      m_TileColorIndex: 0
      m_TileObjectToInstantiateIndex: 65535
      dummyAlignment: 0
      m_AllTileFlags: 1073741825
  - first: {x: 3, y: -1, z: 0}
    second:
      serializedVersion: 2
      m_TileIndex: 8
      m_TileSpriteIndex: 8
      m_TileMatrixIndex: 0
      m_TileColorIndex: 0
      m_TileObjectToInstantiateIndex: 65535
      dummyAlignment: 0
      m_AllTileFlags: 1073741825
  - first: {x: 4, y: -1, z: 0}
    second:
      serializedVersion: 2
      m_TileIndex: 9
      m_TileSpriteIndex: 9
      m_TileMatrixIndex: 0
      m_TileColorIndex: 0
      m_TileObjectToInstantiateIndex: 65535
      dummyAlignment: 0
      m_AllTileFlags: 1073741825
  - first: {x: 0, y: 0, z: 0}
    second:
      serializedVersion: 2
      m_TileIndex: 0
      m_TileSpriteIndex: 0
      m_TileMatrixIndex: 0
      m_TileColorIndex: 0
      m_TileObjectToInstantiateIndex: 65535
      dummyAlignment: 0
      m_AllTileFlags: 1073741825
  - first: {x: 1, y: 0, z: 0}
    second:
      serializedVersion: 2
      m_TileIndex: 1
      m_TileSpriteIndex: 1
      m_TileMatrixIndex: 0
      m_TileColorIndex: 0
      m_TileObjectToInstantiateIndex: 65535
      dummyAlignment: 0
      m_AllTileFlags: 1073741825
  - first: {x: 2, y: 0, z: 0}
    second:
      serializedVersion: 2
      m_TileIndex: 2
      m_TileSpriteIndex: 2
      m_TileMatrixIndex: 0
      m_TileColorIndex: 0
      m_TileObjectToInstantiateIndex: 65535
      dummyAlignment: 0
      m_AllTileFlags: 1073741825
  - first: {x: 3, y: 0, z: 0}
    second:
      serializedVersion: 2
      m_TileIndex: 3
      m_TileSpriteIndex: 3
      m_TileMatrixIndex: 0
      m_TileColorIndex: 0
      m_TileObjectToInstantiateIndex: 65535
      dummyAlignment: 0
      m_AllTileFlags: 1073741825
  - first: {x: 4, y: 0, z: 0}
    second:
      serializedVersion: 2
      m_TileIndex: 4
      m_TileSpriteIndex: 4
      m_TileMatrixIndex: 0
      m_TileColorIndex: 0
      m_TileObjectToInstantiateIndex: 65535
      dummyAlignment: 0
      m_AllTileFlags: 1073741825
  m_AnimatedTiles: {}
  m_TileAssetArray:
  - m_RefCount: 1
    m_Data: {fileID: 11400000, guid: 918d3e0f2f8a0ba43b4c61e2814334dc, type: 2}
  - m_RefCount: 1
    m_Data: {fileID: 11400000, guid: b44ea2d34b50d9a498f87f80b3c2612d, type: 2}
  - m_RefCount: 1
    m_Data: {fileID: 11400000, guid: a9e0039dc43031843b82a515eb85a384, type: 2}
  - m_RefCount: 1
    m_Data: {fileID: 11400000, guid: 0dae404e0b8b59845b427eb62e4fba4c, type: 2}
  - m_RefCount: 1
    m_Data: {fileID: 11400000, guid: b0a1972fb614e264b80ff4dc61b4712b, type: 2}
  - m_RefCount: 1
    m_Data: {fileID: 11400000, guid: da27684d06ab2f54ba14789b6d6ef964, type: 2}
  - m_RefCount: 1
    m_Data: {fileID: 11400000, guid: 4b5e5101628f0a041ab84b077c9321e8, type: 2}
  - m_RefCount: 1
    m_Data: {fileID: 11400000, guid: 56232ba59f442ce43a6752716a111531, type: 2}
  - m_RefCount: 1
    m_Data: {fileID: 11400000, guid: cedd740ba62d7684c99dfca351bb216c, type: 2}
  - m_RefCount: 1
    m_Data: {fileID: 11400000, guid: 326eb9c2bc52c434288c5c8e3fc3adac, type: 2}
  - m_RefCount: 1
    m_Data: {fileID: 11400000, guid: 1db7b5b2f43f20142938adeb08a27c3d, type: 2}
  - m_RefCount: 1
    m_Data: {fileID: 11400000, guid: 5d13dc128a794464a82190a0a9e088c4, type: 2}
  - m_RefCount: 1
    m_Data: {fileID: 11400000, guid: 0bee35d5ef878bd46b8f125934cfce41, type: 2}
  - m_RefCount: 1
    m_Data: {fileID: 11400000, guid: f0a6bb59e10f9a64f8e518cdd9ef922d, type: 2}
  - m_RefCount: 1
    m_Data: {fileID: 11400000, guid: 18c2ea74ae3a6984884ea3c5d270667d, type: 2}
  - m_RefCount: 1
    m_Data: {fileID: 11400000, guid: d494b89380919cd42a3e45ef31601a24, type: 2}
  - m_RefCount: 1
    m_Data: {fileID: 11400000, guid: 0fc8b3af8cc8f2b43a64ecd3ba160487, type: 2}
  - m_RefCount: 1
    m_Data: {fileID: 11400000, guid: 584b131c5baa92d4597def5d3272008b, type: 2}
  - m_RefCount: 1
    m_Data: {fileID: 11400000, guid: e683932006fb9af4bae4d71354d3befe, type: 2}
  - m_RefCount: 1
    m_Data: {fileID: 11400000, guid: 00b12acf8efbb36409b80ee38fc97f74, type: 2}
  - m_RefCount: 1
    m_Data: {fileID: 11400000, guid: 28076c95aa4ec2d4b82063986203e455, type: 2}
  - m_RefCount: 1
    m_Data: {fileID: 11400000, guid: 777894ad0f2eefd44bd80c51c95a4757, type: 2}
  - m_RefCount: 1
    m_Data: {fileID: 11400000, guid: 07c99070b2434204daf566738dbc645a, type: 2}
  - m_RefCount: 1
    m_Data: {fileID: 11400000, guid: a65b32951493b1d48a32c7f8f3aa42a6, type: 2}
  - m_RefCount: 1
    m_Data: {fileID: 11400000, guid: f32b27469d53f5d4bac4dff6eff5fdf7, type: 2}
  - m_RefCount: 1
    m_Data: {fileID: 11400000, guid: 00ac47cbd4a35f84184fb1485edc14e2, type: 2}
  - m_RefCount: 1
    m_Data: {fileID: 11400000, guid: a0845e9dc037ec64f94f3b3a053643e4, type: 2}
  m_TileSpriteArray:
  - m_RefCount: 1
    m_Data: {fileID: -297545561, guid: 616dd99b05059e14392c215b321e731f, type: 3}
  - m_RefCount: 1
    m_Data: {fileID: -562866765, guid: 616dd99b05059e14392c215b321e731f, type: 3}
  - m_RefCount: 1
    m_Data: {fileID: 2067535143, guid: 616dd99b05059e14392c215b321e731f, type: 3}
  - m_RefCount: 1
    m_Data: {fileID: -1152532904, guid: 616dd99b05059e14392c215b321e731f, type: 3}
  - m_RefCount: 1
    m_Data: {fileID: 2000126403, guid: 616dd99b05059e14392c215b321e731f, type: 3}
  - m_RefCount: 1
    m_Data: {fileID: -522227060, guid: 616dd99b05059e14392c215b321e731f, type: 3}
  - m_RefCount: 1
    m_Data: {fileID: 663925278, guid: 616dd99b05059e14392c215b321e731f, type: 3}
  - m_RefCount: 1
    m_Data: {fileID: 1585015344, guid: 616dd99b05059e14392c215b321e731f, type: 3}
  - m_RefCount: 1
    m_Data: {fileID: -1747992940, guid: 616dd99b05059e14392c215b321e731f, type: 3}
  - m_RefCount: 1
    m_Data: {fileID: 1896832575, guid: 616dd99b05059e14392c215b321e731f, type: 3}
  - m_RefCount: 1
    m_Data: {fileID: -946184303, guid: 616dd99b05059e14392c215b321e731f, type: 3}
  - m_RefCount: 1
    m_Data: {fileID: -380098360, guid: 616dd99b05059e14392c215b321e731f, type: 3}
  - m_RefCount: 1
    m_Data: {fileID: 704196830, guid: 616dd99b05059e14392c215b321e731f, type: 3}
  - m_RefCount: 1
    m_Data: {fileID: -213259179, guid: 616dd99b05059e14392c215b321e731f, type: 3}
  - m_RefCount: 1
    m_Data: {fileID: -167792615, guid: 616dd99b05059e14392c215b321e731f, type: 3}
  - m_RefCount: 1
    m_Data: {fileID: -545320077, guid: 616dd99b05059e14392c215b321e731f, type: 3}
  - m_RefCount: 1
    m_Data: {fileID: -1459947103, guid: 616dd99b05059e14392c215b321e731f, type: 3}
  - m_RefCount: 1
    m_Data: {fileID: -143520543, guid: 616dd99b05059e14392c215b321e731f, type: 3}
  - m_RefCount: 1
    m_Data: {fileID: -23988673, guid: 616dd99b05059e14392c215b321e731f, type: 3}
  - m_RefCount: 1
    m_Data: {fileID: 159262045, guid: 616dd99b05059e14392c215b321e731f, type: 3}
  - m_RefCount: 1
    m_Data: {fileID: -1729588596, guid: 616dd99b05059e14392c215b321e731f, type: 3}
  - m_RefCount: 1
    m_Data: {fileID: -1146587565, guid: 616dd99b05059e14392c215b321e731f, type: 3}
  - m_RefCount: 1
    m_Data: {fileID: 1800987830, guid: 616dd99b05059e14392c215b321e731f, type: 3}
  - m_RefCount: 1
    m_Data: {fileID: -2046897406, guid: 616dd99b05059e14392c215b321e731f, type: 3}
  - m_RefCount: 1
    m_Data: {fileID: -1354765001, guid: 616dd99b05059e14392c215b321e731f, type: 3}
  - m_RefCount: 1
    m_Data: {fileID: 1437601749, guid: 616dd99b05059e14392c215b321e731f, type: 3}
  - m_RefCount: 1
    m_Data: {fileID: 568156909, guid: 616dd99b05059e14392c215b321e731f, type: 3}
  m_TileMatrixArray:
  - m_RefCount: 27
    m_Data:
      e00: 1
      e01: 0
      e02: 0
      e03: 0
      e10: 0
      e11: 1
      e12: 0
      e13: 0
      e20: 0
      e21: 0
      e22: 1
      e23: 0
      e30: 0
      e31: 0
      e32: 0
      e33: 1
  m_TileColorArray:
  - m_RefCount: 27
    m_Data: {r: 1, g: 1, b: 1, a: 1}
  m_TileObjectToInstantiateArray: []
  m_AnimationFrameRate: 1
  m_Color: {r: 1, g: 1, b: 1, a: 1}
  m_Origin: {x: 0, y: -5, z: 0}
  m_Size: {x: 5, y: 6, z: 1}
  m_TileAnchor: {x: 0.5, y: 0.5, z: 0}
  m_TileOrientation: 0
  m_TileOrientationMatrix:
    e00: 1
    e01: 0
    e02: 0
    e03: 0
    e10: 0
    e11: 1
    e12: 0
    e13: 0
    e20: 0
    e21: 0
    e22: 1
    e23: 0
    e30: 0
    e31: 0
    e32: 0
    e33: 1
--- !u!483693784 &3429215270762061019
TilemapRenderer:
  m_ObjectHideFlags: 0
  m_CorrespondingSourceObject: {fileID: 0}
  m_PrefabInstance: {fileID: 0}
  m_PrefabAsset: {fileID: 0}
  m_GameObject: {fileID: 8261196127475519478}
  m_Enabled: 1
  m_CastShadows: 0
  m_ReceiveShadows: 0
  m_DynamicOccludee: 0
  m_StaticShadowCaster: 0
  m_MotionVectors: 1
  m_LightProbeUsage: 0
  m_ReflectionProbeUsage: 0
  m_RayTracingMode: 0
  m_RayTraceProcedural: 0
  m_RenderingLayerMask: 1
  m_RendererPriority: 0
  m_Materials:
  - {fileID: 10754, guid: 0000000000000000f000000000000000, type: 0}
  m_StaticBatchInfo:
    firstSubMesh: 0
    subMeshCount: 0
  m_StaticBatchRoot: {fileID: 0}
  m_ProbeAnchor: {fileID: 0}
  m_LightProbeVolumeOverride: {fileID: 0}
  m_ScaleInLightmap: 1
  m_ReceiveGI: 1
  m_PreserveUVs: 0
  m_IgnoreNormalsForChartDetection: 0
  m_ImportantGI: 0
  m_StitchLightmapSeams: 1
  m_SelectedEditorRenderState: 0
  m_MinimumChartSize: 4
  m_AutoUVMaxDistance: 0.5
  m_AutoUVMaxAngle: 89
  m_LightmapParameters: {fileID: 0}
  m_SortingLayerID: 0
  m_SortingLayer: 0
  m_SortingOrder: 0
  m_ChunkSize: {x: 32, y: 32, z: 32}
  m_ChunkCullingBounds: {x: 0, y: 0, z: 0}
  m_MaxChunkCount: 16
  m_MaxFrameAge: 16
  m_SortOrder: 0
  m_Mode: 0
  m_DetectChunkCullingBounds: 0
  m_MaskInteraction: 0
--- !u!114 &7626156523224046796
MonoBehaviour:
  m_ObjectHideFlags: 0
  m_CorrespondingSourceObject: {fileID: 0}
  m_PrefabInstance: {fileID: 0}
  m_PrefabAsset: {fileID: 0}
  m_GameObject: {fileID: 0}
  m_Enabled: 1
  m_EditorHideFlags: 0
  m_Script: {fileID: 12395, guid: 0000000000000000e000000000000000, type: 0}
  m_Name: Palette Settings
  m_EditorClassIdentifier: 
  cellSizing: 0
  m_TransparencySortMode: 0
  m_TransparencySortAxis: {x: 0, y: 0, z: 1}
