%YAML 1.1
%TAG !u! tag:unity3d.com,2011:
--- !u!74 &7400000
AnimationClip:
  m_ObjectHideFlags: 0
  m_CorrespondingSourceObject: {fileID: 0}
  m_PrefabInstance: {fileID: 0}
  m_PrefabAsset: {fileID: 0}
  m_Name: Fireball
  serializedVersion: 6
  m_Legacy: 0
  m_Compressed: 0
  m_UseHighQualityCurve: 1
  m_RotationCurves: []
  m_CompressedRotationCurves: []
  m_EulerCurves: []
  m_PositionCurves: []
  m_ScaleCurves: []
  m_FloatCurves: []
  m_PPtrCurves:
  - curve:
    - time: 0
      value: {fileID: -501839403, guid: bd3dbb955f56163459f9f06180a8ce81, type: 3}
    - time: 0.083333336
      value: {fileID: -801121171, guid: bd3dbb955f56163459f9f06180a8ce81, type: 3}
    - time: 0.16666667
      value: {fileID: -107190923, guid: bd3dbb955f56163459f9f06180a8ce81, type: 3}
    - time: 0.25
      value: {fileID: -423500608, guid: bd3dbb955f56163459f9f06180a8ce81, type: 3}
    - time: 0.33333334
      value: {fileID: -1035795299, guid: bd3dbb955f56163459f9f06180a8ce81, type: 3}
    - time: 0.41666666
      value: {fileID: 1868087846, guid: bd3dbb955f56163459f9f06180a8ce81, type: 3}
    - time: 0.5
      value: {fileID: 1658321757, guid: bd3dbb955f56163459f9f06180a8ce81, type: 3}
    - time: 0.5833333
      value: {fileID: 1514844568, guid: bd3dbb955f56163459f9f06180a8ce81, type: 3}
    - time: 0.6666667
      value: {fileID: 50690461, guid: bd3dbb955f56163459f9f06180a8ce81, type: 3}
    - time: 0.75
      value: {fileID: 551660210, guid: bd3dbb955f56163459f9f06180a8ce81, type: 3}
    - time: 0.8333333
      value: {fileID: -382134322, guid: bd3dbb955f56163459f9f06180a8ce81, type: 3}
    - time: 0.9166667
      value: {fileID: 1978765321, guid: bd3dbb955f56163459f9f06180a8ce81, type: 3}
    - time: 1
      value: {fileID: 840076899, guid: bd3dbb955f56163459f9f06180a8ce81, type: 3}
    - time: 1.0833334
      value: {fileID: 518350203, guid: bd3dbb955f56163459f9f06180a8ce81, type: 3}
    - time: 1.1666666
      value: {fileID: -1632180450, guid: bd3dbb955f56163459f9f06180a8ce81, type: 3}
    - time: 1.25
      value: {fileID: -2142174082, guid: bd3dbb955f56163459f9f06180a8ce81, type: 3}
    - time: 1.3333334
      value: {fileID: -108480989, guid: bd3dbb955f56163459f9f06180a8ce81, type: 3}
    - time: 1.4166666
      value: {fileID: 1262725988, guid: bd3dbb955f56163459f9f06180a8ce81, type: 3}
    - time: 1.5
      value: {fileID: 1967216815, guid: bd3dbb955f56163459f9f06180a8ce81, type: 3}
    - time: 1.5833334
      value: {fileID: 512745796, guid: bd3dbb955f56163459f9f06180a8ce81, type: 3}
    - time: 1.6666666
      value: {fileID: 912390191, guid: bd3dbb955f56163459f9f06180a8ce81, type: 3}
    - time: 1.75
      value: {fileID: -511453421, guid: bd3dbb955f56163459f9f06180a8ce81, type: 3}
    - time: 1.8333334
      value: {fileID: 1370727307, guid: bd3dbb955f56163459f9f06180a8ce81, type: 3}
    - time: 1.9166666
      value: {fileID: -61379190, guid: bd3dbb955f56163459f9f06180a8ce81, type: 3}
    - time: 2
      value: {fileID: 1806055226, guid: bd3dbb955f56163459f9f06180a8ce81, type: 3}
    - time: 2.0833333
      value: {fileID: 1210582057, guid: bd3dbb955f56163459f9f06180a8ce81, type: 3}
    - time: 2.1666667
      value: {fileID: 301510156, guid: bd3dbb955f56163459f9f06180a8ce81, type: 3}
    - time: 2.25
      value: {fileID: 547899058, guid: bd3dbb955f56163459f9f06180a8ce81, type: 3}
    - time: 2.3333333
      value: {fileID: 642126218, guid: bd3dbb955f56163459f9f06180a8ce81, type: 3}
    - time: 2.4166667
      value: {fileID: -565436472, guid: bd3dbb955f56163459f9f06180a8ce81, type: 3}
    - time: 2.5
      value: {fileID: 733153644, guid: bd3dbb955f56163459f9f06180a8ce81, type: 3}
    - time: 2.5833333
      value: {fileID: -251203925, guid: bd3dbb955f56163459f9f06180a8ce81, type: 3}
    - time: 2.6666667
      value: {fileID: 2086321574, guid: bd3dbb955f56163459f9f06180a8ce81, type: 3}
    - time: 2.75
      value: {fileID: -1022923644, guid: bd3dbb955f56163459f9f06180a8ce81, type: 3}
    - time: 2.8333333
      value: {fileID: -5122766, guid: bd3dbb955f56163459f9f06180a8ce81, type: 3}
    - time: 2.9166667
      value: {fileID: 430874136, guid: bd3dbb955f56163459f9f06180a8ce81, type: 3}
    - time: 3
      value: {fileID: 1378827272, guid: bd3dbb955f56163459f9f06180a8ce81, type: 3}
    - time: 3.0833333
      value: {fileID: 2054320540, guid: bd3dbb955f56163459f9f06180a8ce81, type: 3}
    - time: 3.1666667
      value: {fileID: 64327207, guid: bd3dbb955f56163459f9f06180a8ce81, type: 3}
    - time: 3.25
      value: {fileID: 2065407898, guid: bd3dbb955f56163459f9f06180a8ce81, type: 3}
    - time: 3.3333333
      value: {fileID: -148741432, guid: bd3dbb955f56163459f9f06180a8ce81, type: 3}
    - time: 3.4166667
      value: {fileID: 62491024, guid: bd3dbb955f56163459f9f06180a8ce81, type: 3}
    - time: 3.5
      value: {fileID: -775582867, guid: bd3dbb955f56163459f9f06180a8ce81, type: 3}
    - time: 3.5833333
      value: {fileID: -692743886, guid: bd3dbb955f56163459f9f06180a8ce81, type: 3}
    - time: 3.6666667
      value: {fileID: -335114143, guid: bd3dbb955f56163459f9f06180a8ce81, type: 3}
    - time: 3.75
      value: {fileID: 1647033030, guid: bd3dbb955f56163459f9f06180a8ce81, type: 3}
    - time: 3.8333333
      value: {fileID: -1951833728, guid: bd3dbb955f56163459f9f06180a8ce81, type: 3}
    - time: 3.9166667
      value: {fileID: -1566058058, guid: bd3dbb955f56163459f9f06180a8ce81, type: 3}
    - time: 4
      value: {fileID: 1988666097, guid: bd3dbb955f56163459f9f06180a8ce81, type: 3}
    - time: 4.0833335
      value: {fileID: -287850081, guid: bd3dbb955f56163459f9f06180a8ce81, type: 3}
    - time: 4.1666665
      value: {fileID: -1750966410, guid: bd3dbb955f56163459f9f06180a8ce81, type: 3}
    - time: 4.25
      value: {fileID: 1359020509, guid: bd3dbb955f56163459f9f06180a8ce81, type: 3}
    - time: 4.3333335
      value: {fileID: -552144436, guid: bd3dbb955f56163459f9f06180a8ce81, type: 3}
    - time: 4.4166665
      value: {fileID: 1641262844, guid: bd3dbb955f56163459f9f06180a8ce81, type: 3}
    - time: 4.5
      value: {fileID: -1967556451, guid: bd3dbb955f56163459f9f06180a8ce81, type: 3}
    - time: 4.5833335
      value: {fileID: -1836297563, guid: bd3dbb955f56163459f9f06180a8ce81, type: 3}
    - time: 4.6666665
      value: {fileID: -1942165881, guid: bd3dbb955f56163459f9f06180a8ce81, type: 3}
    - time: 4.75
      value: {fileID: -947625674, guid: bd3dbb955f56163459f9f06180a8ce81, type: 3}
    - time: 4.8333335
      value: {fileID: 881462191, guid: bd3dbb955f56163459f9f06180a8ce81, type: 3}
    - time: 4.9166665
      value: {fileID: -165979952, guid: bd3dbb955f56163459f9f06180a8ce81, type: 3}
    attribute: m_Sprite
    path: 
    classID: 212
    script: {fileID: 0}
  m_SampleRate: 12
  m_WrapMode: 0
  m_Bounds:
    m_Center: {x: 0, y: 0, z: 0}
    m_Extent: {x: 0, y: 0, z: 0}
  m_ClipBindingConstant:
    genericBindings:
    - serializedVersion: 2
      path: 0
      attribute: 0
      script: {fileID: 0}
      typeID: 212
      customType: 23
      isPPtrCurve: 1
    pptrCurveMapping:
    - {fileID: -501839403, guid: bd3dbb955f56163459f9f06180a8ce81, type: 3}
    - {fileID: -801121171, guid: bd3dbb955f56163459f9f06180a8ce81, type: 3}
    - {fileID: -107190923, guid: bd3dbb955f56163459f9f06180a8ce81, type: 3}
    - {fileID: -423500608, guid: bd3dbb955f56163459f9f06180a8ce81, type: 3}
    - {fileID: -1035795299, guid: bd3dbb955f56163459f9f06180a8ce81, type: 3}
    - {fileID: 1868087846, guid: bd3dbb955f56163459f9f06180a8ce81, type: 3}
    - {fileID: 1658321757, guid: bd3dbb955f56163459f9f06180a8ce81, type: 3}
    - {fileID: 1514844568, guid: bd3dbb955f56163459f9f06180a8ce81, type: 3}
    - {fileID: 50690461, guid: bd3dbb955f56163459f9f06180a8ce81, type: 3}
    - {fileID: 551660210, guid: bd3dbb955f56163459f9f06180a8ce81, type: 3}
    - {fileID: -382134322, guid: bd3dbb955f56163459f9f06180a8ce81, type: 3}
    - {fileID: 1978765321, guid: bd3dbb955f56163459f9f06180a8ce81, type: 3}
    - {fileID: 840076899, guid: bd3dbb955f56163459f9f06180a8ce81, type: 3}
    - {fileID: 518350203, guid: bd3dbb955f56163459f9f06180a8ce81, type: 3}
    - {fileID: -1632180450, guid: bd3dbb955f56163459f9f06180a8ce81, type: 3}
    - {fileID: -2142174082, guid: bd3dbb955f56163459f9f06180a8ce81, type: 3}
    - {fileID: -108480989, guid: bd3dbb955f56163459f9f06180a8ce81, type: 3}
    - {fileID: 1262725988, guid: bd3dbb955f56163459f9f06180a8ce81, type: 3}
    - {fileID: 1967216815, guid: bd3dbb955f56163459f9f06180a8ce81, type: 3}
    - {fileID: 512745796, guid: bd3dbb955f56163459f9f06180a8ce81, type: 3}
    - {fileID: 912390191, guid: bd3dbb955f56163459f9f06180a8ce81, type: 3}
    - {fileID: -511453421, guid: bd3dbb955f56163459f9f06180a8ce81, type: 3}
    - {fileID: 1370727307, guid: bd3dbb955f56163459f9f06180a8ce81, type: 3}
    - {fileID: -61379190, guid: bd3dbb955f56163459f9f06180a8ce81, type: 3}
    - {fileID: 1806055226, guid: bd3dbb955f56163459f9f06180a8ce81, type: 3}
    - {fileID: 1210582057, guid: bd3dbb955f56163459f9f06180a8ce81, type: 3}
    - {fileID: 301510156, guid: bd3dbb955f56163459f9f06180a8ce81, type: 3}
    - {fileID: 547899058, guid: bd3dbb955f56163459f9f06180a8ce81, type: 3}
    - {fileID: 642126218, guid: bd3dbb955f56163459f9f06180a8ce81, type: 3}
    - {fileID: -565436472, guid: bd3dbb955f56163459f9f06180a8ce81, type: 3}
    - {fileID: 733153644, guid: bd3dbb955f56163459f9f06180a8ce81, type: 3}
    - {fileID: -251203925, guid: bd3dbb955f56163459f9f06180a8ce81, type: 3}
    - {fileID: 2086321574, guid: bd3dbb955f56163459f9f06180a8ce81, type: 3}
    - {fileID: -1022923644, guid: bd3dbb955f56163459f9f06180a8ce81, type: 3}
    - {fileID: -5122766, guid: bd3dbb955f56163459f9f06180a8ce81, type: 3}
    - {fileID: 430874136, guid: bd3dbb955f56163459f9f06180a8ce81, type: 3}
    - {fileID: 1378827272, guid: bd3dbb955f56163459f9f06180a8ce81, type: 3}
    - {fileID: 2054320540, guid: bd3dbb955f56163459f9f06180a8ce81, type: 3}
    - {fileID: 64327207, guid: bd3dbb955f56163459f9f06180a8ce81, type: 3}
    - {fileID: 2065407898, guid: bd3dbb955f56163459f9f06180a8ce81, type: 3}
    - {fileID: -148741432, guid: bd3dbb955f56163459f9f06180a8ce81, type: 3}
    - {fileID: 62491024, guid: bd3dbb955f56163459f9f06180a8ce81, type: 3}
    - {fileID: -775582867, guid: bd3dbb955f56163459f9f06180a8ce81, type: 3}
    - {fileID: -692743886, guid: bd3dbb955f56163459f9f06180a8ce81, type: 3}
    - {fileID: -335114143, guid: bd3dbb955f56163459f9f06180a8ce81, type: 3}
    - {fileID: 1647033030, guid: bd3dbb955f56163459f9f06180a8ce81, type: 3}
    - {fileID: -1951833728, guid: bd3dbb955f56163459f9f06180a8ce81, type: 3}
    - {fileID: -1566058058, guid: bd3dbb955f56163459f9f06180a8ce81, type: 3}
    - {fileID: 1988666097, guid: bd3dbb955f56163459f9f06180a8ce81, type: 3}
    - {fileID: -287850081, guid: bd3dbb955f56163459f9f06180a8ce81, type: 3}
    - {fileID: -1750966410, guid: bd3dbb955f56163459f9f06180a8ce81, type: 3}
    - {fileID: 1359020509, guid: bd3dbb955f56163459f9f06180a8ce81, type: 3}
    - {fileID: -552144436, guid: bd3dbb955f56163459f9f06180a8ce81, type: 3}
    - {fileID: 1641262844, guid: bd3dbb955f56163459f9f06180a8ce81, type: 3}
    - {fileID: -1967556451, guid: bd3dbb955f56163459f9f06180a8ce81, type: 3}
    - {fileID: -1836297563, guid: bd3dbb955f56163459f9f06180a8ce81, type: 3}
    - {fileID: -1942165881, guid: bd3dbb955f56163459f9f06180a8ce81, type: 3}
    - {fileID: -947625674, guid: bd3dbb955f56163459f9f06180a8ce81, type: 3}
    - {fileID: 881462191, guid: bd3dbb955f56163459f9f06180a8ce81, type: 3}
    - {fileID: -165979952, guid: bd3dbb955f56163459f9f06180a8ce81, type: 3}
  m_AnimationClipSettings:
    serializedVersion: 2
    m_AdditiveReferencePoseClip: {fileID: 0}
    m_AdditiveReferencePoseTime: 0
    m_StartTime: 0
    m_StopTime: 5
    m_OrientationOffsetY: 0
    m_Level: 0
    m_CycleOffset: 0
    m_HasAdditiveReferencePose: 0
    m_LoopTime: 1
    m_LoopBlend: 0
    m_LoopBlendOrientation: 0
    m_LoopBlendPositionY: 0
    m_LoopBlendPositionXZ: 0
    m_KeepOriginalOrientation: 0
    m_KeepOriginalPositionY: 1
    m_KeepOriginalPositionXZ: 0
    m_HeightFromFeet: 0
    m_Mirror: 0
  m_EditorCurves: []
  m_EulerEditorCurves: []
  m_HasGenericRootTransform: 0
  m_HasMotionFloatCurves: 0
  m_Events: []
