%YAML 1.1
%TAG !u! tag:unity3d.com,2011:
--- !u!74 &7400000
AnimationClip:
  m_ObjectHideFlags: 0
  m_CorrespondingSourceObject: {fileID: 0}
  m_PrefabInstance: {fileID: 0}
  m_PrefabAsset: {fileID: 0}
  m_Name: Explosion
  serializedVersion: 6
  m_Legacy: 0
  m_Compressed: 0
  m_UseHighQualityCurve: 1
  m_RotationCurves: []
  m_CompressedRotationCurves: []
  m_EulerCurves: []
  m_PositionCurves: []
  m_ScaleCurves: []
  m_FloatCurves: []
  m_PPtrCurves:
  - curve:
    - time: 0
      value: {fileID: 294622142, guid: 1515863bb9bff0d4ab6a8c1d70b5fd1c, type: 3}
    - time: 0.016666668
      value: {fileID: -527226497, guid: 1515863bb9bff0d4ab6a8c1d70b5fd1c, type: 3}
    - time: 0.033333335
      value: {fileID: -1831782526, guid: 1515863bb9bff0d4ab6a8c1d70b5fd1c, type: 3}
    - time: 0.05
      value: {fileID: -437888931, guid: 1515863bb9bff0d4ab6a8c1d70b5fd1c, type: 3}
    - time: 0.06666667
      value: {fileID: 52583722, guid: 1515863bb9bff0d4ab6a8c1d70b5fd1c, type: 3}
    - time: 0.083333336
      value: {fileID: 1461191659, guid: 1515863bb9bff0d4ab6a8c1d70b5fd1c, type: 3}
    - time: 0.1
      value: {fileID: 713142031, guid: 1515863bb9bff0d4ab6a8c1d70b5fd1c, type: 3}
    - time: 0.11666667
      value: {fileID: -2009827505, guid: 1515863bb9bff0d4ab6a8c1d70b5fd1c, type: 3}
    - time: 0.13333334
      value: {fileID: -1264539612, guid: 1515863bb9bff0d4ab6a8c1d70b5fd1c, type: 3}
    - time: 0.15
      value: {fileID: 1958439307, guid: 1515863bb9bff0d4ab6a8c1d70b5fd1c, type: 3}
    - time: 0.16666667
      value: {fileID: 1236250933, guid: 1515863bb9bff0d4ab6a8c1d70b5fd1c, type: 3}
    - time: 0.18333334
      value: {fileID: 541596535, guid: 1515863bb9bff0d4ab6a8c1d70b5fd1c, type: 3}
    - time: 0.2
      value: {fileID: 474931003, guid: 1515863bb9bff0d4ab6a8c1d70b5fd1c, type: 3}
    - time: 0.21666667
      value: {fileID: 1219477749, guid: 1515863bb9bff0d4ab6a8c1d70b5fd1c, type: 3}
    - time: 0.23333333
      value: {fileID: 1844924183, guid: 1515863bb9bff0d4ab6a8c1d70b5fd1c, type: 3}
    - time: 0.25
      value: {fileID: 334182114, guid: 1515863bb9bff0d4ab6a8c1d70b5fd1c, type: 3}
    - time: 0.26666668
      value: {fileID: -294365529, guid: 1515863bb9bff0d4ab6a8c1d70b5fd1c, type: 3}
    - time: 0.28333333
      value: {fileID: 328124609, guid: 1515863bb9bff0d4ab6a8c1d70b5fd1c, type: 3}
    - time: 0.3
      value: {fileID: 1302113671, guid: 1515863bb9bff0d4ab6a8c1d70b5fd1c, type: 3}
    - time: 0.31666666
      value: {fileID: 1345878773, guid: 1515863bb9bff0d4ab6a8c1d70b5fd1c, type: 3}
    - time: 0.33333334
      value: {fileID: -318188411, guid: 1515863bb9bff0d4ab6a8c1d70b5fd1c, type: 3}
    - time: 0.35
      value: {fileID: 1932728013, guid: 1515863bb9bff0d4ab6a8c1d70b5fd1c, type: 3}
    - time: 0.36666667
      value: {fileID: 245417147, guid: 1515863bb9bff0d4ab6a8c1d70b5fd1c, type: 3}
    - time: 0.38333333
      value: {fileID: -1560477912, guid: 1515863bb9bff0d4ab6a8c1d70b5fd1c, type: 3}
    - time: 0.4
      value: {fileID: 339945647, guid: 1515863bb9bff0d4ab6a8c1d70b5fd1c, type: 3}
    - time: 0.41666666
      value: {fileID: -1647687024, guid: 1515863bb9bff0d4ab6a8c1d70b5fd1c, type: 3}
    - time: 0.43333334
      value: {fileID: 2018379600, guid: 1515863bb9bff0d4ab6a8c1d70b5fd1c, type: 3}
    attribute: m_Sprite
    path: 
    classID: 212
    script: {fileID: 0}
  m_SampleRate: 60
  m_WrapMode: 0
  m_Bounds:
    m_Center: {x: 0, y: 0, z: 0}
    m_Extent: {x: 0, y: 0, z: 0}
  m_ClipBindingConstant:
    genericBindings:
    - serializedVersion: 2
      path: 0
      attribute: 0
      script: {fileID: 0}
      typeID: 212
      customType: 23
      isPPtrCurve: 1
    pptrCurveMapping:
    - {fileID: 294622142, guid: 1515863bb9bff0d4ab6a8c1d70b5fd1c, type: 3}
    - {fileID: -527226497, guid: 1515863bb9bff0d4ab6a8c1d70b5fd1c, type: 3}
    - {fileID: -1831782526, guid: 1515863bb9bff0d4ab6a8c1d70b5fd1c, type: 3}
    - {fileID: -437888931, guid: 1515863bb9bff0d4ab6a8c1d70b5fd1c, type: 3}
    - {fileID: 52583722, guid: 1515863bb9bff0d4ab6a8c1d70b5fd1c, type: 3}
    - {fileID: 1461191659, guid: 1515863bb9bff0d4ab6a8c1d70b5fd1c, type: 3}
    - {fileID: 713142031, guid: 1515863bb9bff0d4ab6a8c1d70b5fd1c, type: 3}
    - {fileID: -2009827505, guid: 1515863bb9bff0d4ab6a8c1d70b5fd1c, type: 3}
    - {fileID: -1264539612, guid: 1515863bb9bff0d4ab6a8c1d70b5fd1c, type: 3}
    - {fileID: 1958439307, guid: 1515863bb9bff0d4ab6a8c1d70b5fd1c, type: 3}
    - {fileID: 1236250933, guid: 1515863bb9bff0d4ab6a8c1d70b5fd1c, type: 3}
    - {fileID: 541596535, guid: 1515863bb9bff0d4ab6a8c1d70b5fd1c, type: 3}
    - {fileID: 474931003, guid: 1515863bb9bff0d4ab6a8c1d70b5fd1c, type: 3}
    - {fileID: 1219477749, guid: 1515863bb9bff0d4ab6a8c1d70b5fd1c, type: 3}
    - {fileID: 1844924183, guid: 1515863bb9bff0d4ab6a8c1d70b5fd1c, type: 3}
    - {fileID: 334182114, guid: 1515863bb9bff0d4ab6a8c1d70b5fd1c, type: 3}
    - {fileID: -294365529, guid: 1515863bb9bff0d4ab6a8c1d70b5fd1c, type: 3}
    - {fileID: 328124609, guid: 1515863bb9bff0d4ab6a8c1d70b5fd1c, type: 3}
    - {fileID: 1302113671, guid: 1515863bb9bff0d4ab6a8c1d70b5fd1c, type: 3}
    - {fileID: 1345878773, guid: 1515863bb9bff0d4ab6a8c1d70b5fd1c, type: 3}
    - {fileID: -318188411, guid: 1515863bb9bff0d4ab6a8c1d70b5fd1c, type: 3}
    - {fileID: 1932728013, guid: 1515863bb9bff0d4ab6a8c1d70b5fd1c, type: 3}
    - {fileID: 245417147, guid: 1515863bb9bff0d4ab6a8c1d70b5fd1c, type: 3}
    - {fileID: -1560477912, guid: 1515863bb9bff0d4ab6a8c1d70b5fd1c, type: 3}
    - {fileID: 339945647, guid: 1515863bb9bff0d4ab6a8c1d70b5fd1c, type: 3}
    - {fileID: -1647687024, guid: 1515863bb9bff0d4ab6a8c1d70b5fd1c, type: 3}
    - {fileID: 2018379600, guid: 1515863bb9bff0d4ab6a8c1d70b5fd1c, type: 3}
  m_AnimationClipSettings:
    serializedVersion: 2
    m_AdditiveReferencePoseClip: {fileID: 0}
    m_AdditiveReferencePoseTime: 0
    m_StartTime: 0
    m_StopTime: 0.45000002
    m_OrientationOffsetY: 0
    m_Level: 0
    m_CycleOffset: 0
    m_HasAdditiveReferencePose: 0
    m_LoopTime: 1
    m_LoopBlend: 0
    m_LoopBlendOrientation: 0
    m_LoopBlendPositionY: 0
    m_LoopBlendPositionXZ: 0
    m_KeepOriginalOrientation: 0
    m_KeepOriginalPositionY: 1
    m_KeepOriginalPositionXZ: 0
    m_HeightFromFeet: 0
    m_Mirror: 0
  m_EditorCurves: []
  m_EulerEditorCurves: []
  m_HasGenericRootTransform: 0
  m_HasMotionFloatCurves: 0
  m_Events:
  - time: 0.43333334
    functionName: Explo
    data: 
    objectReferenceParameter: {fileID: 0}
    floatParameter: 0
    intParameter: 0
    messageOptions: 0
