%YAML 1.1
%TAG !u! tag:unity3d.com,2011:
--- !u!114 &11400000
MonoBehaviour:
  m_ObjectHideFlags: 0
  m_CorrespondingSourceObject: {fileID: 0}
  m_PrefabInstance: {fileID: 0}
  m_PrefabAsset: {fileID: 0}
  m_GameObject: {fileID: 0}
  m_Enabled: 1
  m_EditorHideFlags: 0
  m_Script: {fileID: 11500000, guid: 28a726fe12e044c4b907660cf7009a1c, type: 3}
  m_Name: ArcherState
  m_EditorClassIdentifier: 
  action: {fileID: 11400000, guid: d2cc8ccb89885dd4e8113aa2fb1b0151, type: 2}
  StateTransition:
  - {fileID: 11400000, guid: 931ae548a6fddff46bad797a8288d2f8, type: 2}
  - {fileID: 11400000, guid: 913a6bc5f52890843a716d2c12e45b85, type: 2}
  - {fileID: 11400000, guid: 556de415fce784048b930d709bd0ea6b, type: 2}
