%YAML 1.1
%TAG !u! tag:unity3d.com,2011:
--- !u!114 &11400000
MonoBehaviour:
  m_ObjectHideFlags: 0
  m_CorrespondingSourceObject: {fileID: 0}
  m_PrefabInstance: {fileID: 0}
  m_PrefabAsset: {fileID: 0}
  m_GameObject: {fileID: 0}
  m_Enabled: 1
  m_EditorHideFlags: 0
  m_Script: {fileID: 11500000, guid: f20eb1792e8048a46bf5c7c520a3ea3b, type: 3}
  m_Name: Pechera
  m_EditorClassIdentifier: 
  itemID: eaad4afb-a8be-43be-976a-b22b628a9506
  displayName: Chestplate
  description: A chestplate
  icon: {fileID: 21300000, guid: 7e03ed8b653ed2845aadb9ea3b7519c0, type: 3}
  pickup: {fileID: 0}
  stackable: 0
  allowedEquipLocation: 2
  damage: 0
  armor: 30
