%YAML 1.1
%TAG !u! tag:unity3d.com,2011:
--- !u!114 &11400000
MonoBehaviour:
  m_ObjectHideFlags: 0
  m_CorrespondingSourceObject: {fileID: 0}
  m_PrefabInstance: {fileID: 0}
  m_PrefabAsset: {fileID: 0}
  m_GameObject: {fileID: 0}
  m_Enabled: 1
  m_EditorHideFlags: 0
  m_Script: {fileID: 11500000, guid: f20eb1792e8048a46bf5c7c520a3ea3b, type: 3}
  m_Name: Botas
  m_EditorClassIdentifier: 
  itemID: eaad4afb-a8be-43be-976a-b22b628a9506
  displayName: Boots
  description: Fast as fuck boyyyyyyyyyyyyyyyy
  icon: {fileID: 21300000, guid: 114f119b3f8af8149b404f66961d61dc, type: 3}
  pickup: {fileID: 0}
  stackable: 0
  allowedEquipLocation: 4
  damage: 0
  armor: 5
