%YAML 1.1
%TAG !u! tag:unity3d.com,2011:
--- !u!114 &11400000
MonoBehaviour:
  m_ObjectHideFlags: 0
  m_CorrespondingSourceObject: {fileID: 0}
  m_PrefabInstance: {fileID: 0}
  m_PrefabAsset: {fileID: 0}
  m_GameObject: {fileID: 0}
  m_Enabled: 1
  m_EditorHideFlags: 0
  m_Script: {fileID: 11500000, guid: 28a726fe12e044c4b907660cf7009a1c, type: 3}
  m_Name: DieState
  m_EditorClassIdentifier: 
  action: {fileID: 11400000, guid: 767bfcdd4070ec14690833e526351e30, type: 2}
  StateTransition: []
