%YAML 1.1
%TAG !u! tag:unity3d.com,2011:
--- !u!114 &11400000
MonoBehaviour:
  m_ObjectHideFlags: 0
  m_CorrespondingSourceObject: {fileID: 0}
  m_PrefabInstance: {fileID: 0}
  m_PrefabAsset: {fileID: 0}
  m_GameObject: {fileID: 0}
  m_Enabled: 1
  m_EditorHideFlags: 0
  m_Script: {fileID: 11500000, guid: be8358f0fcfcb22418d7b5d788e02cc4, type: 3}
  m_Name: Health Potion
  m_EditorClassIdentifier: 
  itemID: 403ea236-ab74-4ddb-b17d-06c69bd84778
  displayName: Health Potion
  description: It is not known how it works but it regenerates hp, so... nobody complains.
  icon: {fileID: 21300000, guid: aba0f700d91d4fc4fa8c724899ab04ab, type: 3}
  pickup: {fileID: 6494234044896430859, guid: ab73185f2dadf4445ae07e78eb669c1f, type: 3}
  stackable: 1
  consumable: 1
  Mana: 0
  Health: 50
