%YAML 1.1
%TAG !u! tag:unity3d.com,2011:
--- !u!1001 &7499080698701533953
PrefabInstance:
  m_ObjectHideFlags: 0
  serializedVersion: 2
  m_Modification:
    m_TransformParent: {fileID: 0}
    m_Modifications:
    - target: {fileID: 100000, guid: 432dd2b7c2581c744a40ca43b1307c17, type: 3}
      propertyPath: m_Layer
      value: 6
      objectReference: {fileID: 0}
    - target: {fileID: 100002, guid: 432dd2b7c2581c744a40ca43b1307c17, type: 3}
      propertyPath: m_Name
      value: Flecha
      objectReference: {fileID: 0}
    - target: {fileID: 100002, guid: 432dd2b7c2581c744a40ca43b1307c17, type: 3}
      propertyPath: m_Layer
      value: 6
      objectReference: {fileID: 0}
    - target: {fileID: 400002, guid: 432dd2b7c2581c744a40ca43b1307c17, type: 3}
      propertyPath: m_RootOrder
      value: 0
      objectReference: {fileID: 0}
    - target: {fileID: 400002, guid: 432dd2b7c2581c744a40ca43b1307c17, type: 3}
      propertyPath: m_LocalScale.x
      value: 0.03
      objectReference: {fileID: 0}
    - target: {fileID: 400002, guid: 432dd2b7c2581c744a40ca43b1307c17, type: 3}
      propertyPath: m_LocalScale.y
      value: 0.03
      objectReference: {fileID: 0}
    - target: {fileID: 400002, guid: 432dd2b7c2581c744a40ca43b1307c17, type: 3}
      propertyPath: m_LocalScale.z
      value: 0.03
      objectReference: {fileID: 0}
    - target: {fileID: 400002, guid: 432dd2b7c2581c744a40ca43b1307c17, type: 3}
      propertyPath: m_LocalPosition.x
      value: 1.85
      objectReference: {fileID: 0}
    - target: {fileID: 400002, guid: 432dd2b7c2581c744a40ca43b1307c17, type: 3}
      propertyPath: m_LocalPosition.y
      value: 2.037
      objectReference: {fileID: 0}
    - target: {fileID: 400002, guid: 432dd2b7c2581c744a40ca43b1307c17, type: 3}
      propertyPath: m_LocalPosition.z
      value: 9
      objectReference: {fileID: 0}
    - target: {fileID: 400002, guid: 432dd2b7c2581c744a40ca43b1307c17, type: 3}
      propertyPath: m_LocalRotation.w
      value: 0.5
      objectReference: {fileID: 0}
    - target: {fileID: 400002, guid: 432dd2b7c2581c744a40ca43b1307c17, type: 3}
      propertyPath: m_LocalRotation.x
      value: -0.5
      objectReference: {fileID: 0}
    - target: {fileID: 400002, guid: 432dd2b7c2581c744a40ca43b1307c17, type: 3}
      propertyPath: m_LocalRotation.y
      value: 0.5
      objectReference: {fileID: 0}
    - target: {fileID: 400002, guid: 432dd2b7c2581c744a40ca43b1307c17, type: 3}
      propertyPath: m_LocalRotation.z
      value: 0.5
      objectReference: {fileID: 0}
    - target: {fileID: 400002, guid: 432dd2b7c2581c744a40ca43b1307c17, type: 3}
      propertyPath: m_LocalEulerAnglesHint.x
      value: -90
      objectReference: {fileID: 0}
    - target: {fileID: 400002, guid: 432dd2b7c2581c744a40ca43b1307c17, type: 3}
      propertyPath: m_LocalEulerAnglesHint.y
      value: 90
      objectReference: {fileID: 0}
    - target: {fileID: 400002, guid: 432dd2b7c2581c744a40ca43b1307c17, type: 3}
      propertyPath: m_LocalEulerAnglesHint.z
      value: 0
      objectReference: {fileID: 0}
    - target: {fileID: 400002, guid: 432dd2b7c2581c744a40ca43b1307c17, type: 3}
      propertyPath: m_ConstrainProportionsScale
      value: 1
      objectReference: {fileID: 0}
    - target: {fileID: 2300000, guid: 432dd2b7c2581c744a40ca43b1307c17, type: 3}
      propertyPath: m_Materials.Array.data[0]
      value: 
      objectReference: {fileID: 2100000, guid: 218bc31bfb47771419a0cb03e28bc039, type: 2}
    m_RemovedComponents: []
  m_SourcePrefab: {fileID: 100100000, guid: 432dd2b7c2581c744a40ca43b1307c17, type: 3}
--- !u!1 &7499080698701436323 stripped
GameObject:
  m_CorrespondingSourceObject: {fileID: 100002, guid: 432dd2b7c2581c744a40ca43b1307c17, type: 3}
  m_PrefabInstance: {fileID: 7499080698701533953}
  m_PrefabAsset: {fileID: 0}
--- !u!54 &9020710768341532539
Rigidbody:
  m_ObjectHideFlags: 0
  m_CorrespondingSourceObject: {fileID: 0}
  m_PrefabInstance: {fileID: 0}
  m_PrefabAsset: {fileID: 0}
  m_GameObject: {fileID: 7499080698701436323}
  serializedVersion: 2
  m_Mass: 1
  m_Drag: 0
  m_AngularDrag: 0.05
  m_UseGravity: 1
  m_IsKinematic: 0
  m_Interpolate: 0
  m_Constraints: 0
  m_CollisionDetection: 0
--- !u!65 &615023333835932795
BoxCollider:
  m_ObjectHideFlags: 0
  m_CorrespondingSourceObject: {fileID: 0}
  m_PrefabInstance: {fileID: 0}
  m_PrefabAsset: {fileID: 0}
  m_GameObject: {fileID: 7499080698701436323}
  m_Material: {fileID: 0}
  m_IsTrigger: 0
  m_Enabled: 1
  serializedVersion: 2
  m_Size: {x: 0.3017753, y: 1.6580503, z: 0.113581814}
  m_Center: {x: 0.007962716, y: -8.768233, z: -0.9957715}
--- !u!65 &2475838044389837640
BoxCollider:
  m_ObjectHideFlags: 0
  m_CorrespondingSourceObject: {fileID: 0}
  m_PrefabInstance: {fileID: 0}
  m_PrefabAsset: {fileID: 0}
  m_GameObject: {fileID: 7499080698701436323}
  m_Material: {fileID: 0}
  m_IsTrigger: 1
  m_Enabled: 1
  serializedVersion: 2
  m_Size: {x: 0.14327374, y: 14.150815, z: 0.113581814}
  m_Center: {x: -0.0025908465, y: -0.6667734, z: -0.9957715}
--- !u!114 &-2385496940709063808
MonoBehaviour:
  m_ObjectHideFlags: 0
  m_CorrespondingSourceObject: {fileID: 0}
  m_PrefabInstance: {fileID: 0}
  m_PrefabAsset: {fileID: 0}
  m_GameObject: {fileID: 7499080698701436323}
  m_Enabled: 1
  m_EditorHideFlags: 0
  m_Script: {fileID: 11500000, guid: 5ff180b48d10bc74db01626193d329ae, type: 3}
  m_Name: 
  m_EditorClassIdentifier: 
  tiempoDestruccion: 3
