Time	Speaker	Said	Mis	NB	BS
592,322121	User	say yes                                                                                                                 			
592,338447	Robot	The yes                                                                                                                 			
605,784471	User	to say yes is to say no                                                                                                 	S	1	
605,828057	Robot	Yes, to say.                                                                                                            			
611,501254	User	say yes                                                                                                                 			
611,515257	Robot	The yes                                                                                                                 			
622,884182	User	to say yes is to say yes and to say no                                                                                  	S	1	
622,986697	Robot	Yes, to say. Yes, I know the   yes is to say the no.                                                                    			
655,572727	User	to raise your arms is to raise your left arm and to raise your right arm                                                		1	
655,632593	Robot	Yes, to raise my arms is   to raise my left arm and to raise my right arm.                                              			1
665,706568	User	raise your arms                                                                                                         			
735,236152	User	to raise your arms is to raise your left arm and to lower your left arm                                                 		1	
735,309585	Robot	Yes, to raise my arms is   to raise my left arm and to lower my left arm.                                               			1
743,922293	User	raise your arms                                                                                                         			
792,110437	User	to greet is to to say yes and to raise your left arm                                                                    		1	
792,160679	Robot	Yes, to greet   is to say the yes and to raise my left arm.                                                             			1
798,609975	User	greet                                                                                                                   			
798,621188	Robot	The yes.                                                                                                                			
824,809793	User	to look left is to greet                                                                                                	S	1	
830,145556	User	greet                                                                                                                   			
830,161411	Robot	The yes.                                                                                                                			
853,36347	User	look left                                                                                                               			
883,206656	User	to look right is to move forward                                                                                        		1	
883,241595	Robot	Yes, to look right is to move forward.                                                                                  			
893,201826	User	look left and look right                                                                                                			
922,296449	User	to look right is to look right and to look right                                                                        	S	1	
922,350298	Robot	Yes, I know to look right is to look right.                                                                             			
931,306126	User	look right                                                                                                              			
954,56497	User	to sploof is to move backward                                                                                           	S	1	
958,343298	User	sploof                                                                                                                  	S		
967,305267	User	sploof                                                                                                                  	S		
978,057771	User	to sleesh is to turn away                                                                                               	S	1	
985,596871	User	sleesh                                                                                                                  	S		
1000,75091	User	to splash is to sleesh and to splooof                                                                                   	S		
1000,811782	Robot	Yes, I know to splash is splooof to.                                                                                    			
1006,913243	User	splash                                                                                                                  			
1006,950713	Robot	I can't splash.                                                                                                         			
1032,087782	User	to splash is to say splash                                                                                              		1	
1032,128612	Robot	Yes, to splash is to say the splash.                                                                                    			1
1036,847725	User	splash                                                                                                                  			
1036,861633	Robot	The splash                                                                                                              			
1053,734075	User	to spleesh is to splash and to say spleesh                                                                              	S	1	
1053,749839	Robot	To say the splash.                                                                                                      			
1062,002509	User	spleesh                                                                                                                 	S		
1088,70642	User	to to is to say to                                                                                                      	S	1	
1093,407522	User	to                                                                                                                      	S		
1164,123402	User	to say truc is to say bidule                                                                                            	S	1	
1167,061401	User	say truc                                                                                                                			
1167,074983	Robot	Truc                                                                                                                    			
1176,355472	User	say bidule                                                                                                              			
1176,370059	Robot	Bidule                                                                                                                  			
1199,165595	User	to look left is to look forward and to look up                                                                          		1	
1199,211322	Robot	Yes, to look left   is to look forward and to look up up.                                                               			
1206,069842	User	look left                                                                                                               			
1247,82466	User	to look right is to look left and to turn right and to move forward and to raise your arms and to say yes and to spleesh	S	1	
1247,880091	Robot	Yes, I know to look right is to look left.                                                                              			
1259,96942	User	look right                                                                                                              			
