Time	Speaker	Said	Mis	NB	BS
25372,620165	User	to sulk is to say fuck move forward and turn away                              		1	
25372,652988	Robot	Sorry, I don't understand.                                                     	S		
25392,155171	User	to sulk is to say fuck, move forward and turn away                             			
25392,229428	Robot	Yes, to sulk is to say the   fuck, to move forward and to turn away.           			1
25419,606638	User	Pepper, sulk                                                                   			
25419,651532	Robot	Sorry, I don't understand.                                                     	U		
25477,497333	User	to agree is to say ok and raise your left arm                                  		1	
25477,556675	Robot	Yes,   to agree is to say ok and to raise my left arm.                         			1
25485,165544	User	do you agree?                                                                  			
25485,201046	Robot	Sorry, I don't understand.                                                     	U		
25492,460729	User	agree                                                                          			
25492,478433	Robot	Ok.                                                                            			
25525,882082	User	to be upset is to say no and move back                                         	S	1	
25525,925373	Robot	Sorry, I don't understand.                                                     			
25579,678568	User	to be excited is to say yes yes yes yes yes                                    	S	1	
25579,709695	Robot	Sorry, I don't understand.                                                     			
25592,923905	User	sulk                                                                           			
25592,944483	Robot	The fuck.    .                                                                 			
25669,354846	User	to search is look left look right look left again                              	S	1	
25669,393756	Robot	Sorry, I don't understand.                                                     			
25683,156843	User	pepper, search                                                                 	U		
25683,199288	Robot	Sorry, I don't understand.                                                     			
25703,310691	User	to search is to look right and look left and look right                        	S		
25703,340885	Robot	Sorry, I don't understand.                                                     			
25718,537622	User	pepper you are stupid                                                          	U		
25718,571651	Robot	Sorry, I don't understand.                                                     			
25745,114541	User	to be stupid is to turn away and say I don't understand                        		1	
25745,184473	Robot	Yes, to be   stupid is to turn away and   to say somebody doesn't understand.  			1
25754,401376	User	stupid                                                                         	U		
25754,436553	Robot	Sorry, I don't understand.                                                     			
25780,403701	User	be stupid                                                                      	S		
25780,435269	Robot	Sorry, I don't understand.                                                     			
25821,015864	User	to come is to move forward                                                     		1	
25821,055364	Robot	Yes, to come is to move forward.                                               			1
25825,292072	User	come                                                                           			
25834,649534	User	come                                                                           			
25886,023059	User	come                                                                           			
25895,521648	User	come                                                                           			
25911,428378	User	pepper, come                                                                   	U		
25911,457948	Robot	Sorry, I don't understand.                                                     			
25915,829363	User	come                                                                           			
