Time	Speaker	Said	Mis	NB	BS
2023,716458	User	Hello	U		
2024,123635	Robot	Sorry, I don't understand.			
2029,864798	User	Hello	U		
2030,197526	Robot	Sorry, I don't understand.			
2057,045263	User	Look on the right	U		
2057,399395	Robot	Sorry, I don't understand.			
2120,728514	User	To grade someone		1	
2120,867952	Robot	Ok			
2125,554433	User	Is to say hello			
2125,687202	Robot	Is that all?			
2131,417315	User	Yes			
2131,56215	Robot	Ok, to grade somebody is to say hello.			1
2192,754713	User	To navigate		1	
2192,913871	Robot	Ok			
2195,446197	User	Is to move forward			
2195,616166	Robot	Is that all?			
2196,981711	User	Then			
2197,095234	Robot	Ok			
2201,578483	User	To navigate	S		
2201,770736	Robot	Is that all?			
2205,406072	User	No			
2205,54309	Robot	Ok			
2209,842731	User	To navigate	S		
2209,998781	Robot	Ok			
2217,740401	User	East to move forward	A		
2217,885729	Robot	Is that all?			
2225,668998	User	To navigate is to move forward			
2225,845634	Robot	Is that all?			
2229,411876	User	Left	A		
2229,595456	Robot	Is that all?			
2236,683808	User	To navigate us to move forward	A		
2236,847181	Robot	Is that all?			
2241,781719	User	No			
2241,963144	Robot	Ok			
2248,792372	User	To navigate is to move forward to turn left to move backward			
2248,995165	Robot	Is that all?			
2253,172239	User	Yes			
2253,386149	Robot	Ok, to navigate is to move forward, then to navigate, then to navigate, then to move forward and then to move forward to turn left to move backward.			1
2264,262164	User	No			
2264,629658	Robot	Sorry, I don't understand.			
2270,178175	User	Please forget about navigation			
2270,570122	Robot	Sorry, I don't understand.		1	
2277,481659	User	To navigate is to move forward			
2277,669514	Robot	Is that all?			
2290,837296	User	No			
2291,008875	Robot	Ok			
2293,864596	User	Then to 10 left	A		
2294,055234	Robot	Is that all?			
2303,049892	User	Yes	S		
2303,214662	Robot	Ok			
2312,99298	User	To move forward			
2313,160653	Robot	Ok			
2320,572229	User	To explore is to move forward			
2320,755152	Robot	Is that all?			
2338,228771	User	And then to	A		
2338,407522	Robot	Is that all?			
2345,907646	User	Yes			
2346,17957	Robot	Ok, to explore is to move forward, then to move forward and then to move forward.			1
2381,183254	User	Navigate please	U		
2381,55682	Robot	Sorry, I don't understand.			
2387,71253	User	To navigate		1	
2387,884997	Robot	Ok			
2391,371711	User	Is to move	A		
2391,637807	Robot	Is that all?			
2401,101466	User	To navigate is to move forward			
2401,316919	Robot	Is that all?			
2403,633422	User	No			
2403,825941	Robot	Ok			
2419,578326	User	Didn't	A		
2419,756739	Robot	Ok			
2430,325174	User	To navigate			
2430,522827	Robot	Ok			
2435,719662	User	To navigate	S		
2435,896253	Robot	Ok			
2444,13222	User	To navigate	S		
2444,304902	Robot	Ok			
2447,402906	User	Is to move forward	S		
2447,775785	Robot	Sorry, I don't understand.			
2457,646104	User	To navigate east to move forward	A		
2457,838041	Robot	Ok			
2461,657751	User	Navigate	S		
2461,862133	Robot	Ok			
2468,620619	User	Please navigate	S		
2468,815061	Robot	Ok			
2482,384142	User	To navigate	S		
2482,616271	Robot	Ok			
2504,214466	User	Then	A		
2504,416706	Robot	Ok			
2516,290885	User	Is to move forward			
2516,626417	Robot	Ok, to move forward is to navigate east, then to move forward and then to navigate.			1
2547,471133	User	Please forget for	A		
2547,904736	Robot	Sorry, I don't understand.			
2567,757724	User	Four	A		
2568,209842	Robot	Sorry, I don't understand.			
2578,1223	User	Four	A		
2578,521242	Robot	Sorry, I don't understand.			
2585,336833	User	Turn left			
2617,236776	User	Turn left			
2650,905749	User	Move back			
