Session	Phase	Time	Speaker	Utterance	NLU	BS	Comment
9c0bbb16-5322-4461-8f38-d704de752542	pure_teaching	35.26	H	To greet is to raise the right arm and to say hello	A		
9c0bbb16-5322-4461-8f38-d704de752542	pure_teaching	37.27	R	Hello			
9c0bbb16-5322-4461-8f38-d704de752542	pure_teaching	35.26	H	To greet is to raise the right arm and say hello	A		
9c0bbb16-5322-4461-8f38-d704de752542	pure_teaching	43.26	R	Sorry, I don’t understand			
9c0bbb16-5322-4461-8f38-d704de752542	pure_teaching	48.25	H	To greet is to raise the right arm and to say hello	A		
9c0bbb16-5322-4461-8f38-d704de752542	pure_teaching	50.43	R	Sorry, I don’t understand			
9c0bbb16-5322-4461-8f38-d704de752542	pure_teaching	57.57	H	To greet is to raise the right arm and to say hello	G		
9c0bbb16-5322-4461-8f38-d704de752542	pure_teaching	59.41	R	Is that all ?			
9c0bbb16-5322-4461-8f38-d704de752542	pure_teaching	60.71	H	Yes	N		
9c0bbb16-5322-4461-8f38-d704de752542	pure_teaching	63.85	H	Yes	G		
9c0bbb16-5322-4461-8f38-d704de752542	pure_teaching	58.24	R	Okay, to greet is to raise the right arm and to say hello		1	
9c0bbb16-5322-4461-8f38-d704de752542	pure_teaching	71.90	H	Greet	N		
9c0bbb16-5322-4461-8f38-d704de752542	pure_teaching	77.09	H	Greet	N		
9c0bbb16-5322-4461-8f38-d704de752542	pure_teaching	82.54	H	Pepper, greet	N		
9c0bbb16-5322-4461-8f38-d704de752542	pure_teaching	87.20	H	To move forward and to greet is to welcome	S		
9c0bbb16-5322-4461-8f38-d704de752542	pure_teaching	88.98	R	Okay			
9c0bbb16-5322-4461-8f38-d704de752542	pure_teaching	93.41	H	To move forward and to greet is to welcome	S		
9c0bbb16-5322-4461-8f38-d704de752542	pure_teaching	95.43	R	Okay			
9c0bbb16-5322-4461-8f38-d704de752542	pure_teaching	100.18	H	No, to move forward and to greet is to welcome	A		
9c0bbb16-5322-4461-8f38-d704de752542	pure_teaching	103.33	R	Sorry, I don’t understand			
9c0bbb16-5322-4461-8f38-d704de752542	pure_teaching	108.104	H	To move forward and to greet is to welcome	S		
9c0bbb16-5322-4461-8f38-d704de752542	pure_teaching	110.91	R	Sorry, I don’t understand			
9c0bbb16-5322-4461-8f38-d704de752542	pure_teaching	116.78	H	To move forward and to greet is to welcome	G		
9c0bbb16-5322-4461-8f38-d704de752542	pure_teaching	118.41	R	Is that all ?			
9c0bbb16-5322-4461-8f38-d704de752542	pure_teaching	119.33	H	Yes	N		
9c0bbb16-5322-4461-8f38-d704de752542	pure_teaching	122.69	H	Yes	G		
9c0bbb16-5322-4461-8f38-d704de752542	pure_teaching	128.96	R	Okay, to move forward to greet is to forward and to greet it then to welcome and then to welcome		1	
9c0bbb16-5322-4461-8f38-d704de752542	pure_teaching	131.84	H	Okay	U		
9c0bbb16-5322-4461-8f38-d704de752542	pure_teaching	103.33	R	Sorry, I don’t understand			
9c0bbb16-5322-4461-8f38-d704de752542	pure_teaching	142.31	H	Raise your left arm	G		
9c0bbb16-5322-4461-8f38-d704de752542	pure_teaching	146.30	H	Lower your left arm	N		
9c0bbb16-5322-4461-8f38-d704de752542	pure_teaching	149.22	H	Lower your left arm	N		
9c0bbb16-5322-4461-8f38-d704de752542	pure_teaching	153.41	H	Lower your left arm	N		
9c0bbb16-5322-4461-8f38-d704de752542	pure_teaching	157.75	H	Move forward	A		
9c0bbb16-5322-4461-8f38-d704de752542	pure_teaching	158.82	R	Sorry, I don’t understand			
9c0bbb16-5322-4461-8f38-d704de752542	pure_teaching	162.92	H	Lower your left arm	N		
9c0bbb16-5322-4461-8f38-d704de752542	pure_teaching	166.91	H	Lower your left arm	N		
9c0bbb16-5322-4461-8f38-d704de752542	pure_teaching	174.06	H	Move forward	A		
9c0bbb16-5322-4461-8f38-d704de752542	pure_teaching	176.24	R	Sorry, I don’t understand			
9c0bbb16-5322-4461-8f38-d704de752542	pure_teaching	224.83	H	Turn left	G		
9c0bbb16-5322-4461-8f38-d704de752542	pure_teaching	226.75	H	Turn left	N		
9c0bbb16-5322-4461-8f38-d704de752542	pure_teaching	228.31	H	Turn left	N		
9c0bbb16-5322-4461-8f38-d704de752542	pure_teaching	231.54	H	Turn right	N		
9c0bbb16-5322-4461-8f38-d704de752542	pure_teaching	234.83	H	Turn right	G		
9c0bbb16-5322-4461-8f38-d704de752542	pure_teaching	238.56	H	Ok	U		
9c0bbb16-5322-4461-8f38-d704de752542	pure_teaching	241.27	R	Sorry, I don’t understand			
9c0bbb16-5322-4461-8f38-d704de752542	pure_teaching	242.68	H	I’m done	U		
9c0bbb16-5322-4461-8f38-d704de752542	pure_teaching	245.54	R	Sorry, I don’t understand			
9c0bbb16-5322-4461-8f38-d704de752542	pure_teaching	247.43	H	Let’s move to the next part	U		
9c0bbb16-5322-4461-8f38-d704de752542	pure_teaching	250.06	R	Sorry, I don’t understand			
9c0bbb16-5322-4461-8f38-d704de752542	pure_teaching	238.45	H	Welcome me	U		
9c0bbb16-5322-4461-8f38-d704de752542	pure_teaching	241.17	R	Sorry, I don’t understand			
9c0bbb16-5322-4461-8f38-d704de752542	pure_teaching	242.68	H	I’m done	U		
9c0bbb16-5322-4461-8f38-d704de752542	pure_teaching	245.44	R	Sorry, I don’t understand			
9c0bbb16-5322-4461-8f38-d704de752542	pure_teaching	247.23	H	Let’s move to the next part	U		
9c0bbb16-5322-4461-8f38-d704de752542	pure_teaching	250.06	R	Sorry, I don’t understand			
9c0bbb16-5322-4461-8f38-d704de752542	pure_teaching	251.66	H	Welcome me	U		
9c0bbb16-5322-4461-8f38-d704de752542	pure_teaching	254.92	R	Sorry, I don’t understand			
9c0bbb16-5322-4461-8f38-d704de752542	pure_teaching	255.53	H	Greet	G		
9c0bbb16-5322-4461-8f38-d704de752542	pure_teaching	259.21	R	Hello			
9c0bbb16-5322-4461-8f38-d704de752542	pure_teaching	265.10	H	Lower your right arm	N		
9c0bbb16-5322-4461-8f38-d704de752542	pure_teaching	269.38	H	Lower your right arm	G		
9c0bbb16-5322-4461-8f38-d704de752542	pure_teaching	278.22	H	To move forward and to greet is to welcome	A		
9c0bbb16-5322-4461-8f38-d704de752542	pure_teaching	281.05	R	Sorry, I don’t understand			
9c0bbb16-5322-4461-8f38-d704de752542	pure_teaching	284.84	H	To move forward and to greet is to welcome	A		
9c0bbb16-5322-4461-8f38-d704de752542	pure_teaching	288.00	R	Sorry, I don’t understand			
9c0bbb16-5322-4461-8f38-d704de752542	pure_teaching	370.13	H	Look left	A		
9c0bbb16-5322-4461-8f38-d704de752542	pure_teaching	372.99	R	Sorry, I don’t understand			
9c0bbb16-5322-4461-8f38-d704de752542	pure_teaching	376.82	H	Look right	G		
9c0bbb16-5322-4461-8f38-d704de752542	pure_teaching	381.53	H	Look left	N		
9c0bbb16-5322-4461-8f38-d704de752542	pure_teaching	385.01	H	Look left	G		
9c0bbb16-5322-4461-8f38-d704de752542	pure_teaching	391.07	H	Look forward	G		
9c0bbb16-5322-4461-8f38-d704de752542	pure_teaching	396.08	H	Turn away	F		
9c0bbb16-5322-4461-8f38-d704de752542	pure_teaching	399.73	H	Turn away	F		
9c0bbb16-5322-4461-8f38-d704de752542	pure_teaching	404.08	H	Turn away	F		
9c0bbb16-5322-4461-8f38-d704de752542	pure_teaching	407.83	H	Turn away	F		
9c0bbb16-5322-4461-8f38-d704de752542	pure_teaching	411.58	H	Turn away	F		
9c0bbb16-5322-4461-8f38-d704de752542	pure_teaching	532.14	H	To move forward and to greet is to welcome	A		
9c0bbb16-5322-4461-8f38-d704de752542	pure_teaching	535.11	R	Sorry, I don’t understand			
9c0bbb16-5322-4461-8f38-d704de752542	teaching_chat	46.14	H	Wave bye	N		
9c0bbb16-5322-4461-8f38-d704de752542	teaching_chat	51.36	H	Wave bye	N		
9c0bbb16-5322-4461-8f38-d704de752542	teaching_chat	55.87	H	Wave bye	N		
9c0bbb16-5322-4461-8f38-d704de752542	teaching_chat	70.104	H	Say hello	G		
9c0bbb16-5322-4461-8f38-d704de752542	teaching_chat	71.71	R	Hello			
9c0bbb16-5322-4461-8f38-d704de752542	teaching_chat	72.90	R	Hey there			
9c0bbb16-5322-4461-8f38-d704de752542	teaching_chat	74.90	H	Wave bye	N		
9c0bbb16-5322-4461-8f38-d704de752542	teaching_chat	95.17	H	Raise your arms and turn away	G		
9c0bbb16-5322-4461-8f38-d704de752542	teaching_chat	101.06	R	And there it is			
9c0bbb16-5322-4461-8f38-d704de752542	teaching_chat	110.59	H	Turn away	N		
9c0bbb16-5322-4461-8f38-d704de752542	teaching_chat	117.32	H	Turn away	N		
9c0bbb16-5322-4461-8f38-d704de752542	teaching_chat	121.94	H	Turn away	N		
9c0bbb16-5322-4461-8f38-d704de752542	teaching_chat	126.80	H	Turn away	N		
9c0bbb16-5322-4461-8f38-d704de752542	teaching_chat	133.31	H	Turn away	N		
9c0bbb16-5322-4461-8f38-d704de752542	teaching_chat	139.99	H	Turn away	N		
9c0bbb16-5322-4461-8f38-d704de752542	teaching_chat	144.41	H	Move backward	G		
9c0bbb16-5322-4461-8f38-d704de752542	teaching_chat	145.77	R	Alright			
9c0bbb16-5322-4461-8f38-d704de752542	teaching_chat	149.69	H	Turn away			
9c0bbb16-5322-4461-8f38-d704de752542	teaching_chat	153.24	H	Turn around	A		
9c0bbb16-5322-4461-8f38-d704de752542	teaching_chat	155.74	R	Sorry, I don’t understand			
9c0bbb16-5322-4461-8f38-d704de752542	teaching_chat	160.84	H	To turn around is to turn right	G		
9c0bbb16-5322-4461-8f38-d704de752542	teaching_chat	162.14	R	Is that all ?			
9c0bbb16-5322-4461-8f38-d704de752542	teaching_chat	163.06	H	Yes	G	1	Crash
970fc9d2-624f-48cd-9168-9b93dccdde73	teaching_chat	47.80	H	Lève le bras droit	G		
970fc9d2-624f-48cd-9168-9b93dccdde73	teaching_chat	51.06	R	D’accord, je lève le bras droit, merci			
970fc9d2-624f-48cd-9168-9b93dccdde73	teaching_chat	59.42	H	Faire le salut nazi c’est lever le bras droit	A		Probably A...
970fc9d2-624f-48cd-9168-9b93dccdde73	teaching_chat	62.01	R	Dé-. Salut			
970fc9d2-624f-48cd-9168-9b93dccdde73	teaching_chat	68.66	H	Faire le salut nazi c’est lever le bras droit	A		
970fc9d2-624f-48cd-9168-9b93dccdde73	teaching_chat	74.62	R	Tu m’as déjà salué, mais trop de politesee vaut mieux que pas assez			
970fc9d2-624f-48cd-9168-9b93dccdde73	teaching_chat	99.10	H	Être curieux c’est avancer et reculer	A		
970fc9d2-624f-48cd-9168-9b93dccdde73	teaching_chat	100.51	R	Okay			
970fc9d2-624f-48cd-9168-9b93dccdde73	teaching_chat	121.97	H	Être un porte-manteau c’est garder le bras levé	S		
970fc9d2-624f-48cd-9168-9b93dccdde73	teaching_chat	123.50	R	Okay			
970fc9d2-624f-48cd-9168-9b93dccdde73	teaching_chat	127.07	R	Je me sers surtout des mains pour exprimer mes émotions			
970fc9d2-624f-48cd-9168-9b93dccdde73	teaching_chat	130.81	H	Fais le beau	G		
970fc9d2-624f-48cd-9168-9b93dccdde73	teaching_chat	137.94	R	Je n’en ai pas besoin, je porte toujours les mêmes habits sur moi et je ne suis jamais sale			
970fc9d2-624f-48cd-9168-9b93dccdde73	teaching_chat	146.51	H	Garde le bras levé	G		Not really what the user wanted to hear.
970fc9d2-624f-48cd-9168-9b93dccdde73	teaching_chat	151.05	R	Je me sers surtout des mains pour exprimer mes émotions			
970fc9d2-624f-48cd-9168-9b93dccdde73	teaching_chat	158.39	H	Être un porte-manteau c’est garder le bras levé	N		
970fc9d2-624f-48cd-9168-9b93dccdde73	teaching_chat	166.04	H	Être utile c’est garder le bras levé	N		
970fc9d2-624f-48cd-9168-9b93dccdde73	teaching_chat	197.23	H	Tenir un vêtement c’est garder le bras levé	N		
970fc9d2-624f-48cd-9168-9b93dccdde73	teaching_chat	186.31	H	Tiens un vêtement, un vêtement	N		
970fc9d2-624f-48cd-9168-9b93dccdde73	teaching_chat	190.16	H	Tiens un vêtement	N		
970fc9d2-624f-48cd-9168-9b93dccdde73	teaching_chat	197.82	H	C’est un peu chaud là ?	N		
970fc9d2-624f-48cd-9168-9b93dccdde73	teaching_chat	201.93	H	Recule	N		
970fc9d2-624f-48cd-9168-9b93dccdde73	teaching_chat	206.25	H	Recule	N		
970fc9d2-624f-48cd-9168-9b93dccdde73	teaching_chat	209.99	H	Recule	N		
970fc9d2-624f-48cd-9168-9b93dccdde73	teaching_chat	213.51	H	Allo ?	N		
970fc9d2-624f-48cd-9168-9b93dccdde73	teaching_chat	215.22	H	Y’a quelqu’un ?	N		
970fc9d2-624f-48cd-9168-9b93dccdde73	teaching_chat	221.15	H	Pourquoi tu parles plus ?	N		
970fc9d2-624f-48cd-9168-9b93dccdde73	teaching_chat	228.59	H	Lève le bras	N		
970fc9d2-624f-48cd-9168-9b93dccdde73	teaching_chat	239.07	H	Tiens une balle	N		
970fc9d2-624f-48cd-9168-9b93dccdde73	teaching_chat	245.41	H	Tenir une balle c’est lever le bras	N		
970fc9d2-624f-48cd-9168-9b93dccdde73	teaching_chat	255.42	H	Parle plus fort	N		
970fc9d2-624f-48cd-9168-9b93dccdde73	teaching_chat	259.25	H	J’entends plus rien	N		
970fc9d2-624f-48cd-9168-9b93dccdde73	teaching_chat	261.38	H	C’est tout buggé	N		
970fc9d2-624f-48cd-9168-9b93dccdde73	teaching_chat	266.08	H	Il y a un bug	N		
970fc9d2-624f-48cd-9168-9b93dccdde73	teaching_chat	272.66	H	Quand il y a un bug appelle le SAV	N		
970fc9d2-624f-48cd-9168-9b93dccdde73	teaching_chat	281.05	H	Quand tu ne peux plus parler il y a un bug	N		
970fc9d2-624f-48cd-9168-9b93dccdde73	teaching_chat	287.78	H	Quand tu ne peux plus parler appelle le SAV	N		
970fc9d2-624f-48cd-9168-9b93dccdde73	teaching_chat	293.40	H	Je sais plus quoi faire	N		
970fc9d2-624f-48cd-9168-9b93dccdde73	teaching_chat	298.51	H	Quand je ne sais plus quoi faire recule	N		
970fc9d2-624f-48cd-9168-9b93dccdde73	teaching_chat	301.83	H	Quand je ne sais plus quoi faire recule	N		
970fc9d2-624f-48cd-9168-9b93dccdde73	teaching_chat	310.87	H	Peux-tu tuer mon chat ?	N		
