Time	Speaker	Said	Mis	NB	BS
5086,179564	User	To work for	A	1	
5086,540579	Robot	Sorry, I don't understand.			
5114,875716	User	Write and say hello	A		
5115,03368	Robot	Hello			
5148,5897	User	Today is to raise the left	A		
5148,965532	Robot	Sorry, I don't understand.			
5195,112065	User	Today is to raise the left arm	A		
5195,465911	Robot	Sorry, I don't understand.			
5214,976331	User	Twickham is to move forward	A		
5215,336448	Robot	Sorry, I don't understand.			
5221,644991	User	Twickham is to move forward	A		
5221,999134	Robot	Sorry, I don't understand.			
5231,690705	User	To welcome you to move forward	A		
5231,81037	Robot	Ok			
5249,413658	User	Today is	A	1	
5249,757989	Robot	Sorry, I don't understand.			
5256,414746	User	To Dennis is to raise the right	A		
5256,75606	Robot	Sorry, I don't understand.			
5274,45861	User	To town around Eastatoe left	A		
5274,790239	Robot	Sorry, I don't understand.			
5295,296848	User	To tell him around	A		
5295,629616	Robot	Sorry, I don't understand.			
5301,667394	User	To tell me right	A		
5301,788332	Robot	Ok			
5320,874549	User	To accept is to raise the left arm		1	
5321,006554	Robot	Is that all?			
5325,528225	User	Yes			
5325,711888	Robot	Ok, to accept is to raise the left arm.			1
5343,141901	User	To refuse Eastatoe left then	A	1	
5343,476287	Robot	Sorry, I don't understand.			
5350,0423	User	To refuse to tell it	A		
5350,165649	Robot	Ok			
5381,077811	User	Check is to	A		
5381,442098	Robot	Sorry, I don't understand.			
5396,569522	User	To check he's to raise the right	A		
5396,699972	Robot	Ok			
5427,694868	User	To play left	A	1	
5427,845335	Robot	Ok			
5434,358996	User	To play Eastatoe left	A		
5434,546501	Robot	Ok			
5462,890479	User	To play	A		
5463,035121	Robot	Ok			
5472,631639	User	To play Instituto left	A		
5472,7694	Robot	Ok			
5501,812142	User	And look right			
5501,964381	Robot	Ok			
5546,509854	User	Take a photo	A	1	
5546,713696	Robot	Ok			
5552,779472	User	To take a photo	S		
5552,936081	Robot	Ok			
5564,481052	User	To take a photo east to raise arms	A		
5564,632456	Robot	Ok			
5603,727899	User	Move for	A		
5604,168063	Robot	Sorry, I don't understand.			
5610,686499	User	Karen is to move forward	A		
5611,023749	Robot	Sorry, I don't understand.			
5622,564136	User	To move forward and move forward	A		
5622,710465	Robot	Ok			
