Time	Speaker	Said	Mis	NB	BS
3107,187973	User	To be polite is to move forward and say hello		1	
3107,392069	Robot	Is that all?			
3118,29395	User	Yes			
3118,446212	Robot	Ok, to be polite is to move forward and then to say hello.			1
3132,223423	User	To find something		1	
3132,395913	Robot	Ok			
3135,900495	User	Look left and right	U		
3136,273766	Robot	Sorry, I don't understand.			
3152,412124	User	To search		1	
3152,530937	Robot	Ok	A		
3154,43746	User	Left and right			
3154,59468	Robot	Ok	S		
3275,885102	User	Turn left	S		
3285,611893	User	Look forward			
3297,774585	User	To search is to look left and look right			
3297,90223	Robot	Is that all?			
3300,724744	User	Yes			
3300,897836	Robot	Ok, to search is to look left and right.			1
3316,52748	User	How are you	U		
3316,860946	Robot	Sorry, I don't understand.			
3324,598109	User	To be polite is to say how are you		1	
3324,737489	Robot	Is that all?			
3327,480658	User	Yes			
3327,652427	Robot	Ok, to be polite is to say how I am.			1
3338,806724	User	Thank you	U		
3339,173915	Robot	Sorry, I don't understand.			
3345,474601	User	To be polite is to say thank you		1	
3345,606096	Robot	Is that all?			
3348,123225	User	Yes			
3348,270506	Robot	Ok, to be polite is to say thank you.			1
3391,084932	User	Okay			
3391,459492	Robot	Sorry, I don't understand.			
3421,771614	User	To show entrance is to turn left		1	
3421,92137	Robot	Is that all?			
3428,174733	User	No			
3428,30878	Robot	Ok			
3433,732915	User	To show entrance			
3433,846551	Robot	Ok			
3450,278295	User	To show interest is to turn left N-rays left arm	A		
3450,441688	Robot	Is that all?			
3454,128872	User	No			
3454,277726	Robot	Ok			
3459,115642	User	To show entrance is to	A		
3459,264704	Robot	Ok			
3472,583323	User	To look at the stars is to raise the head		1	
3472,740287	Robot	Is that all?			
3475,800426	User	Yes			
3476,0099	Robot	Ok, to look at the stars is to turn left, then to show the entrance, then to turn left rays left arm and then to raise the head.			1
3494,140608	User	To look at the stars is to	A	1	
3494,534619	Robot	Sorry, I don't understand.			
3501,97166	User	The stars is to raise your head	A		
3502,319157	Robot	Sorry, I don't understand.			
3509,930572	User	To look at the stars is to raise your head			
3510,115214	Robot	Is that all?			
3513,91461	User	Yes			
3514,103435	Robot	Ok, to look at the stars is to raise my head.			1
3530,53462	User	To cross the street	A	1	
3530,672679	Robot	Ok			
3539,100668	User	To cross the street is to	A		
3539,468583	Robot	Sorry, I don't understand.			
3572,999102	User	To cross the street and move forward	A		
3573,177616	Robot	Ok			
3578,225132	User	No			
3578,617643	Robot	Sorry, I don't understand.			
3586,608883	User	The Christmas tree is to look left and move forward	A		
3587,013479	Robot	Sorry, I don't understand.			
3598,726634	User	Do not look at me is to turn away	A	1	
3598,975532	Robot	Ok, I am not looking at you.			
3647,255936	User	Look at me is to look forward	A		
3647,630148	Robot	Sorry, I don't understand.			
3680,805518	User	To go away		1	
3680,977038	Robot	Ok			
3683,580787	User	And away and move forward	A		
3683,976329	Robot	Sorry, I don't understand.			
3692,149788	User	To go away is to turn away and move forward			
3692,377524	Robot	Is that all?			
3695,097131	User	Yes			
3695,272555	Robot	Ok, to go away is to turn away and then to move forward.			1
