Time	Speaker	Said	Mis	NB	BS
9326,446807	User	To raise		1	
9326,616547	Robot	Ok			
9349,581891	User	To raise	S		
9349,711326	Robot	Ok			
9364,104162	User	Is to raise your head	S		
9364,273051	Robot	Ok, to raise my head is to raise and then to raise.			1
9413,033954	User	To say no		1	
9413,155995	Robot	Ok			
9417,834219	User	Used to	A		
9418,145664	Robot	Sorry, I don't understand.			
9422,679543	User	To say no			
9422,801944	Robot	Ok			
9426,25197	User	Used to say no	A		
9426,616286	Robot	Sorry, I don't understand.			
9436,217731	User	He's in	A		
9436,549292	Robot	Sorry, I don't understand.			
9444,134024	User	To say no is to look left and Mcwrights	A		
9444,510756	Robot	Sorry, I don't understand.			
9446,011552	User	No	U		
9446,645096	Robot	Sorry, I don't understand.			
9461,853337	User	To say no			
9461,978464	Robot	Ok			
9471,684736	User	Used to look left	A		
9472,022562	Robot	Sorry, I don't understand.			
9477,138027	User	To say no			
9477,268353	Robot	Ok			
9494,342441	User	And say no	A		
9494,489246	Robot	Ok			
9505,980125	User	To say hello		1	
9506,08716	Robot	Ok			
9511,498388	User	Used to raise your left arm	A		
9511,842538	Robot	Sorry, I don't understand.			
9533,782046	User	To say hello	S		
9533,891231	Robot	Ok			
9569,279591	User	To say hello is to read your letter and say hello	A		
9569,421978	Robot	Is that all?			
9575,244809	User	No			
9575,443708	Robot	Ok			
9581,457656	User	To say hello	S		
9581,586214	Robot	Ok			
9588,531142	User	To say hello let	A		
9588,677148	Robot	Ok			
9591,025169	User	Hello	A		
9591,181681	Robot	Ok			
9605,345373	User	To say hello used to regulate and say hello	A		
9605,512654	Robot	Ok			
9629,311163	User	To soda sheets is to move forward and promote	A		
9629,547302	Robot	Ok			
9641,716489	User	To solicit is to move forward and promote		1	
9641,911534	Robot	Is that all?			
9649,116277	User	Yes			
9649,32613	Robot	Ok, to solicit is to say no, then to say no, then to say hello, then to say hello, then to read my letter, then to say hello, then to say hello, then to move forward and then to promote.			1
9669,0505	User	No			
9669,433429	Robot	Sorry, I don't understand.			
9677,915199	User	To solicit is to move forward and promote		1	
9678,115633	Robot	Is that all?			
9680,217301	User	Yes			
9680,448257	Robot	Ok, to solicit is to move forward and then to promote.			1
9685,982134	User	Yes	U		
9686,357434	Robot	Sorry, I don't understand.			
9695,164405	User	Yes	U		
9695,520634	Robot	Sorry, I don't understand.			
9749,303448	User	To exit		1	
9749,444843	Robot	Ok			
9757,838188	User	To exit is to turn away and move forward			
9757,994825	Robot	Is that all?			
9761,965043	User	Yes			1
9762,198145	Robot	Ok, to exit is to turn away and then to move forward.			
9819,855215	User	Yes			
9820,201962	Robot	Sorry, I don't understand.			
9829,750665	User	To send notice to look left and look right	A	1	
9829,92517	Robot	Ok			
9835,146181	User	No			
9835,503183	Robot	Sorry, I don't understand.			
9872,938235	User	Ed and Lou are you at	A		
9873,295377	Robot	Sorry, I don't understand.			
9906,502456	User	You	A		
9906,887921	Robot	Sorry, I don't understand.			
9913,398108	User	To welcome each to move forward	A	1	
9913,548961	Robot	Ok			
9918,094508	User	No			
9918,449598	Robot	Sorry, I don't understand.			
9924,174085	User	To become is to move forward	A		
9924,342386	Robot	Is that all?			
9927,395263	User	No			
9927,564154	Robot	Ok			
