Time	Speaker	Said	Mis	NB	BS
	User	do you know what to do when you win a race?                                             			
	Robot	I don't know if I know.                                                                 			
	User	do you know what a winner do?                                                           	U		
	Robot	Yes, does. I don't know if I know a winner.                                             	S		
	User	do you know how to play the winner?                                                     			
	Robot	I don't know if I know.                                                                 			
	User	do you know what to do when you are happy?                                              			
	Robot	I don't know if I know.                                                                 			
	User	do you know how to look happy                                                           			
	Robot	I don't know if I know.                                                                 			
	User	do you know how to explode?                                                             			
	Robot	I don't know if I know to explode.                                                      			
	User	to be happy is to turn right                                                            	S	1	
	User	breathe                                                                                 			
	User	raise your arms                                                                         			
	User	look up                                                                                 			
	User	and have red eyes                                                                       			
	User	to be happy is to turn right to breathe to raise your arms look up and have green eyes  	S		
	User	can you be happy?                                                                       	U		
	User	to laugh is to raise your arms, stop breathing, have green eyes and look down           	S	1	
	Robot	I can't stop have green eyes. I can't stop look down.                                   			
	User	to poo is to lower your arms and look up                                                	S	1	
	Robot	To raise my arms looks up too.                                                          			
	User	to turn right, turn left                                                                	U	1	
	User	to greet me move forward and look up                                                    	U	1	
	Robot	To raise my arms and to poo look up too.                                                			
	User	to greet me is to raise your arms and to look up                                        	S	1	
	Robot	Yes, to greet you is to raise my arms and to look up up.                                			1
	User	please greet me                                                                         			
	Robot	I can't look up up you.                                                                 			
	User	to look bad is to stop breathing look down and to have red eyes                         	S	1	
	User	to look bad is to stop breathing, to look down and to have red eyes                     	S		
