Time	Speaker	Said	Mis	NB	BS
28189,55275	User	pepper                                                                                                                                                                 	U		
28189,599683	Robot	Sorry, I don't understand.                                                                                                                                             			
28193,799062	User	I'm behind you                                                                                                                                                         	U		
28193,836431	Robot	Sorry, I don't understand.                                                                                                                                             			
28208,986943	User	raise your arms                                                                                                                                                        			
28223,087806	User	raise your left arm                                                                                                                                                    			
28235,181364	User	raise your left arm and say hello                                                                                                                                      			
28235,226442	Robot	hello                                                                                                                                                                  			
28247,58022	User	say hello and raise your left arm                                                                                                                                      			
28247,635214	Robot	Hello.                                                                                                                                                                 			
28280,815484	User	to greet a customer is to raise your arms and say hello                                                                                                                	S	1	
28280,847437	Robot	Sorry, I don't understand.                                                                                                                                             			
28288,640634	User	greet a customer                                                                                                                                                       	S		
28288,681077	Robot	Sorry, I don't understand.                                                                                                                                             			
28325,112451	User	pepper                                                                                                                                                                 	U		
28325,142962	Robot	Sorry, I don't understand.                                                                                                                                             			
28332,183661	User	move back                                                                                                                                                              			
28352,303853	User	to fuck off is to say sorry and move back                                                                                                                              	S	1	
28352,345263	Robot	Sorry, I don't understand.                                                                                                                                             			
28359,99569	User	greet customers                                                                                                                                                        	S		
28360,032867	Robot	Sorry, I don't understand.                                                                                                                                             			
28365,619074	User	fuck off                                                                                                                                                               	S		
28365,649803	Robot	Sorry, I don't understand.                                                                                                                                             			
28382,631378	User	greet a customer                                                                                                                                                       	S		
28382,671188	Robot	Sorry, I don't understand.                                                                                                                                             			
28417,884318	User	to be a crappy host is to greet a customer and fuck off                                                                                                                	S	1	
28417,921981	Robot	Sorry, I don't understand.                                                                                                                                             			
28455,117705	User	move forward                                                                                                                                                           			
28468,977672	User	to come here is to move forward                                                                                                                                        		1	
28469,013754	Robot	Yes, to come is to move forward.                                                                                                                                       			1
28477,060991	User	come here                                                                                                                                                              			
28523,353251	User	to greet is to come here and say hello                                                                                                                                 		1	
28523,395484	Robot	Yes, to greet is to   here come and to say hello.                                                                                                                      			1
28533,310575	User	greet me                                                                                                                                                               	S		
28533,344685	Robot	Sorry, I don't understand.                                                                                                                                             			
28538,225737	User	greet                                                                                                                                                                  			
28538,24797	Robot	hello                                                                                                                                                                  			
28560,75906	User	turn away                                                                                                                                                              			
28602,398144	User	to be fickle is to greet me and turn away                                                                                                                              		1	
28602,457863	Robot	Yes, to be fickle is   to greet somebody and to turn away.                                                                                                             			1
28613,524983	User	be fickle                                                                                                                                                              	S		
28613,567137	Robot	Sorry, I don't understand.                                                                                                                                             			
28618,997252	User	fickle                                                                                                                                                                 	S		
28619,023949	Robot	Sorry, I don't understand.                                                                                                                                             			
28674,136467	User	to masturbate is to raise your left arm and lower your left arm and  to raise your left arm and lower your left arm and  to raise your left arm and lower your left arm	S	1	
28674,172526	Robot	Sorry, I don't understand.                                                                                                                                             			
28688,562426	User	masturbate                                                                                                                                                             	S		
28688,60528	Robot	Sorry, I don't understand.                                                                                                                                             			
