Time	Speaker	Said	Mis	NB	BS
32405,231094	User	to promote is to look forward and say that acme has great products            		1	
32405,307545	Robot	Yes, to promote   is to look forward and   to say the acme has great products.			1
32414,670464	User	promote                                                                       			
32414,700466	Robot	the acme has great products.                                                  			
32426,385378	User	to solicit is to move forward and promote                                     		1	
32426,441277	Robot	Yes, to solicit   is to move forward and to promote.                          			1
32434,38317	User	solicit                                                                       			
32434,416604	Robot	the acme has great products.                                                  			
32457,09758	User	to welcome is to look forward and to say welcome                              		1	
32457,150375	Robot	Yes, to welcome   is to look forward and to say welcome.                      			1
32462,81057	User	welcome                                                                       			
32462,82388	Robot	welcome                                                                       			
32482,732564	User	to pitch is to welcome and to promote                                         		1	
32482,794977	Robot	Yes,   to pitch is to welcome and to promote.                                 			1
32487,395056	User	pitch                                                                         	S		
32487,430417	Robot	Sorry, I don't understand.                                                    			
32506,970722	User	to pitch is to welcome and to promote                                         		1	
32507,023712	Robot	Yes,   to pitch is to welcome and to promote.                                 			1
32512,198743	User	pitch                                                                         	S		
32512,226894	Robot	Sorry, I don't understand.                                                    			
32539,985482	User	to dance is to turn left, to turn right and to raise your arms                		1	
32540,039409	Robot	Yes, to dance is to turn   left, to turn right and to raise my arms.          			1
32546,452901	User	dance                                                                         			
32560,816799	User	dance                                                                         			
32583,08918	User	to distract is to welcome and to dance                                        		1	
32583,146512	Robot	Yes,   to distract is to welcome and to dance.                                			1
32588,941325	User	distract                                                                      			
32588,963299	Robot	welcome.    .    .    .                                                       			
32636,612302	User	to show is to look right and to raise your right arm                          		1	
32636,670747	Robot	Yes,   to show is to look right and to raise my right arm.                    			1
32641,634846	User	show                                                                          			
32664,330888	User	to advertise is to show and to say that the product is perfect                		1	
32664,383413	Robot	Yes,   to advertise is to show and to say the product is perfect.             			1
32671,164626	User	advertise                                                                     			
32671,183729	Robot	the product is perfect.                                                       			
32724,327467	User	to apologize is to lower your head and say that you are sorry                 		1	
32724,404538	Robot	Yes, to apologize   is to lower   my head and to say I am sorry.              			1
32731,700335	User	apologize                                                                     			
32731,730814	Robot	I am sorry.                                                                   			
32765,920068	User	to gift is to apologize and to offer a better deal                            	S	1	
32765,957086	Robot	Sorry, I don't understand.                                                    			
32780,558915	User	apologize                                                                     			
32780,596334	Robot	I am sorry.                                                                   			
32808,045984	User	gift                                                                          	S		
32808,088604	Robot	Sorry, I don't understand.                                                    			
32824,763906	User	to gift is to apologize and to say that you offer a better deal               			
32824,847991	Robot	Yes,   to gift is     to apologize and to say I offer a good deal.            			1
32831,020456	User	gift                                                                          			
32831,080664	Robot	I am sorry. I offer a good deal.                                              			
32965,458745	User	to regret is to turn away and to apologize                                    		1	
32965,516558	Robot	Yes,   to regret is to turn away and to apologize.                            			1
32970,489266	User	regret                                                                        			
32970,535784	Robot	I am sorry.                                                                   			
33022,840831	User	to quit is to regret and to say bye                                           		1	
33022,888948	Robot	Yes,   to quit is to regret and to say the bye.                               			1
33027,904857	User	quit                                                                          			
33027,936528	Robot	Said			
