{
  "defaultDomain": "greetings_domain.pddl",
  "defaultOptions": "",
  "cases": [
    {
      "problem": "greetings_greet_known.pddl",
      "expectedPlans": [
        "greetings_greet_known.plan"
      ]
    },
    {
      "problem": "greetings_greet_unknown.pddl",
      "expectedPlans": [
        "greetings_greet_unknown.plan"
      ]
    },
    {
      "problem": "greetings_ask_arg.pddl",
      "expectedPlans": [
        "greetings_ask_arg.plan"
      ]
    },
    {
      "problem": "greetings_tell_who_is_colocated.pddl",
      "expectedPlans": [
        "greetings_tell_who_is_colocated.plan"
      ]
    }
  ]
}