{
  "files": {
    "main.css": "/main.css",
    "main.js": "/main.1b9b534ac01724223637.bundle.js",
    "main.css.map": "/main.css.map",
    "main.js.map": "/main.1b9b534ac01724223637.bundle.js.map",
    "runtime~main.js": "/runtime~main.1b9b534ac01724223637.bundle.js",
    "runtime~main.js.map": "/runtime~main.1b9b534ac01724223637.bundle.js.map",
    "vendors~main.js": "/vendors~main.1b9b534ac01724223637.bundle.js",
    "vendors~main.js.map": "/vendors~main.1b9b534ac01724223637.bundle.js.map",
    "iframe.html": "/iframe.html",
    "precache-manifest.b2ac4d011c561640dc3cc52c702b9040.js": "/precache-manifest.b2ac4d011c561640dc3cc52c702b9040.js",
    "service-worker.js": "/service-worker.js"
  }
}