algoritmo MisterRobot ()
{
      String OP;
      String cadena;
      int T=4;                           
      int U=20;
      //VARIABLES USADAS EN LA OPERACIÓN DE ENCRIPTACIÓN
      String caractercadena;
      String cadenaencriptada="";
      String cadenaencriptradadefinitiva="";
      
      //VARIABLES USADAS EN LA OPERACIÓN DE DESENCRIPTACIÓN
      String cadenainvertida="";
      String parte1,parte2,parte3,parte4,cadenadesencriptada;

      //INICIO DEL ALGORITMO
      write ("Introduzca la operación a realizar" : ");
      read (OP);
      if (OP ≠ "encriptar" AND OP ≠ "desencriptar")
      {
	  write("Error: OPERACIÓN DESCONOCIDA");
      }
      else
      {
          //LA OPERACIÓN ES VÁLIDA
	seleccion
        {
          (OP == "encriptar"):
	  {
		write ("Introduzca CADENA a encriptar");
		read  (cadena);
                if (lenght(cadena) > T)
		{
			write("ERROR: LONGITUD DE CADENA MAYOR QUE EL LIMITE (4)");
		}
		else
		{
			if (lenght(cadena) < T)
			{
				cadena=" " + cadena;    //averiguar operación para incluir un número de espacios a la izquierda;
                        }
                        //ESTAMOS SEGUROS DE QUE CADENA TIENE 4 CARACTERES ...
			if (
				(letra[1](cadena)  < "a" OR letra[1](cadena)  > "z") 
				OR
				(letra[2](cadena)  < "a" OR letra[2](cadena)  > "z")
				OR
				(letra[3](cadena)  < "a" OR letra[3](cadena)  > "z") 
				OR
				(letra[4](cadena)  < "a" OR letra[4](cadena)  > "z")
			   )
			{
				 write("ERROR: CADENA CONTIENE CARACTERES INVÁLIDOS"); 
			}
			else
			//ESTAMOS SEGUROS DE QUE CADENA TIENE SÓLO LETRAS o ESPACIOS
			{		
                        	caracatercadena=letra[1](cadena);
                        	
				seleccion{
						(caractercadena == "a") :{ caractercadena = "1" }
						(caractercadena == "b") :{ caractercadena = "2" }
						(caractercadena == "c") :{ caractercadena = "3" }
						(caractercadena == "d") :{ caractercadena = "4" }
                                                (caractercadena == "e") :{ caractercadena = "5" }
						(caractercadena == "f") :{ caractercadena = "6" }
						(caractercadena == "g") :{ caractercadena = "7" }
						(caractercadena == "h") :{ caractercadena = "8" }
						(caractercadena == "i") :{ caractercadena = "9" }
						(caractercadena == "j") :{ caractercadena = "10" }
						(caractercadena == "k") :{ caractercadena = "11" }
						(caractercadena == "l") :{ caractercadena = "12" }
						(caractercadena == "m") :{ caractercadena = "13" }
						(caractercadena == "n") :{ caractercadena = "14" }
						(caractercadena == "o") :{ caractercadena = "15" }
						(caractercadena == "p") :{ caractercadena = "16" }
                                                (caractercadena == "q") :{ caractercadena = "17" }
						(caractercadena == "r") :{ caractercadena = "18" }
						(caractercadena == "s") :{ caractercadena = "19" }
						(caractercadena == "t") :{ caractercadena = "20" }
						(caractercadena == "u") :{ caractercadena = "21" }
						(caractercadena == "v") :{ caractercadena = "22" }
						(caractercadena == "w") :{ caractercadena = "23" }
						(caractercadena == "x") :{ caractercadena = "24" }
						(caractercadena == "y") :{ caractercadena = "25" }
                                                (caractercadena == "z") :{ caractercadena = "26" }
                                                (caractercadena == " "  :{ caractercadena = "0" }

		  		     	 }

				
				seleccion{
						(caractercadena == "1") :{ caractercadena = "00001" }
						(caractercadena == "2") :{ caractercadena = "00010" }
						(caractercadena == "3") :{ caractercadena = "00011" }
						(caractercadena == "4") :{ caractercadena = "00100" }
						(caractercadena == "5") :{ caractercadena = "00101" }
						(caractercadena == "6") :{ caractercadena = "00110" }
						(caractercadena == "7") :{ caractercadena = "00111" }
						(caractercadena == "8") :{ caractercadena = "01000" }
						(caractercadena == "9") :{ caractercadena = "01001" }
						(caractercadena == "10") :{ caractercadena = "01010" }
						(caractercadena == "11") :{ caractercadena = "01011" }
						(caractercadena == "12") :{ caractercadena = "01100" }
						(caractercadena == "13") :{ caractercadena = "01101" }
						(caractercadena == "14") :{ caractercadena = "01110" }
						(caractercadena == "15") :{ caractercadena = "01111" }
						(caractercadena == "16") :{ caractercadena = "10000" }
						(caractercadena == "17") :{ caractercadena = "10001" }
						(caractercadena == "18") :{ caractercadena = "10010" }
						(caractercadena == "19") :{ caractercadena = "10011" }
						(caractercadena == "20") :{ caractercadena = "10100" }
						(caractercadena == "21") :{ caractercadena = "10101" }
						(caractercadena == "22") :{ caractercadena = "10110" }
						(caractercadena == "23") :{ caractercadena = "10111" }
						(caractercadena == "24") :{ caractercadena = "11000" }
						(caractercadena == "25"  :{ caractercadena = "11001" }
						(caractercadena == "26"  :{ caractercadena = "11010" }
						(caractercadena == "0"   :{ caractercadena = "00000" }
		  		     	  }
				    cadenaencriptada = cadenaencriptada + caractercadena;    //ejemplo:cadenaencriptada="01010"
				     
				}

                        	caracatercadena=letra[2](cadena);
			
				seleccion{
						(caractercadena == "a") :{ caractercadena = "1" }
						(caractercadena == "b") :{ caractercadena = "2" }
						(caractercadena == "c") :{ caractercadena = "3" }
						(caractercadena == "d") :{ caractercadena = "4" }
                                                (caractercadena == "e") :{ caractercadena = "5" }
						(caractercadena == "f") :{ caractercadena = "6" }
						(caractercadena == "g") :{ caractercadena = "7" }
						(caractercadena == "h") :{ caractercadena = "8" }
						(caractercadena == "i") :{ caractercadena = "9" }
						(caractercadena == "j") :{ caractercadena = "10" }
						(caractercadena == "k") :{ caractercadena = "11" }
						(caractercadena == "l") :{ caractercadena = "12" }
						(caractercadena == "m") :{ caractercadena = "13" }
						(caractercadena == "n") :{ caractercadena = "14" }
						(caractercadena == "o") :{ caractercadena = "15" }
						(caractercadena == "p") :{ caractercadena = "16" }
                                                (caractercadena == "q") :{ caractercadena = "17" }
						(caractercadena == "r") :{ caractercadena = "18" }
						(caractercadena == "s") :{ caractercadena = "19" }
						(caractercadena == "t") :{ caractercadena = "20" }
						(caractercadena == "u") :{ caractercadena = "21" }
						(caractercadena == "v") :{ caractercadena = "22" }
						(caractercadena == "w") :{ caractercadena = "23" }
						(caractercadena == "x") :{ caractercadena = "24" }
						(caractercadena == "y") :{ caractercadena = "25" }
                                                (caractercadena == "z") :{ caractercadena = "26" }
                                                (caractercadena == " "  :{ caractercadena = "0" }

		  		     	 }

				
				seleccion{
						(caractercadena == "1") :{ caractercadena = "00001" }
						(caractercadena == "2") :{ caractercadena = "00010" }
						(caractercadena == "3") :{ caractercadena = "00011" }
						(caractercadena == "4") :{ caractercadena = "00100" }
						(caractercadena == "5") :{ caractercadena = "00101" }
						(caractercadena == "6") :{ caractercadena = "00110" }
						(caractercadena == "7") :{ caractercadena = "00111" }
						(caractercadena == "8") :{ caractercadena = "01000" }
						(caractercadena == "9") :{ caractercadena = "01001" }
						(caractercadena == "10") :{ caractercadena = "01010" }
						(caractercadena == "11") :{ caractercadena = "01011" }
						(caractercadena == "12") :{ caractercadena = "01100" }
						(caractercadena == "13") :{ caractercadena = "01101" }
						(caractercadena == "14") :{ caractercadena = "01110" }
						(caractercadena == "15") :{ caractercadena = "01111" }
						(caractercadena == "16") :{ caractercadena = "10000" }
						(caractercadena == "17") :{ caractercadena = "10001" }
						(caractercadena == "18") :{ caractercadena = "10010" }
						(caractercadena == "19") :{ caractercadena = "10011" }
						(caractercadena == "20") :{ caractercadena = "10100" }
						(caractercadena == "21") :{ caractercadena = "10101" }
						(caractercadena == "22") :{ caractercadena = "10110" }
						(caractercadena == "23") :{ caractercadena = "10111" }
						(caractercadena == "24") :{ caractercadena = "11000" }
						(caractercadena == "25"  :{ caractercadena = "11001" }
						(caractercadena == "26"  :{ caractercadena = "11010" }
						(caractercadena == "0"   :{ caractercadena = "00000" }
		  		     	  }
				    cadenaencriptada = cadenaencriptada + caractercadena;    //ejemplo:cadenaencriptada="01010"


				caracatercadena=letra[3](cadena);
				seleccion{
						(caractercadena == "a") :{ caractercadena = "1" }
						(caractercadena == "b") :{ caractercadena = "2" }
						(caractercadena == "c") :{ caractercadena = "3" }
						(caractercadena == "d") :{ caractercadena = "4" }
                                                (caractercadena == "e") :{ caractercadena = "5" }
						(caractercadena == "f") :{ caractercadena = "6" }
						(caractercadena == "g") :{ caractercadena = "7" }
						(caractercadena == "h") :{ caractercadena = "8" }
						(caractercadena == "i") :{ caractercadena = "9" }
						(caractercadena == "j") :{ caractercadena = "10" }
						(caractercadena == "k") :{ caractercadena = "11" }
						(caractercadena == "l") :{ caractercadena = "12" }
						(caractercadena == "m") :{ caractercadena = "13" }
						(caractercadena == "n") :{ caractercadena = "14" }
						(caractercadena == "o") :{ caractercadena = "15" }
						(caractercadena == "p") :{ caractercadena = "16" }
                                                (caractercadena == "q") :{ caractercadena = "17" }
						(caractercadena == "r") :{ caractercadena = "18" }
						(caractercadena == "s") :{ caractercadena = "19" }
						(caractercadena == "t") :{ caractercadena = "20" }
						(caractercadena == "u") :{ caractercadena = "21" }
						(caractercadena == "v") :{ caractercadena = "22" }
						(caractercadena == "w") :{ caractercadena = "23" }
						(caractercadena == "x") :{ caractercadena = "24" }
						(caractercadena == "y") :{ caractercadena = "25" }
                                                (caractercadena == "z") :{ caractercadena = "26" }
                                                (caractercadena == " "  :{ caractercadena = "0" }

		  		     	 }

				
				seleccion{
						(caractercadena == "1") :{ caractercadena = "00001" }
						(caractercadena == "2") :{ caractercadena = "00010" }
						(caractercadena == "3") :{ caractercadena = "00011" }
						(caractercadena == "4") :{ caractercadena = "00100" }
						(caractercadena == "5") :{ caractercadena = "00101" }
						(caractercadena == "6") :{ caractercadena = "00110" }
						(caractercadena == "7") :{ caractercadena = "00111" }
						(caractercadena == "8") :{ caractercadena = "01000" }
						(caractercadena == "9") :{ caractercadena = "01001" }
						(caractercadena == "10") :{ caractercadena = "01010" }
						(caractercadena == "11") :{ caractercadena = "01011" }
						(caractercadena == "12") :{ caractercadena = "01100" }
						(caractercadena == "13") :{ caractercadena = "01101" }
						(caractercadena == "14") :{ caractercadena = "01110" }
						(caractercadena == "15") :{ caractercadena = "01111" }
						(caractercadena == "16") :{ caractercadena = "10000" }
						(caractercadena == "17") :{ caractercadena = "10001" }
						(caractercadena == "18") :{ caractercadena = "10010" }
						(caractercadena == "19") :{ caractercadena = "10011" }
						(caractercadena == "20") :{ caractercadena = "10100" }
						(caractercadena == "21") :{ caractercadena = "10101" }
						(caractercadena == "22") :{ caractercadena = "10110" }
						(caractercadena == "23") :{ caractercadena = "10111" }
						(caractercadena == "24") :{ caractercadena = "11000" }
						(caractercadena == "25"  :{ caractercadena = "11001" }
						(caractercadena == "26"  :{ caractercadena = "11010" }
						(caractercadena == "0"   :{ caractercadena = "00000" }
		  		     	  }
				    cadenaencriptada = cadenaencriptada + caractercadena;    //ejemplo:cadenaencriptada="01010"



				caracatercadena=letra[4](cadena);   
			
				seleccion{
						
						(caractercadena == "a") :{ caractercadena = "1" }
						(caractercadena == "b") :{ caractercadena = "2" }
						(caractercadena == "c") :{ caractercadena = "3" }
						(caractercadena == "d") :{ caractercadena = "4" }
                                                (caractercadena == "e") :{ caractercadena = "5" }
						(caractercadena == "f") :{ caractercadena = "6" }
						(caractercadena == "g") :{ caractercadena = "7" }
						(caractercadena == "h") :{ caractercadena = "8" }
						(caractercadena == "i") :{ caractercadena = "9" }
						(caractercadena == "j") :{ caractercadena = "10" }
						(caractercadena == "k") :{ caractercadena = "11" }
						(caractercadena == "l") :{ caractercadena = "12" }
						(caractercadena == "m") :{ caractercadena = "13" }
						(caractercadena == "n") :{ caractercadena = "14" }
						(caractercadena == "o") :{ caractercadena = "15" }
						(caractercadena == "p") :{ caractercadena = "16" }
                                                (caractercadena == "q") :{ caractercadena = "17" }
						(caractercadena == "r") :{ caractercadena = "18" }
						(caractercadena == "s") :{ caractercadena = "19" }
						(caractercadena == "t") :{ caractercadena = "20" }
						(caractercadena == "u") :{ caractercadena = "21" }
						(caractercadena == "v") :{ caractercadena = "22" }
						(caractercadena == "w") :{ caractercadena = "23" }
						(caractercadena == "x") :{ caractercadena = "24" }
						(caractercadena == "y") :{ caractercadena = "25" }
                                                (caractercadena == "z") :{ caractercadena = "26" }
                                                (caractercadena == " "  :{ caractercadena = "0" }

		  		     	 }

				
				seleccion{
						(caractercadena == "1") :{ caractercadena = "00001" }
						(caractercadena == "2") :{ caractercadena = "00010" }
						(caractercadena == "3") :{ caractercadena = "00011" }
						(caractercadena == "4") :{ caractercadena = "00100" }
						(caractercadena == "5") :{ caractercadena = "00101" }
						(caractercadena == "6") :{ caractercadena = "00110" }
						(caractercadena == "7") :{ caractercadena = "00111" }
						(caractercadena == "8") :{ caractercadena = "01000" }
						(caractercadena == "9") :{ caractercadena = "01001" }
						(caractercadena == "10") :{ caractercadena = "01010" }
						(caractercadena == "11") :{ caractercadena = "01011" }
						(caractercadena == "12") :{ caractercadena = "01100" }
						(caractercadena == "13") :{ caractercadena = "01101" }
						(caractercadena == "14") :{ caractercadena = "01110" }
						(caractercadena == "15") :{ caractercadena = "01111" }
						(caractercadena == "16") :{ caractercadena = "10000" }
						(caractercadena == "17") :{ caractercadena = "10001" }
						(caractercadena == "18") :{ caractercadena = "10010" }
						(caractercadena == "19") :{ caractercadena = "10011" }
						(caractercadena == "20") :{ caractercadena = "10100" }
						(caractercadena == "21") :{ caractercadena = "10101" }
						(caractercadena == "22") :{ caractercadena = "10110" }
						(caractercadena == "23") :{ caractercadena = "10111" }
						(caractercadena == "24") :{ caractercadena = "11000" }
						(caractercadena == "25"  :{ caractercadena = "11001" }
						(caractercadena == "26"  :{ caractercadena = "11010" }
						(caractercadena == "0"   :{ caractercadena = "00000" }
		  		     	  }
						
		  		     	  
				    cadenaencriptada = cadenaencriptada + caractercadena;    //ejemplo:cadenaencriptada="01010"

				    //EN ESTE MOMENTO TENEMOS TODA LA CADENA ENCRIPTADA, pero NOS FALTA INVERTIRLA
				    //EJEMPLO. Si la cadena original es "abab", cadenacriptada tendrá: 00001000100000100010

				    if (letra[1](cadenaencriptada) == "0")
				    {
					cadenaencriptadadefinitiva = cadenaencriptadadefinitiva + "1";	
				    }
				    else
				    {
					cadenaencriptadadefinitiva = cadenaencriptadadefinitiva + "0";	
				    }
				    
				    if (letra[2](cadenaencriptada) == "0")
				    {
					cadenaencriptadadefinitiva = cadenaencriptadadefinitiva + "1";	
				    }
				    else
				    {
					cadenaencriptadadefinitiva = cadenaencriptadadefinitiva + "0";	
				    }

				    if (letra[3](cadenaencriptada) == "0")
				    {
					cadenaencriptadadefinitiva = cadenaencriptadadefinitiva + "1";	
				    }
				    else
				    {
					cadenaencriptadadefinitiva = cadenaencriptadadefinitiva + "0";	
				    }

				    //completar para todas las 20 posiciones de cadenaencriptada ...
				    .
				    .
				    .
				    write ("la cadena encriptada es : " + cadenaencriptadadefinitiva);
				    
				    //FIN DE ENCRIPTAR...		    
	     }


		
          }
          (OP == "desencriptar"):
          {
     
		write ("Introduzca CADENA a desencriptar");
		read  (cadena);
		if (lenght(cadena) ≠ U )
		{
			write("ERROR: LONGITUD DE CADENA DIFERENTE AL ESPERADO (20)");	
                }
		else
		{
			//LA CADENA TIENE 20 CARACTERES. VAMOS A CHEQUEAR SI SOLO TIENE 0's y 1's
			if (
				(letra[1](cadena) ≠ "0" AND (letra[1](cadena) ≠ 1)
				OR
				(letra[2](cadena) ≠ "0" AND (letra[2](cadena) ≠ 1)
				OR
				(letra[3](cadena) ≠ "0" AND (letra[3](cadena) ≠ 1)
				OR
				(letra[4](cadena) ≠ "0" AND (letra[4](cadena) ≠ 1)
				OR
				(letra[5](cadena) ≠ "0" AND (letra[5](cadena) ≠ 1)
				OR
				(letra[6](cadena) ≠ "0" AND (letra[6](cadena) ≠ 1)
				OR
				(letra[7](cadena) ≠ "0" AND (letra[7](cadena) ≠ 1)
				OR
				(letra[8](cadena) ≠ "0" AND (letra[8](cadena) ≠ 1)
				OR
				(letra[9](cadena) ≠ "0" AND (letra[9](cadena) ≠ 1)
				OR
				(letra[10](cadena) ≠ "0" AND (letra[10](cadena) ≠ 1)
				OR
				(letra[11](cadena) ≠ "0" AND (letra[11](cadena) ≠ 1)
				OR
				(letra[12](cadena) ≠ "0" AND (letra[12](cadena) ≠ 1)
				OR
				(letra[13](cadena) ≠ "0" AND (letra[13](cadena) ≠ 1)
				OR
				(letra[14](cadena) ≠ "0" AND (letra[14](cadena) ≠ 1)
				OR
				(letra[15](cadena) ≠ "0" AND (letra[15](cadena) ≠ 1)
				OR
				(letra[16](cadena) ≠ "0" AND (letra[16](cadena) ≠ 1)
				OR
				(letra[17](cadena) ≠ "0" AND (letra[17](cadena) ≠ 1)
				OR
				(letra[18](cadena) ≠ "0" AND (letra[18](cadena) ≠ 1)
				OR
				(letra[19](cadena) ≠ "0" AND (letra[19](cadena) ≠ 1)
				OR
				(letra[20](cadena) ≠ "0" AND (letra[20](cadena) ≠ 1)
                           )
		      {
				write ("ERROR: CADENA A DESENCRIPTAR CONTIENE CARACTERES INVÁLIDOS");
	              }
		      else
		      {
				//LA CADENA A DESENCRIPTAR ES VÁLIDA, PORQUE TIENE 20 caracteres, y TIENE SÓLO "0's" o "1's"
				//VAMOS A INVERTIR LOS BITS
				if (letra[1](cadena) == "0")
				{
					cadenainverida = cadenainvertida + "1";	
				}
				else
				{
					cadenainvertida = cadenainvertida + "0";	
				}
				    
				if (letra[2](cadena) == "0")
				{
					cadenainverida = cadenainvertida + "1";	
				}
				else
				{
					cadenainvertida = cadenainvertida + "0";	
				}
				 
                                if (letra[3](cadena) == "0")
				{
					cadenainverida = cadenainvertida + "1";	
				}
				else
				{
					cadenainvertida = cadenainvertida + "0";	
				}
				   
				//completar para todas las 20 posiciones de cadena
				.
				.
				.
                                //AHORA TRABAJAMOS CON cadenainvertida
				parte1=letra[1](cadenainvertida)+letra[2](cadenainvertida)+letra[3](cadenainvertida)+letra[4](cadenainvertida)+letra[5](cadenainvertida);
				seleccion{
					   (parte1 == "00001"): {parte1="1"}
				           (parte1 == "00010"): {parte1="2"}
					   (parte1 == "00011"): {parte1="3"}
					   (parte1 == "00100"): {parte1="4"}
					   (parte1 == "00101"): {parte1="5"}
					   (parte1 == "00110"): {parte1="6"}
					   (parte1 == "00111"): {parte1="7"}
					   (parte1 == "01000"): {parte1="8"}
					   (parte1 == "01001"): {parte1="9"}
					   (parte1 == "01010"): {parte1="10"}
					   (parte1 == "01011"): {parte1="11"}
					   (parte1 == "01100"): {parte1="12"}
					   (parte1 == "01101"): {parte1="13"}
					   (parte1 == "01110"): {parte1="14"}
					   (parte1 == "01111"): {parte1="15"}
					   (parte1 == "10000"): {parte1="16"}
					   (parte1 == "10001"): {parte1="17"}
					   (parte1 == "10010"): {parte1="18"}
					   (parte1 == "10011"): {parte1="19"}
					   (parte1 == "10100"): {parte1="20"}
					   (parte1 == "10101"): {parte1="21"}
					   (parte1 == "10110"): {parte1="22"}
					   (parte1 == "10111"): {parte1="23"}
					   (parte1 == "11000"): {parte1="24"}
					   (parte1 == "11001"): {parte1="25"}
					   (parte1 == "11010"): {parte1="26"}
					   (parte1 == "00000"): {parte1="0"}
		  		     	  }

				seleccion{
					   (parte1 == "1"): {parte1="a"}
				           (parte1 == "2"): {parte1="b"}
					   (parte1 == "3"): {parte1="a"}
					   (parte1 == "4"): {parte1="d"}
					   (parte1 == "5"): {parte1="e"}
					   (parte1 == "6"): {parte1="f"}
					   (parte1 == "7"): {parte1="g"}
					   (parte1 == "8"): {parte1="h"}
					   (parte1 == "9"): {parte1="i"}
					   (parte1 == "10"): {parte1="j"}
					   (parte1 == "11"): {parte1="k"}
					   (parte1 == "12"): {parte1="l"}
					   (parte1 == "13"): {parte1="m"}
					   (parte1 == "14"): {parte1="n"}
					   (parte1 == "15"): {parte1="o"}
					   (parte1 == "16"): {parte1="p"}
					   (parte1 == "17"): {parte1="q"}
					   (parte1 == "18"): {parte1="r"}
					   (parte1 == "19"): {parte1="s"}
					   (parte1 == "20"): {parte1="t"}
					   (parte1 == "21"): {parte1="u"}
					   (parte1 == "22"): {parte1="v"}
					   (parte1 == "23"): {parte1="w"}
					   (parte1 == "24"): {parte1="x"}
					   (parte1 == "25"): {parte1="y"}
					   (parte1 == "26"): {parte1="z"}
					   (parte1 == "0"): {parte1=" "}
		  		     	  }
				cadenadesencriptada=cadenadesencriptada + parte1;


				parte2=letra[6](cadenainvertida)+letra[7](cadenainvertida)+letra[8](cadenainvertida)+letra[9](cadenainvertida)+letra[10](cadenainvertida);
				seleccion{
					   (parte2 == "00001"): {parte2="1"}
				           (parte2 == "00010"): {parte2="2"}
					   (parte2 == "00011"): {parte2="3"}
					   (parte2 == "00100"): {parte2="4"}
					   (parte2 == "00101"): {parte2="5"}
					   (parte2 == "00110"): {parte2="6"}
					   (parte2 == "00111"): {parte2="7"}
					   (parte2 == "01000"): {parte2="8"}
					   (parte2 == "01001"): {parte2="9"}
					   (parte2 == "01010"): {parte2="10"}
					   (parte2 == "01011"): {parte2="11"}
					   (parte2 == "01100"): {parte2="12"}
					   (parte2 == "01101"): {parte2="13"}
					   (parte2 == "01110"): {parte2="14"}
					   (parte2 == "01111"): {parte2="15"}
					   (parte2 == "10000"): {parte2="16"}
					   (parte2 == "10001"): {parte2="17"}
					   (parte2 == "10010"): {parte2="18"}
					   (parte2 == "10011"): {parte2="19"}
					   (parte2 == "10100"): {parte2="20"}
					   (parte2 == "10101"): {parte2="21"}
					   (parte2 == "10110"): {parte2="22"}
					   (parte2 == "10111"): {parte2="23"}
					   (parte2 == "11000"): {parte2="24"}
					   (parte2 == "11001"): {parte2="25"}
					   (parte2 == "11010"): {parte2="26"}
					   (parte2 == "00000"): {parte2="0"}
		  		     	  }

				seleccion{
					   (parte2 == "1"): {parte2="a"}
				           (parte2 == "2"): {parte2="b"}
					   (parte2 == "3"): {parte2="a"}
					   (parte2 == "4"): {parte2="d"}
					   (parte2 == "5"): {parte2="e"}
					   (parte2 == "6"): {parte2="f"}
					   (parte2 == "7"): {parte2="g"}
					   (parte2 == "8"): {parte2="h"}
					   (parte2 == "9"): {parte2="i"}
					   (parte2 == "10"): {parte2="j"}
					   (parte2 == "11"): {parte2="k"}
					   (parte2 == "12"): {parte2="l"}
					   (parte2 == "13"): {parte2="m"}
					   (parte2 == "14"): {parte2="n"}
					   (parte2 == "15"): {parte2="o"}
					   (parte2 == "16"): {parte2="p"}
					   (parte2 == "17"): {parte2="q"}
					   (parte2 == "18"): {parte2="r"}
					   (parte2 == "19"): {parte2="s"}
					   (parte2 == "20"): {parte2="t"}
					   (parte2 == "21"): {parte2="u"}
					   (parte2 == "22"): {parte2="v"}
					   (parte2 == "23"): {parte2="w"}
					   (parte2 == "24"): {parte2="x"}
					   (parte2 == "25"): {parte2="y"}
					   (parte2 == "26"): {parte2="z"}
					   (parte2 == "0"): {parte2=" "}
		  		     	  }
				cadenadesencriptada=cadenadesencriptada + parte2;


				parte3=letra[11](cadenainvertida)+letra[12](cadenainvertida)+letra[13](cadenainvertida)+letra[14](cadenainvertida)+letra[15](cadenainvertida);
				seleccion{
					   (parte3 == "00001"): {parte3="1"}
				           (parte3 == "00010"): {parte3="2"}
					   (parte3 == "00011"): {parte3="3"}
					   (parte3 == "00100"): {parte3="4"}
					   (parte3 == "00101"): {parte3="5"}
					   (parte3 == "00110"): {parte3="6"}
					   (parte3 == "00111"): {parte3="7"}
					   (parte3 == "01000"): {parte3="8"}
					   (parte3 == "01001"): {parte3="9"}
					   (parte3 == "01010"): {parte3="10"}
					   (parte3 == "01011"): {parte3="11"}
					   (parte3 == "01100"): {parte3="12"}
					   (parte3 == "01101"): {parte3="13"}
					   (parte3 == "01110"): {parte3="14"}
					   (parte3 == "01111"): {parte3="15"}
					   (parte3 == "10000"): {parte3="16"}
					   (parte3 == "10001"): {parte3="17"}
					   (parte3 == "10010"): {parte3="18"}
					   (parte3 == "10011"): {parte3="19"}
					   (parte3 == "10100"): {parte3="20"}
					   (parte3 == "10101"): {parte3="21"}
					   (parte3 == "10110"): {parte3="22"}
					   (parte3 == "10111"): {parte3="23"}
					   (parte3 == "11000"): {parte3="24"}
					   (parte3 == "11001"): {parte3="25"}
					   (parte3 == "11010"): {parte3="26"}
					   (parte3 == "00000"): {parte3="0"}
		  		     	  }

				seleccion{
					   (parte3 == "1"): {parte3="a"}
				           (parte3 == "2"): {parte3="b"}
					   (parte3 == "3"): {parte3="a"}
					   (parte3 == "4"): {parte3="d"}
					   (parte3 == "5"): {parte3="e"}
					   (parte3 == "6"): {parte3="f"}
					   (parte3 == "7"): {parte3="g"}
					   (parte3 == "8"): {parte3="h"}
					   (parte3 == "9"): {parte3="i"}
					   (parte3 == "10"): {parte3="j"}
					   (parte3 == "11"): {parte3="k"}
					   (parte3 == "12"): {parte3="l"}
					   (parte3 == "13"): {parte3="m"}
					   (parte3 == "14"): {parte3="n"}
					   (parte3 == "15"): {parte3="o"}
					   (parte3 == "16"): {parte3="p"}
					   (parte3 == "17"): {parte3="q"}
					   (parte3 == "18"): {parte3="r"}
					   (parte3 == "19"): {parte3="s"}
					   (parte3 == "20"): {parte3="t"}
					   (parte3 == "21"): {parte3="u"}
					   (parte3 == "22"): {parte3="v"}
					   (parte3 == "23"): {parte3="w"}
					   (parte3 == "24"): {parte3="x"}
					   (parte3 == "25"): {parte3="y"}
					   (parte3 == "26"): {parte3="z"}
					   (parte3 == "0"): {parte3=" "}
		  		     	  }
				cadenadesencriptada=cadenadesencriptada + parte3;


				parte4=letra[16](cadenainvertida)+letra[17](cadenainvertida)+letra[18](cadenainvertida)+letra[19](cadenainvertida)+letra[20](cadenainvertida);
				seleccion{
					   (parte4 == "00001"): {parte4="1"}
				           (parte4 == "00010"): {parte4="2"}
					   (parte4 == "00011"): {parte4="3"}
					   (parte4 == "00100"): {parte4="4"}
					   (parte4 == "00101"): {parte4="5"}
					   (parte4 == "00110"): {parte4="6"}
					   (parte4 == "00111"): {parte4="7"}
					   (parte4 == "01000"): {parte4="8"}
					   (parte4 == "01001"): {parte4="9"}
					   (parte4 == "01010"): {parte4="10"}
					   (parte4 == "01011"): {parte4="11"}
					   (parte4 == "01100"): {parte4="12"}
					   (parte4 == "01101"): {parte4="13"}
					   (parte4 == "01110"): {parte4="14"}
					   (parte4 == "01111"): {parte4="15"}
					   (parte4 == "10000"): {parte4="16"}
					   (parte4 == "10001"): {parte4="17"}
					   (parte4 == "10010"): {parte4="18"}
					   (parte4 == "10011"): {parte4="19"}
					   (parte4 == "10100"): {parte4="20"}
					   (parte4 == "10101"): {parte4="21"}
					   (parte4 == "10110"): {parte4="22"}
					   (parte4 == "10111"): {parte4="23"}
					   (parte4 == "11000"): {parte4="24"}
					   (parte4 == "11001"): {parte4="25"}
					   (parte4 == "11010"): {parte4="26"}
					   (parte4 == "00000"): {parte4="0"}
		  		     	  }

				seleccion{
					   (parte4 == "1"): {parte4="a"}
				           (parte4 == "2"): {parte4="b"}
					   (parte4 == "3"): {parte4="a"}
					   (parte4 == "4"): {parte4="d"}
					   (parte4 == "5"): {parte4="e"}
					   (parte4 == "6"): {parte4="f"}
					   (parte4 == "7"): {parte4="g"}
					   (parte4 == "8"): {parte4="h"}
					   (parte4 == "9"): {parte4="i"}
					   (parte4 == "10"): {parte4="j"}
					   (parte4 == "11"): {parte4="k"}
					   (parte4 == "12"): {parte4="l"}
					   (parte4 == "13"): {parte4="m"}
					   (parte4 == "14"): {parte4="n"}
					   (parte4 == "15"): {parte4="o"}
					   (parte4 == "16"): {parte4="p"}
					   (parte4 == "17"): {parte4="q"}
					   (parte4 == "18"): {parte4="r"}
					   (parte4 == "19"): {parte4="s"}
					   (parte4 == "20"): {parte4="t"}
					   (parte4 == "21"): {parte4="u"}
					   (parte4 == "22"): {parte4="v"}
					   (parte4 == "23"): {parte4="w"}
					   (parte4 == "24"): {parte4="x"}
					   (parte4 == "25"): {parte4="y"}
					   (parte4 == "26"): {parte4="z"}
					   (parte4 == "0"): {parte4=" "}
		  		     	  }
				cadenadesencriptada=cadenadesencriptada + parte4;
                                write ("La cadena desencriptada es: " + cadenadesencriptada");
		      }
				
		}

             }
           
          }

}
