{
  "type": "postgres",
  "host": "databas host here",
  "port": 5432,
  "username": "user here ...",
  "password": "password here",
  "database": "database name here",
  "entities": ["build/src/app/**/*.entity.js"],
  "migrations": ["build/src/migrations/*.js"],
  "cli": {
   "migrationsDir": "src/migrations"
  },
  "logging": true,
  "synchronize": false
}
