1|{"en": "CUSTOMER", "es": "CLIENTE"}|2020-01-03 14:11:01.798353|2020-01-03 14:11:01.798353|11A
2|{"en": "BILLING", "es": "CAJA"}|2020-01-03 14:11:33.351157|2020-01-03 14:11:33.351157|11A
3|{"en": "HEAD WAITER", "es": "CAPITAN DE MESONERO"}|2020-01-03 14:13:10.255551|2020-01-03 14:13:10.255551|11A
4|{"en": "WAITER", "es": "MESONERO"}|2020-01-03 14:13:40.599959|2020-01-03 14:13:40.599959|11A
5|{"en": "KITCHEN", "es": "COCINA"}|2020-01-03 14:14:13.00218|2020-01-03 14:14:13.00218|11A
11|{"en": "RESTAURANT ADMIN", "es": "ADMINISTRADOR DE RESTAURANT"}|2020-01-03 14:14:39.167658|2020-01-03 14:14:39.167658|11A
12|{"en": "SYSTEM ADMIN", "es": "ADMINISTRADOR DE SISTEMA"}|2020-01-03 14:14:58.43217|2020-01-03 14:14:58.43217|11A
