{
  "name": "NATALI MUJICA",
  "id": "V9418332",
  "address": "STA FE",
  "phone": "0212-9999999",
  "email": "natali.mujica@piramide.com.ve",
  "vehicles": [
    {
      "id": "AD293FM",
      "brand": "JEEP",
      "model": "CHEROKEE",
      "year": "2011",
      "service": {
        "id": "2G",
        "duration": "12",
        "durationUnit": "MONTHS",
        "price": "50",
        "currency": "$"
      }
    },
    {
      "id": "AG215IA",
      "brand": "CHERVORLET",
      "model": "AVEO",
      "year": "2012",
      "service": {
        "id": "3G",
        "duration": "12",
        "durationUnit": "MONTHS",
        "price": "65",
        "currency": "$"
      }
    }
  ]
}
