{
    "name": "T_SUPaaFFM",
    "title": "Forfait petit matériel (extension de fichier .ffm)",
    "produit": "PMSI MCO",
    "history": {
        "dateCreated": "2007",
        "dateDeleted": "2009",
        "dateMissing": []
    },
    "missingValues": [
        ""
    ],
    "fields": [
        {
            "name": "ETA_NUM",
            "description": "Numéro FINESS e-PMSI",
            "type": "string",
            "length": "9",
            "dateCreated": "2007",
            "dateDeleted": "2009",
            "nomenclature": "FINESS:ej_finess",
            "dateMissing": [],
            "format": "default",
            "observation": "",
            "regle_gestion": "",
            "type_oracle": "string",
            "constraints": {
                "maxLength": 9
            }
        },
        {
            "name": "NBR_TOT",
            "description": "Nombre total réalisé",
            "type": "integer",
            "length": "8",
            "dateCreated": "2007",
            "dateDeleted": "2009",
            "nomenclature": "-",
            "dateMissing": [],
            "format": "default",
            "observation": "",
            "regle_gestion": "",
            "type_oracle": "number",
            "constraints": {
                "minimum": 0,
                "maximum": 99999999
            }
        },
        {
            "name": "ANN_MOI",
            "description": "Mois et année",
            "type": "yearmonth",
            "length": null,
            "dateCreated": "2007",
            "dateDeleted": "2009",
            "nomenclature": "-",
            "dateMissing": [],
            "format": "default",
            "observation": "",
            "regle_gestion": "",
            "type_oracle": "date"
        },
        {
            "name": "FIC_TYP",
            "description": "Type de fichier",
            "type": "integer",
            "length": "3",
            "dateCreated": "2007",
            "dateDeleted": "2009",
            "nomenclature": "-",
            "dateMissing": [],
            "format": "default",
            "observation": "",
            "regle_gestion": "",
            "type_oracle": "number",
            "constraints": {
                "minimum": 0,
                "maximum": 999
            }
        }
    ],
    "champ": "Public",
    "observation": "",
    "foreignKeys": [
        {
            "fields": [
                "ETA_NUM"
            ],
            "reference": {
                "resource": "T_MCOaaE",
                "fields": [
                    "ETA_NUM"
                ]
            }
        }
    ]
}