{
    "fields": [
        {
            "name": "ACT_COD",
            "description": "Code de l'activité",
            "type": "string",
            "nomenclature": "IR_ACT_COD",
            "length": "1",
            "format": "default",
            "dateCreated": "2010",
            "dateDeleted": "",
            "dateMissing": [],
            "observation": "",
            "regle_gestion": "",
            "type_oracle": "string",
            "constraints": {
                "maxLength": 1
            }
        },
        {
            "name": "CCAM_COD",
            "description": "Code de l'acte CCAM (hors extension PMSI)",
            "type": "string",
            "nomenclature": "IR_CCAM_V63",
            "length": "7",
            "format": "default",
            "dateCreated": "2010",
            "dateDeleted": "",
            "dateMissing": [],
            "observation": "",
            "regle_gestion": "",
            "type_oracle": "string",
            "constraints": {
                "maxLength": 7
            }
        },
        {
            "name": "EXT_PMSI",
            "description": "Extension PMSI",
            "type": "string",
            "nomenclature": "-",
            "length": "2",
            "format": "default",
            "dateCreated": "2015",
            "dateDeleted": "",
            "dateMissing": [],
            "observation": "",
            "regle_gestion": "",
            "type_oracle": "string",
            "constraints": {
                "maxLength": 2
            }
        },
        {
            "name": "DEL_DEB_SSEQ",
            "description": "Délai depuis le début de la sousséquence",
            "type": "number",
            "nomenclature": "-",
            "length": null,
            "format": "default",
            "dateCreated": "2010",
            "dateDeleted": "",
            "dateMissing": [],
            "observation": "",
            "regle_gestion": "",
            "type_oracle": "number"
        },
        {
            "name": "ETA_NUM_EPMSI",
            "description": "N° FINESS e-PMSI",
            "type": "string",
            "nomenclature": "FINESS:ej_finess",
            "length": "9",
            "format": "default",
            "dateCreated": "2010",
            "dateDeleted": "",
            "dateMissing": [],
            "observation": "",
            "regle_gestion": "",
            "type_oracle": "string",
            "constraints": {
                "maxLength": 9
            }
        },
        {
            "name": "ETA_NUM_GEO",
            "description": "Numéro FINESS de l’établissement (code géographique)",
            "type": "string",
            "nomenclature": "FINESS:et_finess",
            "length": "9",
            "format": "default",
            "dateCreated": "2017",
            "dateDeleted": "",
            "dateMissing": [],
            "observation": "",
            "regle_gestion": "",
            "type_oracle": "string",
            "constraints": {
                "maxLength": 9
            }
        },
        {
            "name": "EXT_DOC",
            "description": "Extension documentaire",
            "type": "string",
            "nomenclature": "-",
            "length": "1",
            "format": "default",
            "dateCreated": "2010",
            "dateDeleted": "",
            "dateMissing": [],
            "observation": "",
            "regle_gestion": "",
            "type_oracle": "string",
            "constraints": {
                "maxLength": 1
            }
        },
        {
            "name": "PHA_COD",
            "description": "Code de la phase",
            "type": "string",
            "nomenclature": "-",
            "length": "1",
            "format": "default",
            "dateCreated": "2010",
            "dateDeleted": "",
            "dateMissing": [],
            "observation": "",
            "regle_gestion": "",
            "type_oracle": "string",
            "constraints": {
                "maxLength": 1
            }
        },
        {
            "name": "REAL_NBR",
            "description": "Nombre de réalisations",
            "type": "integer",
            "nomenclature": "-",
            "length": "5",
            "format": "default",
            "dateCreated": "2010",
            "dateDeleted": "",
            "dateMissing": [],
            "observation": "",
            "regle_gestion": "",
            "type_oracle": "number",
            "constraints": {
                "minimum": 0,
                "maximum": 99999
            }
        },
        {
            "name": "RHAD_NUM",
            "description": "N° séquentiel de séjour d'HAD",
            "type": "string",
            "nomenclature": "-",
            "length": "5",
            "format": "default",
            "dateCreated": "2010",
            "dateDeleted": "",
            "dateMissing": [],
            "observation": "",
            "regle_gestion": "",
            "type_oracle": "string",
            "constraints": {
                "maxLength": 5
            }
        },
        {
            "name": "SEQ_NUM",
            "description": "N° de la séquence dans le séjour",
            "type": "string",
            "nomenclature": "-",
            "length": "4",
            "format": "default",
            "dateCreated": "2010",
            "dateDeleted": "",
            "dateMissing": [],
            "observation": "",
            "regle_gestion": "",
            "type_oracle": "string",
            "constraints": {
                "maxLength": 4
            }
        },
        {
            "name": "SSEQ_NUM",
            "description": "N° de la sous-séquence",
            "type": "string",
            "nomenclature": "-",
            "length": "4",
            "format": "default",
            "dateCreated": "2010",
            "dateDeleted": "",
            "dateMissing": [],
            "observation": "",
            "regle_gestion": "",
            "type_oracle": "string",
            "constraints": {
                "maxLength": 4
            }
        },
        {
            "name": "VAL_DAT_SSEQ",
            "description": "Dates de validité de l'acte compatibles avec les dates de la sousséquence",
            "type": "string",
            "nomenclature": "-",
            "length": "1",
            "format": "default",
            "dateCreated": "2010",
            "dateDeleted": "",
            "dateMissing": [],
            "observation": "",
            "regle_gestion": "",
            "type_oracle": "string",
            "constraints": {
                "maxLength": 1
            }
        },
        {
            "name": "ETA_NUM_TWO",
            "description": "Numéro FINESS de l’établissement (code géographique)",
            "type": "string",
            "length": "9",
            "dateCreated": "2010",
            "dateDeleted": "2017",
            "nomenclature": "FINESS:et_finess",
            "dateMissing": [],
            "format": "default",
            "observation": "",
            "regle_gestion": "",
            "type_oracle": "string",
            "constraints": {
                "maxLength": 9
            }
        }
    ],
    "name": "T_HADaaA",
    "title": "Table des actes",
    "produit": "PMSI HAD",
    "missingValues": [
        ""
    ],
    "foreignKeys": [
        {
            "fields": [
                "ETA_NUM_EPMSI",
                "RHAD_NUM"
            ],
            "reference": {
                "resource": "T_HADaaB",
                "fields": [
                    "ETA_NUM_EPMSI",
                    "RHAD_NUM"
                ]
            }
        },
        {
            "fields": [
                "ACT_COD"
            ],
            "reference": {
                "resource": "IR_ACT_COD",
                "fields": [
                    "ACT_COD"
                ]
            },
            "description": "Nomenclature"
        },
        {
            "fields": [
                "CCAM_COD"
            ],
            "reference": {
                "resource": "IR_CCAM_V63",
                "fields": [
                    "CAM_PRS_IDE_COD"
                ]
            },
            "description": "Nomenclature"
        }
    ],
    "history": {
        "dateCreated": "2010",
        "dateDeleted": "",
        "dateMissing": []
    },
    "champ": "Public et Privé",
    "observation": ""
}