{
    "fields": [
        {
            "name": "ANN_TRT",
            "description": "N° du trimestre PMSI transmis",
            "type": "string",
            "nomenclature": "-",
            "length": "7",
            "format": "default",
            "dateCreated": "2005",
            "dateDeleted": "",
            "dateMissing": [],
            "observation": "",
            "regle_gestion": "",
            "type_oracle": "string",
            "constraints": {
                "maxLength": 7
            }
        },
        {
            "name": "ETA_NUM",
            "description": "Numéro FINESS e-PMSI",
            "type": "string",
            "nomenclature": "FINESS:ej_finess",
            "length": "9",
            "format": "default",
            "dateCreated": "2005",
            "dateDeleted": "",
            "dateMissing": [],
            "observation": "",
            "regle_gestion": "",
            "type_oracle": "string",
            "constraints": {
                "maxLength": 9
            }
        },
        {
            "name": "ETB_EXE_FIN",
            "description": "N°FINESS sans clé",
            "type": "string",
            "nomenclature": "-",
            "length": "8",
            "format": "default",
            "dateCreated": "2005",
            "dateDeleted": "",
            "dateMissing": [],
            "observation": "",
            "regle_gestion": "",
            "type_oracle": "string",
            "constraints": {
                "maxLength": 8
            }
        },
        {
            "name": "REG_ETA",
            "description": "Région",
            "type": "string",
            "nomenclature": "-",
            "length": "40",
            "format": "default",
            "dateCreated": "2005",
            "dateDeleted": "",
            "dateMissing": [],
            "observation": "",
            "regle_gestion": "",
            "type_oracle": "string",
            "constraints": {
                "maxLength": 40
            }
        },
        {
            "name": "SOC_RAI",
            "description": "Raison sociale",
            "type": "string",
            "nomenclature": "-",
            "length": "80",
            "format": "default",
            "dateCreated": "2005",
            "dateDeleted": "",
            "dateMissing": [],
            "observation": "",
            "regle_gestion": "",
            "type_oracle": "string",
            "constraints": {
                "maxLength": 80
            }
        },
        {
            "name": "STA_ETA",
            "description": "Statut de l'établissement",
            "type": "string",
            "nomenclature": "-",
            "length": "3",
            "format": "default",
            "dateCreated": "2005",
            "dateDeleted": "",
            "dateMissing": [],
            "observation": "",
            "regle_gestion": "",
            "type_oracle": "string",
            "constraints": {
                "maxLength": 3
            }
        },
        {
            "name": "VAL_ETA",
            "description": "Validation des données",
            "type": "string",
            "nomenclature": "-",
            "length": "20",
            "format": "default",
            "dateCreated": "2005",
            "dateDeleted": "",
            "dateMissing": [],
            "observation": "",
            "regle_gestion": "",
            "type_oracle": "string",
            "constraints": {
                "maxLength": 20
            }
        }
    ],
    "name": "T_MCOaaE",
    "title": "Etablissement",
    "produit": "PMSI MCO",
    "missingValues": [
        ""
    ],
    "primaryKey": "ETA_NUM",
    "history": {
        "dateCreated": "2005",
        "dateDeleted": "",
        "dateMissing": []
    },
    "champ": "Public et Privé",
    "observation": "1 ligne par étab: 857 ex-DG et 1177 ex-OQN;  \nPar exemple pour l'année 2010: il y a 30 étab en + : 93 nouveaux finess (dont les hôpitaux militaires : REG_ETA=\"SERVICE DE SANTE DES ARMEES\" ) et 63 ont disparu - 98,7% ont transmis les 12 mois."
}