%YAML 1.1
%TAG !u! tag:unity3d.com,2011:
--- !u!114 &11400000
MonoBehaviour:
  m_ObjectHideFlags: 0
  m_CorrespondingSourceObject: {fileID: 0}
  m_PrefabInstance: {fileID: 0}
  m_PrefabAsset: {fileID: 0}
  m_GameObject: {fileID: 0}
  m_Enabled: 1
  m_EditorHideFlags: 0
  m_Script: {fileID: 11500000, guid: 83343438a802ee347bf57ae7c55c9968, type: 3}
  m_Name: EnemyKamikazeSO
  m_EditorClassIdentifier: 
  maxHp: 2
  hpLeft: 2
  speed: 10
  damagePerContact: 1
  scoreValue: 376
  probabilityToDropItem: 20
  dropableItemsList: {fileID: 11400000, guid: 790aec5c6cdc6334aa6662d2cf51407b, type: 2}
