%YAML 1.1
%TAG !u! tag:unity3d.com,2011:
--- !u!114 &11400000
MonoBehaviour:
  m_ObjectHideFlags: 0
  m_CorrespondingSourceObject: {fileID: 0}
  m_PrefabInstance: {fileID: 0}
  m_PrefabAsset: {fileID: 0}
  m_GameObject: {fileID: 0}
  m_Enabled: 1
  m_EditorHideFlags: 0
  m_Script: {fileID: 11500000, guid: a2ea800b88435074b853aaa3820e7d24, type: 3}
  m_Name: BigHealthPotionSO
  m_EditorClassIdentifier: 
  image: {fileID: 21300000, guid: 8a1c6958f04a8c74fa922b08d3169680, type: 3}
  itemName: Big health potion
  description: Big potion that heals all hp
  cost: 15000
  hpToHeal: 30
