%YAML 1.1
%TAG !u! tag:unity3d.com,2011:
--- !u!114 &11400000
MonoBehaviour:
  m_ObjectHideFlags: 0
  m_CorrespondingSourceObject: {fileID: 0}
  m_PrefabInstance: {fileID: 0}
  m_PrefabAsset: {fileID: 0}
  m_GameObject: {fileID: 0}
  m_Enabled: 1
  m_EditorHideFlags: 0
  m_Script: {fileID: 11500000, guid: a2ea800b88435074b853aaa3820e7d24, type: 3}
  m_Name: LittleHealthPotionItemSO
  m_EditorClassIdentifier: 
  image: {fileID: 21300000, guid: bd888af87c5eee84c9d1835cf60fbb73, type: 3}
  itemName: Little health potion
  description: Little potion that heals 1/3 hp
  cost: 5000
  hpToHeal: 10
