%YAML 1.1
%TAG !u! tag:unity3d.com,2011:
--- !u!114 &11400000
MonoBehaviour:
  m_ObjectHideFlags: 0
  m_CorrespondingSourceObject: {fileID: 0}
  m_PrefabInstance: {fileID: 0}
  m_PrefabAsset: {fileID: 0}
  m_GameObject: {fileID: 0}
  m_Enabled: 1
  m_EditorHideFlags: 0
  m_Script: {fileID: 11500000, guid: 83343438a802ee347bf57ae7c55c9968, type: 3}
  m_Name: EnemyTurretSO
  m_EditorClassIdentifier: 
  maxHp: 1
  hpLeft: 1
  speed: 0
  damagePerContact: 1
  scoreValue: 584
  probabilityToDropItem: 50
  dropableItemsList: {fileID: 11400000, guid: bf17d9a090d8a9b4cbc7a77a620bea6a, type: 2}
