%YAML 1.1
%TAG !u! tag:unity3d.com,2011:
--- !u!114 &11400000
MonoBehaviour:
  m_ObjectHideFlags: 0
  m_CorrespondingSourceObject: {fileID: 0}
  m_PrefabInstance: {fileID: 0}
  m_PrefabAsset: {fileID: 0}
  m_GameObject: {fileID: 0}
  m_Enabled: 1
  m_EditorHideFlags: 0
  m_Script: {fileID: 11500000, guid: 8ffeb61c4961bcf4d884b1978219f75d, type: 3}
  m_Name: PlayerSO
  m_EditorClassIdentifier: 
  maxHp: 30
  hpLeft: 30
  speed: 50
  invulnerabilityTimeDamage: 0.5
  invulnerabilityTimeDash: 0.25
  dashForce: 1000
  dashCooldown: 2
  meleeDamage: 1
  meleeRange: 1
  meleeForce: 1000
  meleeCooldown: 1
