%YAML 1.1
%TAG !u! tag:unity3d.com,2011:
--- !u!114 &11400000
MonoBehaviour:
  m_ObjectHideFlags: 0
  m_CorrespondingSourceObject: {fileID: 0}
  m_PrefabInstance: {fileID: 0}
  m_PrefabAsset: {fileID: 0}
  m_GameObject: {fileID: 0}
  m_Enabled: 1
  m_EditorHideFlags: 0
  m_Script: {fileID: 11500000, guid: 4757fbf40798dbc41965e055b33cde80, type: 3}
  m_Name: CommonsItemList
  m_EditorClassIdentifier: 
  items:
  - {fileID: 1764686585068287128, guid: 3d7cac130eb46d74b8c503ef4e9d77a8, type: 3}
