%YAML 1.1
%TAG !u! tag:unity3d.com,2011:
--- !u!114 &11400000
MonoBehaviour:
  m_ObjectHideFlags: 0
  m_CorrespondingSourceObject: {fileID: 0}
  m_PrefabInstance: {fileID: 0}
  m_PrefabAsset: {fileID: 0}
  m_GameObject: {fileID: 0}
  m_Enabled: 1
  m_EditorHideFlags: 0
  m_Script: {fileID: 11500000, guid: 30fe1966030f6b244827b92e5aa4739f, type: 3}
  m_Name: ShotgunSO
  m_EditorClassIdentifier: 
  bullet: {fileID: 4892742263035580905, guid: 534223025d0e2704395a242a31614980, type: 3}
  reloadTime: 1.5
  timeBetweenShots: 0.75
  bulletsStored: 0
  totalBullets: 30
  bulletsLeft: 0
  bulletsPerShot: 5
