%YAML 1.1
%TAG !u! tag:unity3d.com,2011:
--- !u!114 &11400000
MonoBehaviour:
  m_ObjectHideFlags: 0
  m_CorrespondingSourceObject: {fileID: 0}
  m_PrefabInstance: {fileID: 0}
  m_PrefabAsset: {fileID: 0}
  m_GameObject: {fileID: 0}
  m_Enabled: 1
  m_EditorHideFlags: 0
  m_Script: {fileID: 11500000, guid: ee992d14d1702294faf2049a0ec7ae0e, type: 3}
  m_Name: StunFlamethrowerSO
  m_EditorClassIdentifier: 
  bullet: {fileID: 0}
  reloadTime: 1.25
  timeBetweenShots: 0.1
  bulletsStored: 0
  totalBullets: 100
  bulletsLeft: 0
  timeToStun: 2
