%YAML 1.1
%TAG !u! tag:unity3d.com,2011:
--- !u!114 &11400000
MonoBehaviour:
  m_ObjectHideFlags: 0
  m_CorrespondingSourceObject: {fileID: 0}
  m_PrefabInstance: {fileID: 0}
  m_PrefabAsset: {fileID: 0}
  m_GameObject: {fileID: 0}
  m_Enabled: 1
  m_EditorHideFlags: 0
  m_Script: {fileID: 11500000, guid: 4757fbf40798dbc41965e055b33cde80, type: 3}
  m_Name: GeneralItemListSO
  m_EditorClassIdentifier: 
  items:
  - {fileID: 1764686585068287128, guid: 5cc1afe73c3725040b4ae2b060378722, type: 3}
  - {fileID: 1764686585068287128, guid: 8099ad8c1edc6974f859d3f11f8fe4ec, type: 3}
  - {fileID: 1764686585068287128, guid: d5423229fd8ca9a4995b5e9715a31f4d, type: 3}
  - {fileID: 1764686585068287128, guid: d79d58eb5d8c70541845a44cccbae88d, type: 3}
  - {fileID: 1764686585068287128, guid: 3d7cac130eb46d74b8c503ef4e9d77a8, type: 3}
  - {fileID: 1764686585068287128, guid: b36f2f288ac856947aa16d0c64a7ac86, type: 3}
