%YAML 1.1
%TAG !u! tag:unity3d.com,2011:
--- !u!1 &142932975679279518
GameObject:
  m_ObjectHideFlags: 0
  m_CorrespondingSourceObject: {fileID: 0}
  m_PrefabInstance: {fileID: 0}
  m_PrefabAsset: {fileID: 0}
  serializedVersion: 6
  m_Component:
  - component: {fileID: 2344342604250997298}
  - component: {fileID: 2410548060416641121}
  - component: {fileID: 1257375140931590249}
  m_Layer: 0
  m_Name: 2DFighterCanon (1)
  m_TagString: Untagged
  m_Icon: {fileID: 0}
  m_NavMeshLayer: 0
  m_StaticEditorFlags: 0
  m_IsActive: 1
--- !u!4 &2344342604250997298
Transform:
  m_ObjectHideFlags: 0
  m_CorrespondingSourceObject: {fileID: 0}
  m_PrefabInstance: {fileID: 0}
  m_PrefabAsset: {fileID: 0}
  m_GameObject: {fileID: 142932975679279518}
  m_LocalRotation: {x: -0, y: -0, z: -0, w: 1}
  m_LocalPosition: {x: -2.25, y: -0.06, z: 0}
  m_LocalScale: {x: 0.3, y: 0.3, z: 0.3}
  m_ConstrainProportionsScale: 0
  m_Children: []
  m_Father: {fileID: 1931631127413958988}
  m_RootOrder: 3
  m_LocalEulerAnglesHint: {x: 0, y: 0, z: 0}
--- !u!212 &2410548060416641121
SpriteRenderer:
  m_ObjectHideFlags: 0
  m_CorrespondingSourceObject: {fileID: 0}
  m_PrefabInstance: {fileID: 0}
  m_PrefabAsset: {fileID: 0}
  m_GameObject: {fileID: 142932975679279518}
  m_Enabled: 1
  m_CastShadows: 0
  m_ReceiveShadows: 0
  m_DynamicOccludee: 1
  m_StaticShadowCaster: 0
  m_MotionVectors: 1
  m_LightProbeUsage: 1
  m_ReflectionProbeUsage: 1
  m_RayTracingMode: 0
  m_RayTraceProcedural: 0
  m_RenderingLayerMask: 4294967295
  m_RendererPriority: 0
  m_Materials:
  - {fileID: 10754, guid: 0000000000000000f000000000000000, type: 0}
  m_StaticBatchInfo:
    firstSubMesh: 0
    subMeshCount: 0
  m_StaticBatchRoot: {fileID: 0}
  m_ProbeAnchor: {fileID: 0}
  m_LightProbeVolumeOverride: {fileID: 0}
  m_ScaleInLightmap: 1
  m_ReceiveGI: 1
  m_PreserveUVs: 0
  m_IgnoreNormalsForChartDetection: 0
  m_ImportantGI: 0
  m_StitchLightmapSeams: 0
  m_SelectedEditorRenderState: 0
  m_MinimumChartSize: 4
  m_AutoUVMaxDistance: 0.5
  m_AutoUVMaxAngle: 89
  m_LightmapParameters: {fileID: 0}
  m_SortingLayerID: -1651907423
  m_SortingLayer: 0
  m_SortingOrder: 1
  m_Sprite: {fileID: 21300002, guid: 23a10fa0df1140746adb7bda3d420aba, type: 3}
  m_Color: {r: 1, g: 1, b: 1, a: 1}
  m_FlipX: 0
  m_FlipY: 0
  m_DrawMode: 0
  m_Size: {x: 0.72, y: 3.88}
  m_AdaptiveModeThreshold: 0.5
  m_SpriteTileMode: 0
  m_WasSpriteAssigned: 1
  m_MaskInteraction: 0
  m_SpriteSortPoint: 0
--- !u!60 &1257375140931590249
PolygonCollider2D:
  m_ObjectHideFlags: 0
  m_CorrespondingSourceObject: {fileID: 0}
  m_PrefabInstance: {fileID: 0}
  m_PrefabAsset: {fileID: 0}
  m_GameObject: {fileID: 142932975679279518}
  m_Enabled: 1
  m_Density: 1
  m_Material: {fileID: 0}
  m_IsTrigger: 0
  m_UsedByEffector: 0
  m_UsedByComposite: 0
  m_Offset: {x: 0, y: 0}
  m_SpriteTilingProperty:
    border: {x: 0, y: 0, z: 0, w: 0}
    pivot: {x: 0.5, y: 0.5}
    oldSize: {x: 0.72, y: 3.88}
    newSize: {x: 0.72, y: 3.88}
    adaptiveTilingThreshold: 0.5
    drawMode: 0
    adaptiveTiling: 0
  m_AutoTiling: 0
  m_Points:
    m_Paths:
    - - {x: 0.29, y: -0.93}
      - {x: 0.29999998, y: -0.17999999}
      - {x: 0.22, y: -0.14999999}
      - {x: 0.21, y: 0.13}
      - {x: 0.22, y: 0.52}
      - {x: 0.19999999, y: 1.0699999}
      - {x: 0.26, y: 1.14}
      - {x: 0.26, y: 1.74}
      - {x: 0.19999999, y: 1.9}
      - {x: 0.17999999, y: 1.9399999}
      - {x: -0.16, y: 1.9399999}
      - {x: -0.17, y: 1.91}
      - {x: -0.24, y: 1.7199999}
      - {x: -0.22999999, y: 1.6999999}
      - {x: -0.22, y: 1.15}
      - {x: -0.17999999, y: 1.06}
      - {x: -0.17999999, y: -0.17}
      - {x: -0.24, y: -0.17999999}
      - {x: -0.26, y: -0.19999999}
      - {x: -0.26, y: -0.78}
      - {x: -0.29, y: -0.78}
      - {x: -0.28, y: -0.95}
      - {x: -0.35, y: -1.17}
      - {x: -0.35, y: -1.9399999}
      - {x: 0.35999998, y: -1.9399999}
      - {x: 0.35999998, y: -1.13}
      - {x: 0.31, y: -0.96999997}
--- !u!1 &2285112971395669592
GameObject:
  m_ObjectHideFlags: 0
  m_CorrespondingSourceObject: {fileID: 0}
  m_PrefabInstance: {fileID: 0}
  m_PrefabAsset: {fileID: 0}
  serializedVersion: 6
  m_Component:
  - component: {fileID: 2147993629907102959}
  - component: {fileID: 5161130410081820081}
  - component: {fileID: 4064871681668091380}
  m_Layer: 0
  m_Name: 2DFighterMinigun
  m_TagString: Untagged
  m_Icon: {fileID: 0}
  m_NavMeshLayer: 0
  m_StaticEditorFlags: 0
  m_IsActive: 1
--- !u!4 &2147993629907102959
Transform:
  m_ObjectHideFlags: 0
  m_CorrespondingSourceObject: {fileID: 0}
  m_PrefabInstance: {fileID: 0}
  m_PrefabAsset: {fileID: 0}
  m_GameObject: {fileID: 2285112971395669592}
  m_LocalRotation: {x: -0, y: -0, z: -0, w: 1}
  m_LocalPosition: {x: 0.704, y: 3.301, z: 0}
  m_LocalScale: {x: 0.3, y: 0.3, z: 0.3}
  m_ConstrainProportionsScale: 0
  m_Children: []
  m_Father: {fileID: 1931631127413958988}
  m_RootOrder: 0
  m_LocalEulerAnglesHint: {x: 0, y: 0, z: 0}
--- !u!212 &5161130410081820081
SpriteRenderer:
  m_ObjectHideFlags: 0
  m_CorrespondingSourceObject: {fileID: 0}
  m_PrefabInstance: {fileID: 0}
  m_PrefabAsset: {fileID: 0}
  m_GameObject: {fileID: 2285112971395669592}
  m_Enabled: 1
  m_CastShadows: 0
  m_ReceiveShadows: 0
  m_DynamicOccludee: 1
  m_StaticShadowCaster: 0
  m_MotionVectors: 1
  m_LightProbeUsage: 1
  m_ReflectionProbeUsage: 1
  m_RayTracingMode: 0
  m_RayTraceProcedural: 0
  m_RenderingLayerMask: 4294967295
  m_RendererPriority: 0
  m_Materials:
  - {fileID: 10754, guid: 0000000000000000f000000000000000, type: 0}
  m_StaticBatchInfo:
    firstSubMesh: 0
    subMeshCount: 0
  m_StaticBatchRoot: {fileID: 0}
  m_ProbeAnchor: {fileID: 0}
  m_LightProbeVolumeOverride: {fileID: 0}
  m_ScaleInLightmap: 1
  m_ReceiveGI: 1
  m_PreserveUVs: 0
  m_IgnoreNormalsForChartDetection: 0
  m_ImportantGI: 0
  m_StitchLightmapSeams: 0
  m_SelectedEditorRenderState: 0
  m_MinimumChartSize: 4
  m_AutoUVMaxDistance: 0.5
  m_AutoUVMaxAngle: 89
  m_LightmapParameters: {fileID: 0}
  m_SortingLayerID: -1651907423
  m_SortingLayer: 0
  m_SortingOrder: 1
  m_Sprite: {fileID: 21300004, guid: 23a10fa0df1140746adb7bda3d420aba, type: 3}
  m_Color: {r: 1, g: 1, b: 1, a: 1}
  m_FlipX: 0
  m_FlipY: 0
  m_DrawMode: 0
  m_Size: {x: 0.84, y: 2.97}
  m_AdaptiveModeThreshold: 0.5
  m_SpriteTileMode: 0
  m_WasSpriteAssigned: 1
  m_MaskInteraction: 0
  m_SpriteSortPoint: 0
--- !u!60 &4064871681668091380
PolygonCollider2D:
  m_ObjectHideFlags: 0
  m_CorrespondingSourceObject: {fileID: 0}
  m_PrefabInstance: {fileID: 0}
  m_PrefabAsset: {fileID: 0}
  m_GameObject: {fileID: 2285112971395669592}
  m_Enabled: 1
  m_Density: 1
  m_Material: {fileID: 0}
  m_IsTrigger: 0
  m_UsedByEffector: 0
  m_UsedByComposite: 0
  m_Offset: {x: 0, y: 0}
  m_SpriteTilingProperty:
    border: {x: 0, y: 0, z: 0, w: 0}
    pivot: {x: 0.5, y: 0.5}
    oldSize: {x: 0.84, y: 2.97}
    newSize: {x: 0.84, y: 2.97}
    adaptiveTilingThreshold: 0.5
    drawMode: 0
    adaptiveTiling: 0
  m_AutoTiling: 0
  m_Points:
    m_Paths:
    - - {x: 0.26999998, y: -0.435}
      - {x: 0.24, y: -0.39499998}
      - {x: 0.24, y: 0.53499997}
      - {x: 0.26999998, y: 0.78499997}
      - {x: 0.28, y: 1.4449999}
      - {x: 0.22999999, y: 1.485}
      - {x: -0.29999998, y: 1.485}
      - {x: -0.35, y: 1.435}
      - {x: -0.35, y: 0.91499996}
      - {x: -0.32999998, y: 0.775}
      - {x: -0.29999998, y: 0.72499996}
      - {x: -0.29999998, y: -0.375}
      - {x: -0.32999998, y: -0.445}
      - {x: -0.31, y: -0.755}
      - {x: -0.42, y: -0.755}
      - {x: -0.42, y: -1.485}
      - {x: 0.42, y: -1.485}
      - {x: 0.42, y: -0.755}
      - {x: 0.22999999, y: -0.755}
    - - {x: -0.03, y: -0.475}
      - {x: -0.04, y: -0.475}
      - {x: -0.04, y: -0.745}
      - {x: -0.03, y: -0.745}
    - - {x: -0.03, y: 0.73499995}
      - {x: -0.04, y: 0.73499995}
      - {x: -0.04, y: -0.405}
      - {x: -0.03, y: -0.405}
    - - {x: -0.03, y: 0.885}
      - {x: -0.04, y: 0.885}
      - {x: -0.04, y: 0.815}
      - {x: -0.03, y: 0.815}
    - - {x: -0.03, y: 0.995}
      - {x: -0.04, y: 0.955}
      - {x: -0.03, y: 0.945}
--- !u!1 &2319835782316447805
GameObject:
  m_ObjectHideFlags: 0
  m_CorrespondingSourceObject: {fileID: 0}
  m_PrefabInstance: {fileID: 0}
  m_PrefabAsset: {fileID: 0}
  serializedVersion: 6
  m_Component:
  - component: {fileID: 1931631127413958988}
  m_Layer: 0
  m_Name: Weapons
  m_TagString: Untagged
  m_Icon: {fileID: 0}
  m_NavMeshLayer: 0
  m_StaticEditorFlags: 0
  m_IsActive: 1
--- !u!4 &1931631127413958988
Transform:
  m_ObjectHideFlags: 0
  m_CorrespondingSourceObject: {fileID: 0}
  m_PrefabInstance: {fileID: 0}
  m_PrefabAsset: {fileID: 0}
  m_GameObject: {fileID: 2319835782316447805}
  m_LocalRotation: {x: -0, y: -0, z: 0.7071068, w: 0.7071068}
  m_LocalPosition: {x: 0, y: 0, z: 0}
  m_LocalScale: {x: 1, y: 1, z: 1}
  m_ConstrainProportionsScale: 0
  m_Children:
  - {fileID: 2147993629907102959}
  - {fileID: 5651653573426360431}
  - {fileID: 5038672399491289882}
  - {fileID: 2344342604250997298}
  m_Father: {fileID: 6983805402040773912}
  m_RootOrder: 0
  m_LocalEulerAnglesHint: {x: 0, y: 0, z: 0}
--- !u!1 &4908526948183905127
GameObject:
  m_ObjectHideFlags: 0
  m_CorrespondingSourceObject: {fileID: 0}
  m_PrefabInstance: {fileID: 0}
  m_PrefabAsset: {fileID: 0}
  serializedVersion: 6
  m_Component:
  - component: {fileID: 5651653573426360431}
  - component: {fileID: 374085796392688358}
  - component: {fileID: 8859679160051271224}
  m_Layer: 0
  m_Name: 2DFighterCanon
  m_TagString: Untagged
  m_Icon: {fileID: 0}
  m_NavMeshLayer: 0
  m_StaticEditorFlags: 0
  m_IsActive: 1
--- !u!4 &5651653573426360431
Transform:
  m_ObjectHideFlags: 0
  m_CorrespondingSourceObject: {fileID: 0}
  m_PrefabInstance: {fileID: 0}
  m_PrefabAsset: {fileID: 0}
  m_GameObject: {fileID: 4908526948183905127}
  m_LocalRotation: {x: -0, y: -0, z: -0, w: 1}
  m_LocalPosition: {x: 2.25, y: -0.06, z: 0}
  m_LocalScale: {x: 0.3, y: 0.3, z: 0.3}
  m_ConstrainProportionsScale: 0
  m_Children: []
  m_Father: {fileID: 1931631127413958988}
  m_RootOrder: 1
  m_LocalEulerAnglesHint: {x: 0, y: 0, z: 0}
--- !u!212 &374085796392688358
SpriteRenderer:
  m_ObjectHideFlags: 0
  m_CorrespondingSourceObject: {fileID: 0}
  m_PrefabInstance: {fileID: 0}
  m_PrefabAsset: {fileID: 0}
  m_GameObject: {fileID: 4908526948183905127}
  m_Enabled: 1
  m_CastShadows: 0
  m_ReceiveShadows: 0
  m_DynamicOccludee: 1
  m_StaticShadowCaster: 0
  m_MotionVectors: 1
  m_LightProbeUsage: 1
  m_ReflectionProbeUsage: 1
  m_RayTracingMode: 0
  m_RayTraceProcedural: 0
  m_RenderingLayerMask: 4294967295
  m_RendererPriority: 0
  m_Materials:
  - {fileID: 10754, guid: 0000000000000000f000000000000000, type: 0}
  m_StaticBatchInfo:
    firstSubMesh: 0
    subMeshCount: 0
  m_StaticBatchRoot: {fileID: 0}
  m_ProbeAnchor: {fileID: 0}
  m_LightProbeVolumeOverride: {fileID: 0}
  m_ScaleInLightmap: 1
  m_ReceiveGI: 1
  m_PreserveUVs: 0
  m_IgnoreNormalsForChartDetection: 0
  m_ImportantGI: 0
  m_StitchLightmapSeams: 0
  m_SelectedEditorRenderState: 0
  m_MinimumChartSize: 4
  m_AutoUVMaxDistance: 0.5
  m_AutoUVMaxAngle: 89
  m_LightmapParameters: {fileID: 0}
  m_SortingLayerID: -1651907423
  m_SortingLayer: 0
  m_SortingOrder: 1
  m_Sprite: {fileID: 21300002, guid: 23a10fa0df1140746adb7bda3d420aba, type: 3}
  m_Color: {r: 1, g: 1, b: 1, a: 1}
  m_FlipX: 0
  m_FlipY: 0
  m_DrawMode: 0
  m_Size: {x: 0.72, y: 3.88}
  m_AdaptiveModeThreshold: 0.5
  m_SpriteTileMode: 0
  m_WasSpriteAssigned: 1
  m_MaskInteraction: 0
  m_SpriteSortPoint: 0
--- !u!60 &8859679160051271224
PolygonCollider2D:
  m_ObjectHideFlags: 0
  m_CorrespondingSourceObject: {fileID: 0}
  m_PrefabInstance: {fileID: 0}
  m_PrefabAsset: {fileID: 0}
  m_GameObject: {fileID: 4908526948183905127}
  m_Enabled: 1
  m_Density: 1
  m_Material: {fileID: 0}
  m_IsTrigger: 0
  m_UsedByEffector: 0
  m_UsedByComposite: 0
  m_Offset: {x: 0, y: 0}
  m_SpriteTilingProperty:
    border: {x: 0, y: 0, z: 0, w: 0}
    pivot: {x: 0.5, y: 0.5}
    oldSize: {x: 0.72, y: 3.88}
    newSize: {x: 0.72, y: 3.88}
    adaptiveTilingThreshold: 0.5
    drawMode: 0
    adaptiveTiling: 0
  m_AutoTiling: 0
  m_Points:
    m_Paths:
    - - {x: 0.29, y: -0.93}
      - {x: 0.29999998, y: -0.17999999}
      - {x: 0.22, y: -0.14999999}
      - {x: 0.21, y: 0.13}
      - {x: 0.22, y: 0.52}
      - {x: 0.19999999, y: 1.0699999}
      - {x: 0.26, y: 1.14}
      - {x: 0.26, y: 1.74}
      - {x: 0.19999999, y: 1.9}
      - {x: 0.17999999, y: 1.9399999}
      - {x: -0.16, y: 1.9399999}
      - {x: -0.17, y: 1.91}
      - {x: -0.24, y: 1.7199999}
      - {x: -0.22999999, y: 1.6999999}
      - {x: -0.22, y: 1.15}
      - {x: -0.17999999, y: 1.06}
      - {x: -0.17999999, y: -0.17}
      - {x: -0.24, y: -0.17999999}
      - {x: -0.26, y: -0.19999999}
      - {x: -0.26, y: -0.78}
      - {x: -0.29, y: -0.78}
      - {x: -0.28, y: -0.95}
      - {x: -0.35, y: -1.17}
      - {x: -0.35, y: -1.9399999}
      - {x: 0.35999998, y: -1.9399999}
      - {x: 0.35999998, y: -1.13}
      - {x: 0.31, y: -0.96999997}
--- !u!1 &5968807936553455361
GameObject:
  m_ObjectHideFlags: 0
  m_CorrespondingSourceObject: {fileID: 0}
  m_PrefabInstance: {fileID: 0}
  m_PrefabAsset: {fileID: 0}
  serializedVersion: 6
  m_Component:
  - component: {fileID: 6983805402040773912}
  - component: {fileID: 1156760953281709042}
  - component: {fileID: 8468517012725740575}
  m_Layer: 0
  m_Name: PlayerShip
  m_TagString: Untagged
  m_Icon: {fileID: 0}
  m_NavMeshLayer: 0
  m_StaticEditorFlags: 0
  m_IsActive: 1
--- !u!4 &6983805402040773912
Transform:
  m_ObjectHideFlags: 0
  m_CorrespondingSourceObject: {fileID: 0}
  m_PrefabInstance: {fileID: 0}
  m_PrefabAsset: {fileID: 0}
  m_GameObject: {fileID: 5968807936553455361}
  m_LocalRotation: {x: -0, y: -0, z: -0.7071068, w: 0.7071068}
  m_LocalPosition: {x: 4.37, y: 0.99, z: 0}
  m_LocalScale: {x: 0.20000006, y: 0.20000006, z: 0.2}
  m_ConstrainProportionsScale: 0
  m_Children:
  - {fileID: 1931631127413958988}
  m_Father: {fileID: 0}
  m_RootOrder: 0
  m_LocalEulerAnglesHint: {x: 0, y: 0, z: -90}
--- !u!212 &1156760953281709042
SpriteRenderer:
  m_ObjectHideFlags: 0
  m_CorrespondingSourceObject: {fileID: 0}
  m_PrefabInstance: {fileID: 0}
  m_PrefabAsset: {fileID: 0}
  m_GameObject: {fileID: 5968807936553455361}
  m_Enabled: 1
  m_CastShadows: 0
  m_ReceiveShadows: 0
  m_DynamicOccludee: 1
  m_StaticShadowCaster: 0
  m_MotionVectors: 1
  m_LightProbeUsage: 1
  m_ReflectionProbeUsage: 1
  m_RayTracingMode: 0
  m_RayTraceProcedural: 0
  m_RenderingLayerMask: 4294967295
  m_RendererPriority: 0
  m_Materials:
  - {fileID: 10754, guid: 0000000000000000f000000000000000, type: 0}
  m_StaticBatchInfo:
    firstSubMesh: 0
    subMeshCount: 0
  m_StaticBatchRoot: {fileID: 0}
  m_ProbeAnchor: {fileID: 0}
  m_LightProbeVolumeOverride: {fileID: 0}
  m_ScaleInLightmap: 1
  m_ReceiveGI: 1
  m_PreserveUVs: 0
  m_IgnoreNormalsForChartDetection: 0
  m_ImportantGI: 0
  m_StitchLightmapSeams: 0
  m_SelectedEditorRenderState: 0
  m_MinimumChartSize: 4
  m_AutoUVMaxDistance: 0.5
  m_AutoUVMaxAngle: 89
  m_LightmapParameters: {fileID: 0}
  m_SortingLayerID: -103832621
  m_SortingLayer: 0
  m_SortingOrder: 1
  m_Sprite: {fileID: 21300004, guid: 8cb507e2be1846b40ad81e95cef5a76c, type: 3}
  m_Color: {r: 1, g: 1, b: 1, a: 1}
  m_FlipX: 0
  m_FlipY: 0
  m_DrawMode: 0
  m_Size: {x: 9.14, y: 7.3}
  m_AdaptiveModeThreshold: 0.5
  m_SpriteTileMode: 0
  m_WasSpriteAssigned: 1
  m_MaskInteraction: 0
  m_SpriteSortPoint: 0
--- !u!60 &8468517012725740575
PolygonCollider2D:
  m_ObjectHideFlags: 0
  m_CorrespondingSourceObject: {fileID: 0}
  m_PrefabInstance: {fileID: 0}
  m_PrefabAsset: {fileID: 0}
  m_GameObject: {fileID: 5968807936553455361}
  m_Enabled: 1
  m_Density: 1
  m_Material: {fileID: 0}
  m_IsTrigger: 0
  m_UsedByEffector: 0
  m_UsedByComposite: 0
  m_Offset: {x: 0, y: 0}
  m_SpriteTilingProperty:
    border: {x: 0, y: 0, z: 0, w: 0}
    pivot: {x: 0.5, y: 0.5}
    oldSize: {x: 9.14, y: 7.3}
    newSize: {x: 9.14, y: 7.3}
    adaptiveTilingThreshold: 0.5
    drawMode: 0
    adaptiveTiling: 0
  m_AutoTiling: 0
  m_Points:
    m_Paths:
    - - {x: 4.2599998, y: -3.4399998}
      - {x: 4.25, y: -3.4099998}
      - {x: 4.23, y: -3.3899999}
      - {x: 3.9199998, y: -3.3799999}
      - {x: 3.9599998, y: -3.3}
      - {x: 4.13, y: -2.99}
      - {x: 4.25, y: -2.77}
      - {x: 4.25, y: -2.74}
      - {x: 4.23, y: -2.72}
      - {x: 3.84, y: -2.72}
      - {x: 3.78, y: -2.75}
      - {x: 3.6599998, y: -2.6599998}
      - {x: 3.58, y: -2.6299999}
      - {x: 3.28, y: -2.58}
      - {x: 2.8999999, y: -2.5}
      - {x: 2.6, y: -2.27}
      - {x: 2.62, y: -2.2}
      - {x: 2.6399999, y: -2.09}
      - {x: 3.4399998, y: -2.09}
      - {x: 3.46, y: -2.07}
      - {x: 3.46, y: -1.22}
      - {x: 3.4399998, y: -1.1999999}
      - {x: 3.4199998, y: -1.2099999}
      - {x: 2.6399999, y: -1.2099999}
      - {x: 2.6299999, y: -1.16}
      - {x: 2.62, y: -1.1}
      - {x: 2.6, y: -1.0799999}
      - {x: 2.18, y: -1.0799999}
      - {x: 2.1599998, y: -1.1}
      - {x: 2.1499999, y: -1.0699999}
      - {x: 2.1299999, y: -1.05}
      - {x: 1.99, y: -1.05}
      - {x: 1.99, y: -0.62}
      - {x: 2.4199998, y: -0.62}
      - {x: 2.44, y: -0.64}
      - {x: 2.69, y: -0.64}
      - {x: 2.83, y: -0.59999996}
      - {x: 2.87, y: -0.62}
      - {x: 3.07, y: -0.71}
      - {x: 3.37, y: -0.82}
      - {x: 3.3999999, y: -0.83}
      - {x: 4.5699997, y: -0.83}
      - {x: 4.5699997, y: -0.65999997}
      - {x: 4.46, y: -0.59}
      - {x: 4.2, y: -0.47}
      - {x: 4.0499997, y: -0.47}
      - {x: 3.98, y: -0.39999998}
      - {x: 3.56, y: -0.07}
      - {x: 3.29, y: -0.07}
      - {x: 3.55, y: 0.08}
      - {x: 3.6799998, y: 0.17999999}
      - {x: 3.82, y: 0.29}
      - {x: 4.02, y: 0.45}
      - {x: 4.0499997, y: 0.48}
      - {x: 4.21, y: 0.47}
      - {x: 4.37, y: 0.55}
      - {x: 4.5699997, y: 0.68}
      - {x: 4.5699997, y: 0.84}
      - {x: 3.4099998, y: 0.84}
      - {x: 3.33, y: 0.81}
      - {x: 2.8899999, y: 0.63}
      - {x: 2.79, y: 0.61}
      - {x: 2.6799998, y: 0.65999997}
      - {x: 2.44, y: 0.65}
      - {x: 2.4199998, y: 0.63}
      - {x: 1.99, y: 0.63}
      - {x: 2.1299999, y: 1.06}
      - {x: 2.1499999, y: 1.0799999}
      - {x: 2.18, y: 1.09}
      - {x: 2.6, y: 1.09}
      - {x: 2.62, y: 1.11}
      - {x: 2.6399999, y: 1.22}
      - {x: 3.4199998, y: 1.22}
      - {x: 3.4399998, y: 1.2099999}
      - {x: 3.46, y: 1.23}
      - {x: 3.46, y: 2.08}
      - {x: 3.4399998, y: 2.1}
      - {x: 2.6399999, y: 2.1}
      - {x: 2.6299999, y: 2.1499999}
      - {x: 2.62, y: 2.21}
      - {x: 2.6, y: 2.23}
      - {x: 2.59, y: 2.27}
      - {x: 2.76, y: 2.3999999}
      - {x: 2.85, y: 2.48}
      - {x: 2.9299998, y: 2.51}
      - {x: 3.1999998, y: 2.56}
      - {x: 3.6, y: 2.6499999}
      - {x: 3.6399999, y: 2.6599998}
      - {x: 3.77, y: 2.76}
      - {x: 3.86, y: 2.72}
      - {x: 4.23, y: 2.72}
      - {x: 4.25, y: 2.74}
      - {x: 4.25, y: 2.77}
      - {x: 4.16, y: 2.9399998}
      - {x: 3.99, y: 3.26}
      - {x: 3.9099998, y: 3.3999999}
      - {x: 4.23, y: 3.3999999}
      - {x: 4.25, y: 3.4099998}
      - {x: 4.24, y: 3.47}
      - {x: 3.98, y: 3.6}
      - {x: 3.87, y: 3.6499999}
      - {x: 3.78, y: 3.6499999}
      - {x: 3.6299999, y: 3.6399999}
      - {x: 3.62, y: 3.6499999}
      - {x: 3.26, y: 3.6499999}
      - {x: 3.25, y: 3.6399999}
      - {x: 2.5, y: 3.6399999}
      - {x: 2.49, y: 3.6499999}
      - {x: 2.46, y: 3.6399999}
      - {x: 2.46, y: 3.47}
      - {x: 2.5, y: 3.4299998}
      - {x: 2.49, y: 3.3899999}
      - {x: 2.19, y: 3.31}
      - {x: 2, y: 3.25}
      - {x: 1.8299999, y: 3.1899998}
      - {x: 1.54, y: 3.11}
      - {x: 1.3199999, y: 3.04}
      - {x: 0.78999996, y: 2.87}
      - {x: 0.42, y: 2.76}
      - {x: 0.29999998, y: 2.72}
      - {x: 0.25, y: 2.6799998}
      - {x: 0.21, y: 2.61}
      - {x: 0.089999996, y: 2.61}
      - {x: -0.099999994, y: 2.59}
      - {x: -0.17999999, y: 2.58}
      - {x: -0.22, y: 2.55}
      - {x: -0.22999999, y: 2.46}
      - {x: -0.14999999, y: 2.4099998}
      - {x: -0.089999996, y: 2.4199998}
      - {x: 0.25, y: 2.33}
      - {x: 0.04, y: 2.1499999}
      - {x: -0.22, y: 1.92}
      - {x: -0.5, y: 1.6899999}
      - {x: -0.98999995, y: 1.52}
      - {x: -1.24, y: 1.4399999}
      - {x: -1.77, y: 1.26}
      - {x: -2.37, y: 1.06}
      - {x: -2.7, y: 0.96}
      - {x: -2.8799999, y: 0.89}
      - {x: -2.9099998, y: 0.85999995}
      - {x: -2.9099998, y: 0.56}
      - {x: -3.24, y: 0.56}
      - {x: -3.32, y: 0.55}
      - {x: -4.0899997, y: 0.42}
      - {x: -4.43, y: 0.35}
      - {x: -4.45, y: 0.32999998}
      - {x: -4.5, y: 0.12}
      - {x: -4.5699997, y: 0.099999994}
      - {x: -4.5699997, y: 0.03}
      - {x: -4.5099998, y: -0.02}
      - {x: -4.5699997, y: -0.02}
      - {x: -4.5699997, y: -0.089999996}
      - {x: -4.45, y: -0.17}
      - {x: -4.45, y: -0.32}
      - {x: -4.44, y: -0.34}
      - {x: -4.17, y: -0.39}
      - {x: -3.6799998, y: -0.48}
      - {x: -3.34, y: -0.53999996}
      - {x: -3.22, y: -0.56}
      - {x: -2.8899999, y: -0.88}
      - {x: -0.58, y: -1.65}
      - {x: -0.45, y: -1.74}
      - {x: -0.29999998, y: -1.8499999}
      - {x: 0.14, y: -2.23}
      - {x: 0.21, y: -2.29}
      - {x: 0.25, y: -2.32}
      - {x: 0.25, y: -2.4099998}
      - {x: -0.12, y: -2.4099998}
      - {x: -0.22999999, y: -2.45}
      - {x: -0.22999999, y: -2.56}
      - {x: -0.13, y: -2.6}
      - {x: 0.06, y: -2.6}
      - {x: 0.24, y: -2.62}
      - {x: 0.26, y: -2.71}
      - {x: 0.58, y: -2.8}
      - {x: 0.68, y: -2.83}
      - {x: 1.26, y: -3.01}
      - {x: 2.28, y: -3.32}
      - {x: 2.3799999, y: -3.35}
      - {x: 2.48, y: -3.4299998}
      - {x: 2.46, y: -3.46}
      - {x: 2.46, y: -3.62}
      - {x: 2.48, y: -3.6399999}
      - {x: 3.26, y: -3.6399999}
      - {x: 3.27, y: -3.6499999}
      - {x: 3.61, y: -3.6499999}
      - {x: 3.62, y: -3.6399999}
      - {x: 3.85, y: -3.6399999}
      - {x: 4.0699997, y: -3.55}
    - - {x: 0.96999997, y: -0.77}
      - {x: 1.18, y: -0.77}
      - {x: 1.16, y: -1.02}
      - {x: 0.97999996, y: -1.05}
    - - {x: 0.97999996, y: 1.06}
      - {x: 1.16, y: 1.03}
      - {x: 1.18, y: 0.78}
      - {x: 0.96999997, y: 0.78}
--- !u!1 &7736610799417874287
GameObject:
  m_ObjectHideFlags: 0
  m_CorrespondingSourceObject: {fileID: 0}
  m_PrefabInstance: {fileID: 0}
  m_PrefabAsset: {fileID: 0}
  serializedVersion: 6
  m_Component:
  - component: {fileID: 5038672399491289882}
  - component: {fileID: 7769573314809223289}
  - component: {fileID: 8029564283762611800}
  m_Layer: 0
  m_Name: 2DFighterMinigun (1)
  m_TagString: Untagged
  m_Icon: {fileID: 0}
  m_NavMeshLayer: 0
  m_StaticEditorFlags: 0
  m_IsActive: 1
--- !u!4 &5038672399491289882
Transform:
  m_ObjectHideFlags: 0
  m_CorrespondingSourceObject: {fileID: 0}
  m_PrefabInstance: {fileID: 0}
  m_PrefabAsset: {fileID: 0}
  m_GameObject: {fileID: 7736610799417874287}
  m_LocalRotation: {x: -0, y: -0, z: -0, w: 1}
  m_LocalPosition: {x: -0.704, y: 3.301, z: 0}
  m_LocalScale: {x: 0.3, y: 0.3, z: 0.3}
  m_ConstrainProportionsScale: 0
  m_Children: []
  m_Father: {fileID: 1931631127413958988}
  m_RootOrder: 2
  m_LocalEulerAnglesHint: {x: 0, y: 0, z: 0}
--- !u!212 &7769573314809223289
SpriteRenderer:
  m_ObjectHideFlags: 0
  m_CorrespondingSourceObject: {fileID: 0}
  m_PrefabInstance: {fileID: 0}
  m_PrefabAsset: {fileID: 0}
  m_GameObject: {fileID: 7736610799417874287}
  m_Enabled: 1
  m_CastShadows: 0
  m_ReceiveShadows: 0
  m_DynamicOccludee: 1
  m_StaticShadowCaster: 0
  m_MotionVectors: 1
  m_LightProbeUsage: 1
  m_ReflectionProbeUsage: 1
  m_RayTracingMode: 0
  m_RayTraceProcedural: 0
  m_RenderingLayerMask: 4294967295
  m_RendererPriority: 0
  m_Materials:
  - {fileID: 10754, guid: 0000000000000000f000000000000000, type: 0}
  m_StaticBatchInfo:
    firstSubMesh: 0
    subMeshCount: 0
  m_StaticBatchRoot: {fileID: 0}
  m_ProbeAnchor: {fileID: 0}
  m_LightProbeVolumeOverride: {fileID: 0}
  m_ScaleInLightmap: 1
  m_ReceiveGI: 1
  m_PreserveUVs: 0
  m_IgnoreNormalsForChartDetection: 0
  m_ImportantGI: 0
  m_StitchLightmapSeams: 0
  m_SelectedEditorRenderState: 0
  m_MinimumChartSize: 4
  m_AutoUVMaxDistance: 0.5
  m_AutoUVMaxAngle: 89
  m_LightmapParameters: {fileID: 0}
  m_SortingLayerID: -1651907423
  m_SortingLayer: 0
  m_SortingOrder: 1
  m_Sprite: {fileID: 21300004, guid: 23a10fa0df1140746adb7bda3d420aba, type: 3}
  m_Color: {r: 1, g: 1, b: 1, a: 1}
  m_FlipX: 0
  m_FlipY: 0
  m_DrawMode: 0
  m_Size: {x: 0.84, y: 2.97}
  m_AdaptiveModeThreshold: 0.5
  m_SpriteTileMode: 0
  m_WasSpriteAssigned: 1
  m_MaskInteraction: 0
  m_SpriteSortPoint: 0
--- !u!60 &8029564283762611800
PolygonCollider2D:
  m_ObjectHideFlags: 0
  m_CorrespondingSourceObject: {fileID: 0}
  m_PrefabInstance: {fileID: 0}
  m_PrefabAsset: {fileID: 0}
  m_GameObject: {fileID: 7736610799417874287}
  m_Enabled: 1
  m_Density: 1
  m_Material: {fileID: 0}
  m_IsTrigger: 0
  m_UsedByEffector: 0
  m_UsedByComposite: 0
  m_Offset: {x: 0, y: 0}
  m_SpriteTilingProperty:
    border: {x: 0, y: 0, z: 0, w: 0}
    pivot: {x: 0.5, y: 0.5}
    oldSize: {x: 0.84, y: 2.97}
    newSize: {x: 0.84, y: 2.97}
    adaptiveTilingThreshold: 0.5
    drawMode: 0
    adaptiveTiling: 0
  m_AutoTiling: 0
  m_Points:
    m_Paths:
    - - {x: 0.26999998, y: -0.435}
      - {x: 0.24, y: -0.39499998}
      - {x: 0.24, y: 0.53499997}
      - {x: 0.26999998, y: 0.78499997}
      - {x: 0.28, y: 1.4449999}
      - {x: 0.22999999, y: 1.485}
      - {x: -0.29999998, y: 1.485}
      - {x: -0.35, y: 1.435}
      - {x: -0.35, y: 0.91499996}
      - {x: -0.32999998, y: 0.775}
      - {x: -0.29999998, y: 0.72499996}
      - {x: -0.29999998, y: -0.375}
      - {x: -0.32999998, y: -0.445}
      - {x: -0.31, y: -0.755}
      - {x: -0.42, y: -0.755}
      - {x: -0.42, y: -1.485}
      - {x: 0.42, y: -1.485}
      - {x: 0.42, y: -0.755}
      - {x: 0.22999999, y: -0.755}
    - - {x: -0.03, y: -0.475}
      - {x: -0.04, y: -0.475}
      - {x: -0.04, y: -0.745}
      - {x: -0.03, y: -0.745}
    - - {x: -0.03, y: 0.73499995}
      - {x: -0.04, y: 0.73499995}
      - {x: -0.04, y: -0.405}
      - {x: -0.03, y: -0.405}
    - - {x: -0.03, y: 0.885}
      - {x: -0.04, y: 0.885}
      - {x: -0.04, y: 0.815}
      - {x: -0.03, y: 0.815}
    - - {x: -0.03, y: 0.995}
      - {x: -0.04, y: 0.955}
      - {x: -0.03, y: 0.945}
