%YAML 1.1
%TAG !u! tag:unity3d.com,2011:
--- !u!1001 &4864405161694726949
PrefabInstance:
  m_ObjectHideFlags: 0
  serializedVersion: 2
  m_Modification:
    m_TransformParent: {fileID: 0}
    m_Modifications:
    - target: {fileID: -8679921383154817045, guid: d88a74a97d0f366469b55f31f0a8e47d, type: 3}
      propertyPath: m_RootOrder
      value: 0
      objectReference: {fileID: 0}
    - target: {fileID: -8679921383154817045, guid: d88a74a97d0f366469b55f31f0a8e47d, type: 3}
      propertyPath: m_LocalScale.x
      value: 1
      objectReference: {fileID: 0}
    - target: {fileID: -8679921383154817045, guid: d88a74a97d0f366469b55f31f0a8e47d, type: 3}
      propertyPath: m_LocalScale.y
      value: 1
      objectReference: {fileID: 0}
    - target: {fileID: -8679921383154817045, guid: d88a74a97d0f366469b55f31f0a8e47d, type: 3}
      propertyPath: m_LocalScale.z
      value: 1
      objectReference: {fileID: 0}
    - target: {fileID: -8679921383154817045, guid: d88a74a97d0f366469b55f31f0a8e47d, type: 3}
      propertyPath: m_LocalPosition.x
      value: 44.94
      objectReference: {fileID: 0}
    - target: {fileID: -8679921383154817045, guid: d88a74a97d0f366469b55f31f0a8e47d, type: 3}
      propertyPath: m_LocalPosition.y
      value: -88.42
      objectReference: {fileID: 0}
    - target: {fileID: -8679921383154817045, guid: d88a74a97d0f366469b55f31f0a8e47d, type: 3}
      propertyPath: m_LocalPosition.z
      value: -24.059135
      objectReference: {fileID: 0}
    - target: {fileID: -8679921383154817045, guid: d88a74a97d0f366469b55f31f0a8e47d, type: 3}
      propertyPath: m_LocalRotation.w
      value: 1
      objectReference: {fileID: 0}
    - target: {fileID: -8679921383154817045, guid: d88a74a97d0f366469b55f31f0a8e47d, type: 3}
      propertyPath: m_LocalRotation.x
      value: 0
      objectReference: {fileID: 0}
    - target: {fileID: -8679921383154817045, guid: d88a74a97d0f366469b55f31f0a8e47d, type: 3}
      propertyPath: m_LocalRotation.y
      value: 0
      objectReference: {fileID: 0}
    - target: {fileID: -8679921383154817045, guid: d88a74a97d0f366469b55f31f0a8e47d, type: 3}
      propertyPath: m_LocalRotation.z
      value: 0
      objectReference: {fileID: 0}
    - target: {fileID: -8679921383154817045, guid: d88a74a97d0f366469b55f31f0a8e47d, type: 3}
      propertyPath: m_LocalEulerAnglesHint.x
      value: 0
      objectReference: {fileID: 0}
    - target: {fileID: -8679921383154817045, guid: d88a74a97d0f366469b55f31f0a8e47d, type: 3}
      propertyPath: m_LocalEulerAnglesHint.y
      value: 0
      objectReference: {fileID: 0}
    - target: {fileID: -8679921383154817045, guid: d88a74a97d0f366469b55f31f0a8e47d, type: 3}
      propertyPath: m_LocalEulerAnglesHint.z
      value: 0
      objectReference: {fileID: 0}
    - target: {fileID: -8679921383154817045, guid: d88a74a97d0f366469b55f31f0a8e47d, type: 3}
      propertyPath: m_ConstrainProportionsScale
      value: 1
      objectReference: {fileID: 0}
    - target: {fileID: -6103789669358629360, guid: d88a74a97d0f366469b55f31f0a8e47d, type: 3}
      propertyPath: m_Materials.Array.data[0]
      value: 
      objectReference: {fileID: 2100000, guid: bc60ee6153398c64ebbaff8d53b879f3, type: 2}
    - target: {fileID: 919132149155446097, guid: d88a74a97d0f366469b55f31f0a8e47d, type: 3}
      propertyPath: m_Name
      value: FungusProp2 Variant
      objectReference: {fileID: 0}
    - target: {fileID: 2445111037122107674, guid: d88a74a97d0f366469b55f31f0a8e47d, type: 3}
      propertyPath: m_Materials.Array.data[0]
      value: 
      objectReference: {fileID: 2100000, guid: 8709caa8476f1014fad112a57fc83c34, type: 2}
    - target: {fileID: 6957343825518969172, guid: d88a74a97d0f366469b55f31f0a8e47d, type: 3}
      propertyPath: m_Materials.Array.data[0]
      value: 
      objectReference: {fileID: 2100000, guid: 65a4c4dbf96013d4487d4ce64da44bde, type: 2}
    - target: {fileID: 8392755584030326768, guid: d88a74a97d0f366469b55f31f0a8e47d, type: 3}
      propertyPath: m_Materials.Array.data[0]
      value: 
      objectReference: {fileID: 2100000, guid: ea8bf89f15cc2f2438efe33e2ea2a991, type: 2}
    m_RemovedComponents: []
  m_SourcePrefab: {fileID: 100100000, guid: d88a74a97d0f366469b55f31f0a8e47d, type: 3}
