{
  "images" : [
    {
      "idiom" : "universal",
      "filename" : "img-fire-alert@x1.png.png",
      "scale" : "1x"
    },
    {
      "idiom" : "universal",
      "filename" : "img-fire-alert@x2.png.png",
      "scale" : "2x"
    },
    {
      "idiom" : "universal",
      "filename" : "img-fire-alert@x3.png.png",
      "scale" : "3x"
    }
  ],
  "info" : {
    "version" : 1,
    "author" : "xcode"
  }
}