$ 1 0.000005 0.22070718156067046 57 5 43
R 624 -16 624 -48 0 0 40 5 0 0 0.5
R 336 -128 336 -160 0 0 40 5 0 0 0.5
g 624 224 624 272 0
174 336 -128 336 -80 0 10000 0.9554000000000001 Resistance
g 336 -64 336 -48 0
w 352 -96 368 -96 0
f 560 80 624 80 32 1.5 0.02
f 560 144 624 144 32 1.5 0.02
w 368 -96 368 -48 0
w 624 64 624 16 0
w 624 96 624 128 0
r 624 -16 624 16 0 1000
r 432 -144 432 -112 0 1000
w 432 -112 480 -112 0
f 368 -96 432 -96 32 1.5 0.02
R 432 -144 432 -176 0 0 40 5 0 0 0.5
g 432 -80 432 -64 0
g 432 80 432 96 0
R 432 16 432 -16 0 0 40 5 0 0 0.5
f 368 64 432 64 32 1.5 0.02
w 432 48 480 48 0
r 432 16 432 48 0 1000
w 368 64 368 112 0
w 352 64 368 64 0
g 336 96 336 112 0
174 336 32 336 80 0 10000 0.9554000000000001 Resistance
R 336 32 336 0 0 0 40 5 0 0 0.5
g 432 240 432 256 0
R 432 176 432 144 0 0 40 5 0 0 0.5
f 368 224 432 224 32 1.5 0.02
w 432 208 480 208 0
r 432 176 432 208 0 1000
w 368 224 368 272 0
w 352 224 368 224 0
g 336 256 336 272 0
174 336 192 336 240 0 10000 0.9356000000000001 Resistance
R 336 192 336 160 0 0 40 5 0 0 0.5
207 480 48 496 16 4 /B
207 560 144 544 112 4 /B
207 480 -112 496 -144 4 /A
207 560 80 544 48 4 /A
207 368 -96 384 -128 4 A
207 368 64 384 32 4 B
207 480 208 496 176 4 /C
207 368 224 384 192 4 C
207 560 208 544 176 4 C
w 624 160 624 192 0
f 560 208 624 208 32 1.5 0.02
f 800 208 864 208 32 1.5 0.02
w 864 160 864 192 0
207 800 208 784 176 4 /C
207 800 80 784 48 4 /A
207 800 144 784 112 4 B
w 864 96 864 128 0
w 864 64 864 16 0
f 800 144 864 144 32 1.5 0.02
f 800 80 864 80 32 1.5 0.02
g 864 224 864 272 0
f 1056 208 1120 208 32 1.5 0.02
w 1120 160 1120 192 0
207 1056 208 1040 176 4 /C
207 1056 80 1040 48 4 A
207 1056 144 1040 112 4 /B
w 1120 96 1120 128 0
w 1120 64 1120 16 0
f 1056 144 1120 144 32 1.5 0.02
f 1056 80 1120 80 32 1.5 0.02
g 1120 224 1120 272 0
f 1312 208 1376 208 32 1.5 0.02
w 1376 160 1376 192 0
207 1312 208 1296 176 4 C
207 1312 80 1296 48 4 A
207 1312 144 1296 112 4 B
w 1376 96 1376 128 0
w 1376 64 1376 16 0
f 1312 144 1376 144 32 1.5 0.02
f 1312 80 1376 80 32 1.5 0.02
g 1376 224 1376 272 0
207 1488 48 1504 16 4 AND4
g 1440 80 1440 96 0
R 1440 16 1440 -16 0 0 40 5 0 0 0.5
f 1376 64 1440 64 32 1.5 0.02
w 1440 48 1488 48 0
r 1440 16 1440 48 0 1000
r 688 16 688 48 0 1000
w 688 48 736 48 0
f 624 64 688 64 32 1.5 0.02
R 688 16 688 -16 0 0 40 5 0 0 0.5
g 688 80 688 96 0
207 736 48 752 16 4 AND1
r 928 16 928 48 0 1000
w 928 48 976 48 0
f 864 64 928 64 32 1.5 0.02
R 928 16 928 -16 0 0 40 5 0 0 0.5
g 928 80 928 96 0
207 976 48 992 16 4 AND2
r 1184 16 1184 48 0 1000
w 1184 48 1232 48 0
f 1120 64 1184 64 32 1.5 0.02
R 1184 16 1184 -16 0 0 40 5 0 0 0.5
g 1184 80 1184 96 0
207 1232 48 1248 16 4 AND3
r 864 -16 864 16 0 1000
R 864 -16 864 -48 0 0 40 5 0 0 0.5
r 1120 -16 1120 16 0 1000
R 1120 -16 1120 -48 0 0 40 5 0 0 0.5
r 1376 -16 1376 16 0 1000
R 1376 -16 1376 -48 0 0 40 5 0 0 0.5
w 832 -144 832 -192 0
g 832 -112 832 -96 0
f 768 -128 832 -128 32 1.5 0.02
207 768 -128 752 -160 4 AND1
w 832 -192 944 -192 0
w 1056 -192 1168 -192 0
w 944 -192 1056 -192 0
207 880 -128 864 -160 4 AND2
f 880 -128 944 -128 32 1.5 0.02
g 944 -112 944 -96 0
w 944 -144 944 -192 0
w 1056 -144 1056 -192 0
g 1056 -112 1056 -96 0
f 992 -128 1056 -128 32 1.5 0.02
207 992 -128 976 -160 4 AND3
207 1104 -128 1088 -160 4 AND4
w 1168 -144 1168 -192 0
f 1104 -128 1168 -128 32 1.5 0.02
g 1168 -112 1168 -96 0
207 1280 -160 1296 -192 4 SUM
g 1232 -128 1232 -112 0
R 1232 -192 1232 -224 0 0 40 5 0 0 0.5
f 1168 -144 1232 -144 32 1.5 0.02
w 1232 -160 1280 -160 0
r 1232 -192 1232 -160 0 1000
r 1168 -224 1168 -192 0 1000
R 1168 -224 1168 -256 0 0 40 5 0 0 0.5
R 1168 336 1168 304 0 0 40 5 0 0 0.5
r 1168 336 1168 368 0 1000
r 1232 368 1232 400 0 1000
w 1232 400 1280 400 0
f 1168 416 1232 416 32 1.5 0.02
R 1232 368 1232 336 0 0 40 5 0 0 0.5
g 1232 432 1232 448 0
207 1280 400 1296 368 4 CARRY
g 1168 448 1168 464 0
f 1104 432 1168 432 32 1.5 0.02
w 1168 416 1168 368 0
207 1104 432 1088 400 4 AND8
207 992 432 976 400 4 AND7
f 992 432 1056 432 32 1.5 0.02
g 1056 448 1056 464 0
w 1056 416 1056 368 0
w 944 416 944 368 0
g 944 448 944 464 0
f 880 432 944 432 32 1.5 0.02
207 880 432 864 400 4 AND6
w 944 368 1056 368 0
w 1056 368 1168 368 0
w 832 368 944 368 0
207 768 432 752 400 4 AND5
f 768 432 832 432 32 1.5 0.02
g 832 448 832 464 0
w 832 416 832 368 0
R 1376 544 1376 512 0 0 40 5 0 0 0.5
r 1376 544 1376 576 0 1000
R 1120 544 1120 512 0 0 40 5 0 0 0.5
r 1120 544 1120 576 0 1000
R 864 544 864 512 0 0 40 5 0 0 0.5
r 864 544 864 576 0 1000
207 1232 608 1248 576 4 AND7
g 1184 640 1184 656 0
R 1184 576 1184 544 0 0 40 5 0 0 0.5
f 1120 624 1184 624 32 1.5 0.02
w 1184 608 1232 608 0
r 1184 576 1184 608 0 1000
207 976 608 992 576 4 AND6
g 928 640 928 656 0
R 928 576 928 544 0 0 40 5 0 0 0.5
f 864 624 928 624 32 1.5 0.02
w 928 608 976 608 0
r 928 576 928 608 0 1000
207 736 608 752 576 4 AND5
g 688 640 688 656 0
R 688 576 688 544 0 0 40 5 0 0 0.5
f 624 624 688 624 32 1.5 0.02
w 688 608 736 608 0
r 688 576 688 608 0 1000
r 1440 576 1440 608 0 1000
w 1440 608 1488 608 0
f 1376 624 1440 624 32 1.5 0.02
R 1440 576 1440 544 0 0 40 5 0 0 0.5
g 1440 640 1440 656 0
207 1488 608 1504 576 4 AND8
g 1376 784 1376 832 0
f 1312 640 1376 640 32 1.5 0.02
f 1312 704 1376 704 32 1.5 0.02
w 1376 624 1376 576 0
w 1376 656 1376 688 0
207 1312 704 1296 672 4 B
207 1312 640 1296 608 4 A
207 1312 768 1296 736 4 C
w 1376 720 1376 752 0
f 1312 768 1376 768 32 1.5 0.02
g 1120 784 1120 832 0
f 1056 640 1120 640 32 1.5 0.02
f 1056 704 1120 704 32 1.5 0.02
w 1120 624 1120 576 0
w 1120 656 1120 688 0
207 1056 704 1040 672 4 B
207 1056 640 1040 608 4 A
207 1056 768 1040 736 4 /C
w 1120 720 1120 752 0
f 1056 768 1120 768 32 1.5 0.02
g 864 784 864 832 0
f 800 640 864 640 32 1.5 0.02
f 800 704 864 704 32 1.5 0.02
w 864 624 864 576 0
w 864 656 864 688 0
207 800 704 784 672 4 B
207 800 640 784 608 4 /A
207 800 768 784 736 4 C
w 864 720 864 752 0
f 800 768 864 768 32 1.5 0.02
f 560 768 624 768 32 1.5 0.02
w 624 720 624 752 0
207 560 768 544 736 4 C
207 560 640 544 608 4 A
207 560 704 544 672 4 /B
r 624 544 624 576 0 1000
w 624 656 624 688 0
w 624 624 624 576 0
f 560 704 624 704 32 1.5 0.02
f 560 640 624 640 32 1.5 0.02
g 624 784 624 832 0
R 624 544 624 512 0 0 40 5 0 0 0.5
