[gd_scene load_steps=3 format=3 uid="uid://buqvp7imulv3l"]

[ext_resource type="PackedScene" uid="uid://b1o7bp6qepas1" path="res://Assets/Prefab/Blocs/Plateforme_Petite.tscn" id="1_26itj"]
[ext_resource type="PackedScene" uid="uid://b8w0aaicpyn63" path="res://Assets/Prefab/Blocs/Plateforme.tscn" id="2_1wosj"]

[node name="Terrain_07_Joueur_01" type="Node2D"]

[node name="Plateforme" parent="." instance=ExtResource("1_26itj")]
position = Vector2(101, 166)

[node name="Plateforme_2" parent="." instance=ExtResource("2_1wosj")]
position = Vector2(355, 390)

[node name="Plateforme_3" parent="." instance=ExtResource("2_1wosj")]
position = Vector2(355, 503)
