[gd_scene load_steps=4 format=3 uid="uid://do7hmwpfcups"]

[ext_resource type="Texture2D" uid="uid://wptay64p1t1h" path="res://Assets/Sprites/Tireur/Tireur_Corps.png" id="1_wckln"]
[ext_resource type="PackedScene" uid="uid://b0ahry73t1af1" path="res://Assets/Prefabs/Bloc Action/Tireur_Bloc_Action.tscn" id="2_vbqnl"]

[sub_resource type="RectangleShape2D" id="RectangleShape2D_d1g0y"]
size = Vector2(68, 68)

[node name="Tireur" type="Node2D"]

[node name="RigidBody2D" type="RigidBody2D" parent="."]
collision_layer = 17
collision_mask = 17

[node name="Tireur" parent="RigidBody2D" instance=ExtResource("2_vbqnl")]
position = Vector2(56, 0)

[node name="Tireur_Sprite" type="Sprite2D" parent="RigidBody2D"]
position = Vector2(2, -11)
scale = Vector2(0.3, 0.3)
texture = ExtResource("1_wckln")

[node name="CollisionShape2D" type="CollisionShape2D" parent="RigidBody2D"]
shape = SubResource("RectangleShape2D_d1g0y")
