[gd_scene load_steps=4 format=3 uid="uid://ju122xtvlp2l"]

[ext_resource type="Texture2D" uid="uid://c1vt8vgbhc51o" path="res://Assets/Sprites/OLD/PieceORond/Orond.png" id="1_c5ps3"]
[ext_resource type="Script" path="res://Scripts/Pouvoirs/Balle_Classique.gd" id="1_qypr7"]

[sub_resource type="CircleShape2D" id="CircleShape2D_7fjpq"]
radius = 14.0

[node name="Balle_Classique" type="Node2D"]
script = ExtResource("1_qypr7")

[node name="Balle_RigidBody" type="RigidBody2D" parent="."]
collision_layer = 5
collision_mask = 5
max_contacts_reported = 2
contact_monitor = true

[node name="Balle_Sprite" type="Sprite2D" parent="Balle_RigidBody"]
scale = Vector2(0.2, 0.2)
texture = ExtResource("1_c5ps3")

[node name="CollisionShape2D" type="CollisionShape2D" parent="Balle_RigidBody"]
shape = SubResource("CircleShape2D_7fjpq")
