[gd_scene load_steps=6 format=3 uid="uid://pxovi81w5p51"]

[ext_resource type="Script" path="res://Scripts/Personnages/Miroir_Manager.gd" id="1_etgii"]
[ext_resource type="Texture2D" uid="uid://y66vr2emrilj" path="res://Assets/Sprites/Miroir/Miroir.png" id="2_wsj78"]

[sub_resource type="PhysicsMaterial" id="PhysicsMaterial_6w8uy"]
bounce = 1.0

[sub_resource type="RectangleShape2D" id="RectangleShape2D_d1g0y"]
size = Vector2(100.409, 21.2132)

[sub_resource type="RectangleShape2D" id="RectangleShape2D_y2hgi"]
size = Vector2(106.773, 30.4056)

[node name="Miroir" type="Node2D" node_paths=PackedStringArray("area2D")]
script = ExtResource("1_etgii")
area2D = NodePath("RigidBody2D/Area2D")

[node name="RigidBody2D" type="StaticBody2D" parent="."]
collision_layer = 20
collision_mask = 20
physics_material_override = SubResource("PhysicsMaterial_6w8uy")

[node name="Miroir_Sprite" type="Sprite2D" parent="RigidBody2D"]
position = Vector2(2, -11)
scale = Vector2(0.3, 0.3)
texture = ExtResource("2_wsj78")

[node name="CollisionShape2D" type="CollisionShape2D" parent="RigidBody2D"]
position = Vector2(-3, -1)
rotation = 0.785398
shape = SubResource("RectangleShape2D_d1g0y")

[node name="Area2D" type="Area2D" parent="RigidBody2D"]
collision_layer = 4
collision_mask = 4

[node name="CollisionShape2D2" type="CollisionShape2D" parent="RigidBody2D/Area2D"]
position = Vector2(-2.5, -1)
rotation = 0.785398
shape = SubResource("RectangleShape2D_y2hgi")
